cxf-notifications mailing list archives

Site index · List index
Message view « Date » · « Thread »
Top « Date » · « Thread »
From Apache Jenkins Server <jenk...@builds.apache.org>
Subject Build failed in Jenkins: CXF-Master-Analysis #1585
Date Thu, 24 Oct 2019 11:42:35 GMT
See <https://builds.apache.org/job/CXF-Master-Analysis/1585/display/redirect?page=changes>

Changes:

[coheigea] Disable external DTD/Schemas in the WadlGenerator


------------------------------------------
Started by an SCM change
Started by an SCM change
Started by an SCM change
Running as SYSTEM
[EnvInject] - Loading node environment variables.
Building remotely on H28 (ubuntu) in workspace <https://builds.apache.org/job/CXF-Master-Analysis/ws/>
No credentials specified
Cloning the remote Git repository
Cloning repository https://gitbox.apache.org/repos/asf/cxf.git
 > git init <https://builds.apache.org/job/CXF-Master-Analysis/ws/> # timeout=10
Fetching upstream changes from https://gitbox.apache.org/repos/asf/cxf.git
 > git --version # timeout=10
 > git fetch --tags --progress -- https://gitbox.apache.org/repos/asf/cxf.git +refs/heads/*:refs/remotes/origin/*
 > git config remote.origin.url https://gitbox.apache.org/repos/asf/cxf.git # timeout=10
 > git config --add remote.origin.fetch +refs/heads/*:refs/remotes/origin/* # timeout=10
 > git config remote.origin.url https://gitbox.apache.org/repos/asf/cxf.git # timeout=10
Fetching upstream changes from https://gitbox.apache.org/repos/asf/cxf.git
 > git fetch --tags --progress -- https://gitbox.apache.org/repos/asf/cxf.git +refs/heads/*:refs/remotes/origin/*
 > git rev-parse refs/remotes/origin/master^{commit} # timeout=10
 > git rev-parse refs/remotes/origin/origin/master^{commit} # timeout=10
Checking out Revision 165c0b1c461bc7c9cd645614d49fce21881b5cfe (refs/remotes/origin/master)
 > git config core.sparsecheckout # timeout=10
 > git checkout -f 165c0b1c461bc7c9cd645614d49fce21881b5cfe
Commit message: "Disable external DTD/Schemas in the WadlGenerator"
 > git rev-list --no-walk 8f93152ae86c2d24b95ed9ce5599e6f5453091bc # timeout=10
Injecting SonarQube environment variables using the configuration: ASF Sonar Analysis
Parsing POMs
Downloaded artifact https://repo.maven.apache.org/maven2/org/springframework/boot/spring-boot-dependencies/2.1.3.RELEASE/spring-boot-dependencies-2.1.3.RELEASE.pom
Downloaded artifact https://repo.maven.apache.org/maven2/io/netty/netty-bom/4.1.33.Final/netty-bom-4.1.33.Final.pom
Downloaded artifact https://repo.maven.apache.org/maven2/io/projectreactor/reactor-bom/Californium-SR5/reactor-bom-Californium-SR5.pom
Downloaded artifact https://repo.maven.apache.org/maven2/org/eclipse/jetty/jetty-bom/9.4.14.v20181114/jetty-bom-9.4.14.v20181114.pom
Downloaded artifact https://repo.maven.apache.org/maven2/org/springframework/spring-framework-bom/5.1.5.RELEASE/spring-framework-bom-5.1.5.RELEASE.pom
Downloaded artifact https://repo.maven.apache.org/maven2/org/springframework/data/spring-data-releasetrain/Lovelace-SR5/spring-data-releasetrain-Lovelace-SR5.pom
Downloaded artifact https://repo.maven.apache.org/maven2/org/springframework/data/build/spring-data-build/2.1.5.RELEASE/spring-data-build-2.1.5.RELEASE.pom
Downloaded artifact https://repo.maven.apache.org/maven2/org/springframework/integration/spring-integration-bom/5.1.3.RELEASE/spring-integration-bom-5.1.3.RELEASE.pom
Downloaded artifact https://repo.maven.apache.org/maven2/org/springframework/security/spring-security-bom/5.1.4.RELEASE/spring-security-bom-5.1.4.RELEASE.pom
Downloaded artifact https://repo.maven.apache.org/maven2/org/springframework/session/spring-session-bom/Bean-SR3/spring-session-bom-Bean-SR3.pom
Downloaded artifact https://repo.maven.apache.org/maven2/org/springframework/cloud/spring-cloud-netflix/2.0.2.RELEASE/spring-cloud-netflix-2.0.2.RELEASE.pom
Downloaded artifact https://repo.maven.apache.org/maven2/org/springframework/cloud/spring-cloud-build/2.0.4.RELEASE/spring-cloud-build-2.0.4.RELEASE.pom
Downloaded artifact https://repo.maven.apache.org/maven2/org/springframework/cloud/spring-cloud-netflix-dependencies/2.0.2.RELEASE/spring-cloud-netflix-dependencies-2.0.2.RELEASE.pom
Downloaded artifact https://repo.maven.apache.org/maven2/org/springframework/cloud/spring-cloud-dependencies-parent/2.0.4.RELEASE/spring-cloud-dependencies-parent-2.0.4.RELEASE.pom
Downloaded artifact https://repo.maven.apache.org/maven2/org/springframework/cloud/spring-cloud-commons-dependencies/2.0.2.RELEASE/spring-cloud-commons-dependencies-2.0.2.RELEASE.pom
Downloaded artifact https://repo.maven.apache.org/maven2/org/springframework/cloud/spring-cloud-config-dependencies/2.0.2.RELEASE/spring-cloud-config-dependencies-2.0.2.RELEASE.pom
Downloaded artifact https://repo.maven.apache.org/maven2/org/springframework/cloud/spring-cloud-stream-dependencies/Elmhurst.SR1/spring-cloud-stream-dependencies-Elmhurst.SR1.pom
Downloaded artifact https://repo.maven.apache.org/maven2/org/springframework/cloud/spring-cloud-dependencies-parent/2.0.2.RELEASE/spring-cloud-dependencies-parent-2.0.2.RELEASE.pom
Downloaded artifact https://repo.maven.apache.org/maven2/org/springframework/cloud/spring-cloud-contract-dependencies/1.2.4.RELEASE/spring-cloud-contract-dependencies-1.2.4.RELEASE.pom
Downloaded artifact https://repo.maven.apache.org/maven2/org/springframework/cloud/spring-cloud-dependencies-parent/1.3.8.RELEASE/spring-cloud-dependencies-parent-1.3.8.RELEASE.pom
Downloaded artifact https://repo.maven.apache.org/maven2/org/springframework/cloud/spring-cloud-build-dependencies/2.0.4.RELEASE/spring-cloud-build-dependencies-2.0.4.RELEASE.pom
Downloaded artifact https://repo.maven.apache.org/maven2/org/springframework/boot/spring-boot-dependencies/2.0.6.RELEASE/spring-boot-dependencies-2.0.6.RELEASE.pom
Downloaded artifact https://repo.maven.apache.org/maven2/io/netty/netty-bom/4.1.29.Final/netty-bom-4.1.29.Final.pom
Downloaded artifact https://repo.maven.apache.org/maven2/io/projectreactor/reactor-bom/Bismuth-SR12/reactor-bom-Bismuth-SR12.pom
Downloaded artifact https://repo.maven.apache.org/maven2/org/apache/logging/log4j/log4j-bom/2.10.0/log4j-bom-2.10.0.pom
Downloaded artifact https://repo.maven.apache.org/maven2/org/eclipse/jetty/jetty-bom/9.4.12.v20180830/jetty-bom-9.4.12.v20180830.pom
Downloaded artifact https://repo.maven.apache.org/maven2/org/springframework/spring-framework-bom/5.0.10.RELEASE/spring-framework-bom-5.0.10.RELEASE.pom
Downloaded artifact https://repo.maven.apache.org/maven2/org/springframework/data/spring-data-releasetrain/Kay-SR11/spring-data-releasetrain-Kay-SR11.pom
Downloaded artifact https://repo.maven.apache.org/maven2/org/springframework/data/build/spring-data-build/2.0.11.RELEASE/spring-data-build-2.0.11.RELEASE.pom
Downloaded artifact https://repo.maven.apache.org/maven2/org/springframework/integration/spring-integration-bom/5.0.9.RELEASE/spring-integration-bom-5.0.9.RELEASE.pom
Downloaded artifact https://repo.maven.apache.org/maven2/org/springframework/security/spring-security-bom/5.0.9.RELEASE/spring-security-bom-5.0.9.RELEASE.pom
Downloaded artifact https://repo.maven.apache.org/maven2/org/springframework/session/spring-session-bom/Apple-SR6/spring-session-bom-Apple-SR6.pom
Downloaded artifact https://repo.maven.apache.org/maven2/org/apache/camel/camel-spring-boot-dependencies/2.24.0/camel-spring-boot-dependencies-2.24.0.pom
Downloaded artifact https://repo.maven.apache.org/maven2/org/apache/camel/camel-spring-boot-dm/2.24.0/camel-spring-boot-dm-2.24.0.pom
Downloaded artifact https://repo.maven.apache.org/maven2/org/apache/camel/spring-boot/2.24.0/spring-boot-2.24.0.pom
WARN: Unable to locate 'report-task.txt' in the workspace. Did the SonarScanner succeeded?
ERROR: Failed to parse POMs
hudson.remoting.ProxyException: hudson.maven.MavenModuleSetBuild$MavenExecutionException:
org.apache.maven.project.ProjectBuildingException: Some problems were encountered while processing
the POMs:
[FATAL] Non-resolvable parent POM for org.apache.cxf.samples:ws_transaction:[unknown-version]:
Could not find artifact org.apache.cxf.samples:cxf-samples:pom:3.3.3-SNAPSHOT and 'parent.relativePath'
points at wrong local POM @ line 25, column 13

	at hudson.maven.MavenModuleSetBuild$PomParser.invoke(MavenModuleSetBuild.java:1390)
	at hudson.maven.MavenModuleSetBuild$PomParser.invoke(MavenModuleSetBuild.java:1126)
	at hudson.FilePath$FileCallableWrapper.call(FilePath.java:3052)
	at hudson.remoting.UserRequest.perform(UserRequest.java:212)
	at hudson.remoting.UserRequest.perform(UserRequest.java:54)
	at hudson.remoting.Request$2.run(Request.java:369)
	at hudson.remoting.InterceptingExecutorService$1.call(InterceptingExecutorService.java:72)
	at java.util.concurrent.FutureTask.run(FutureTask.java:266)
	at java.util.concurrent.ThreadPoolExecutor.runWorker(ThreadPoolExecutor.java:1149)
	at java.util.concurrent.ThreadPoolExecutor$Worker.run(ThreadPoolExecutor.java:624)
	at java.lang.Thread.run(Thread.java:748)
	Suppressed: hudson.remoting.Channel$CallSiteStackTrace: Remote call to H28
		at hudson.remoting.Channel.attachCallSiteStackTrace(Channel.java:1743)
		at hudson.remoting.UserRequest$ExceptionResponse.retrieve(UserRequest.java:357)
		at hudson.remoting.Channel.call(Channel.java:957)
		at hudson.FilePath.act(FilePath.java:1072)
		at hudson.FilePath.act(FilePath.java:1061)
		at hudson.maven.MavenModuleSetBuild$MavenModuleSetBuildExecution.parsePoms(MavenModuleSetBuild.java:987)
		at hudson.maven.MavenModuleSetBuild$MavenModuleSetBuildExecution.doRun(MavenModuleSetBuild.java:691)
		at hudson.model.AbstractBuild$AbstractBuildExecution.run(AbstractBuild.java:504)
		at hudson.model.Run.execute(Run.java:1815)
		at hudson.maven.MavenModuleSetBuild.run(MavenModuleSetBuild.java:543)
		at hudson.model.ResourceController.execute(ResourceController.java:97)
		at hudson.model.Executor.run(Executor.java:429)
Caused by: hudson.remoting.ProxyException: org.apache.maven.project.ProjectBuildingException:
Some problems were encountered while processing the POMs:
[FATAL] Non-resolvable parent POM for org.apache.cxf.samples:ws_transaction:[unknown-version]:
Could not find artifact org.apache.cxf.samples:cxf-samples:pom:3.3.3-SNAPSHOT and 'parent.relativePath'
points at wrong local POM @ line 25, column 13

	at org.apache.maven.project.DefaultProjectBuilder.build(DefaultProjectBuilder.java:383)
	at hudson.maven.MavenEmbedder.buildProjects(MavenEmbedder.java:370)
	at hudson.maven.MavenEmbedder.readProjects(MavenEmbedder.java:340)
	at hudson.maven.MavenModuleSetBuild$PomParser.invoke(MavenModuleSetBuild.java:1329)
	... 10 more

Mime
View raw message