db-torque-dev mailing list archives

Site index · List index
Message view « Date » · « Thread »
Top « Date » · « Thread »
From Apache Jenkins Server <jenk...@builds.apache.org>
Subject Build failed in Jenkins: Torque4-trunk #581
Date Thu, 16 Aug 2018 09:34:25 GMT
See <https://builds.apache.org/job/Torque4-trunk/581/display/redirect?page=changes>

Changes:

[tv] Use try-with-resources where applicable
Replace StringBuffer with StringBuilder

------------------------------------------
[...truncated 211.60 KB...]
Tests run: 4, Failures: 0, Errors: 0, Skipped: 0, Time elapsed: 0.035 sec - in org.apache.torque.util.functions.SumTest
Running org.apache.torque.util.functions.AggregateFunctionTest
Tests run: 12, Failures: 0, Errors: 0, Skipped: 0, Time elapsed: 0.035 sec - in org.apache.torque.util.functions.AggregateFunctionTest
Running org.apache.torque.util.functions.AbstractFunctionTest
Tests run: 11, Failures: 0, Errors: 0, Skipped: 0, Time elapsed: 0.042 sec - in org.apache.torque.util.functions.AbstractFunctionTest
Running org.apache.torque.criteria.CriteriaTest
Tests run: 33, Failures: 0, Errors: 0, Skipped: 0, Time elapsed: 0.356 sec - in org.apache.torque.criteria.CriteriaTest
Running org.apache.torque.criteria.JoinTest
Tests run: 2, Failures: 0, Errors: 0, Skipped: 0, Time elapsed: 0.149 sec - in org.apache.torque.criteria.JoinTest
Running org.apache.torque.criteria.CriterionTest
Tests run: 10, Failures: 0, Errors: 0, Skipped: 0, Time elapsed: 0.153 sec - in org.apache.torque.criteria.CriterionTest
Running org.apache.torque.ColumnImplTest
Tests run: 41, Failures: 0, Errors: 0, Skipped: 0, Time elapsed: 0.225 sec - in org.apache.torque.ColumnImplTest
Running org.apache.torque.adapter.DBOracleTest
Tests run: 1, Failures: 0, Errors: 0, Skipped: 0, Time elapsed: 0.045 sec - in org.apache.torque.adapter.DBOracleTest
Running org.apache.torque.manager.MethodResultCacheTest
Aug 16, 2018 9:33:38 AM org.apache.commons.jcs.engine.control.CompositeCacheManager getInstance
INFO: Instance is null, creating with config [/cache.ccf]
Aug 16, 2018 9:33:38 AM org.apache.commons.jcs.engine.control.CompositeCacheManager configure
INFO: Creating cache manager from config file: /cache.ccf
Aug 16, 2018 9:33:38 AM org.apache.commons.jcs.utils.threadpool.ThreadPoolManager loadConfig
INFO: thread_pool.default PoolConfiguration = useBoundary = [false] boundarySize = [2000]
maximumPoolSize = [150] minimumPoolSize = [4] keepAliveTime = [300000] whenBlockedPolicy =
[RUN] startUpSize = [4]
Aug 16, 2018 9:33:38 AM org.apache.commons.jcs.engine.control.CompositeCacheManager doConfigure
INFO: Setting default auxiliaries to 
Aug 16, 2018 9:33:38 AM org.apache.commons.jcs.engine.control.CompositeCacheManager doConfigure
INFO: setting defaultCompositeCacheAttributes to [ useLateral = true, useRemote = true, useDisk
= true, maxObjs = 1000, maxSpoolPerRun = -1, diskUsagePattern = SWAP, spoolChunkSize = 2 ]
Aug 16, 2018 9:33:38 AM org.apache.commons.jcs.engine.control.CompositeCacheConfigurator parseElementAttributes
INFO: No special ElementAttribute class defined for key [jcs.default.elementattributes], using
default class.
Aug 16, 2018 9:33:38 AM org.apache.commons.jcs.engine.control.CompositeCacheManager doConfigure
INFO: setting defaultElementAttributes to [ IS_LATERAL = true, IS_SPOOL = true, IS_REMOTE
= true, IS_ETERNAL = true, MaxLifeSeconds = -1, IdleTime = -1, CreateTime = 1534412018259,
LastAccessTime = 1534412018259, getTimeToLiveSeconds() = -1, createTime = 1534412018259 ]
Aug 16, 2018 9:33:38 AM org.apache.commons.jcs.engine.control.CompositeCacheConfigurator parseElementAttributes
INFO: No special ElementAttribute class defined for key [jcs.region.testCache1.elementattributes],
using default class.
Aug 16, 2018 9:33:38 AM org.apache.commons.jcs.engine.memory.AbstractDoubleLinkedListMemoryCache
initialize
INFO: initialized MemoryCache for testCache1
Aug 16, 2018 9:33:38 AM org.apache.commons.jcs.engine.control.CompositeCache <init>
INFO: Constructed cache with name [testCache1] and cache attributes [ useLateral = true, useRemote
= true, useDisk = true, maxObjs = 1000, maxSpoolPerRun = -1, diskUsagePattern = SWAP, spoolChunkSize
= 2 ]
Aug 16, 2018 9:33:38 AM org.apache.commons.jcs.engine.control.CompositeCacheConfigurator parseRegions
INFO: Parsed regions [testCache1]
Aug 16, 2018 9:33:38 AM org.apache.commons.jcs.engine.control.CompositeCacheManager doConfigure
INFO: Finished configuration in 40 ms.
Tests run: 3, Failures: 0, Errors: 0, Skipped: 0, Time elapsed: 0.323 sec - in org.apache.torque.manager.MethodResultCacheTest
Aug 16, 2018 9:33:38 AM org.apache.commons.jcs.engine.control.CompositeCacheManager run
INFO: Shutdown hook activated.  Shutdown was not called.  Shutting down JCS.
Running org.apache.torque.manager.AbstractBaseManagerTest
Aug 16, 2018 9:33:38 AM org.apache.commons.jcs.engine.control.CompositeCacheManager getInstance
INFO: Instance is null, creating with config [/cache.ccf]
Aug 16, 2018 9:33:39 AM org.apache.commons.jcs.engine.control.CompositeCacheManager configure
INFO: Creating cache manager from config file: /cache.ccf
Aug 16, 2018 9:33:39 AM org.apache.commons.jcs.utils.threadpool.ThreadPoolManager loadConfig
INFO: thread_pool.default PoolConfiguration = useBoundary = [false] boundarySize = [2000]
maximumPoolSize = [150] minimumPoolSize = [4] keepAliveTime = [300000] whenBlockedPolicy =
[RUN] startUpSize = [4]
Aug 16, 2018 9:33:39 AM org.apache.commons.jcs.engine.control.CompositeCacheManager doConfigure
INFO: Setting default auxiliaries to 
Aug 16, 2018 9:33:39 AM org.apache.commons.jcs.engine.control.CompositeCacheManager doConfigure
INFO: setting defaultCompositeCacheAttributes to [ useLateral = true, useRemote = true, useDisk
= true, maxObjs = 1000, maxSpoolPerRun = -1, diskUsagePattern = SWAP, spoolChunkSize = 2 ]
Aug 16, 2018 9:33:39 AM org.apache.commons.jcs.engine.control.CompositeCacheConfigurator parseElementAttributes
INFO: No special ElementAttribute class defined for key [jcs.default.elementattributes], using
default class.
Aug 16, 2018 9:33:39 AM org.apache.commons.jcs.engine.control.CompositeCacheManager doConfigure
INFO: setting defaultElementAttributes to [ IS_LATERAL = true, IS_SPOOL = true, IS_REMOTE
= true, IS_ETERNAL = true, MaxLifeSeconds = -1, IdleTime = -1, CreateTime = 1534412019122,
LastAccessTime = 1534412019122, getTimeToLiveSeconds() = -1, createTime = 1534412019122 ]
Aug 16, 2018 9:33:39 AM org.apache.commons.jcs.engine.control.CompositeCacheConfigurator parseElementAttributes
INFO: No special ElementAttribute class defined for key [jcs.region.testCache1.elementattributes],
using default class.
Aug 16, 2018 9:33:39 AM org.apache.commons.jcs.engine.memory.AbstractDoubleLinkedListMemoryCache
initialize
INFO: initialized MemoryCache for testCache1
Aug 16, 2018 9:33:39 AM org.apache.commons.jcs.engine.control.CompositeCache <init>
INFO: Constructed cache with name [testCache1] and cache attributes [ useLateral = true, useRemote
= true, useDisk = true, maxObjs = 1000, maxSpoolPerRun = -1, diskUsagePattern = SWAP, spoolChunkSize
= 2 ]
Aug 16, 2018 9:33:39 AM org.apache.commons.jcs.engine.control.CompositeCacheConfigurator parseRegions
INFO: Parsed regions [testCache1]
Aug 16, 2018 9:33:39 AM org.apache.commons.jcs.engine.control.CompositeCacheManager doConfigure
INFO: Finished configuration in 40 ms.
Tests run: 9, Failures: 0, Errors: 0, Skipped: 0, Time elapsed: 0.326 sec - in org.apache.torque.manager.AbstractBaseManagerTest
Aug 16, 2018 9:33:39 AM org.apache.commons.jcs.engine.control.CompositeCacheManager run
INFO: Shutdown hook activated.  Shutdown was not called.  Shutting down JCS.

Results :

Tests run: 365, Failures: 0, Errors: 0, Skipped: 0

[JENKINS] Recording test results
[WARNING] Attempt to (de-)serialize anonymous class hudson.maven.reporters.SurefireArchiver$2;
see: https://jenkins.io/redirect/serialization-of-anonymous-classes/
[WARNING] Attempt to (de-)serialize anonymous class hudson.maven.reporters.BuildInfoRecorder$1;
see: https://jenkins.io/redirect/serialization-of-anonymous-classes/
[INFO] 
[INFO] --- maven-jar-plugin:3.0.0:jar (default-jar) @ torque-runtime ---
[INFO] Building jar: <https://builds.apache.org/job/Torque4-trunk/ws/torque4-trunk/torque-runtime/target/torque-runtime-4.1-SNAPSHOT.jar>
[INFO] 
[INFO] --- maven-site-plugin:3.5.1:attach-descriptor (attach-descriptor) @ torque-runtime
---
[INFO] 
[INFO] --- maven-source-plugin:3.0.0:jar-no-fork (attach-sources) @ torque-runtime ---
[INFO] Building jar: <https://builds.apache.org/job/Torque4-trunk/ws/torque4-trunk/torque-runtime/target/torque-runtime-4.1-SNAPSHOT-sources.jar>
[INFO] 
[INFO] --- apache-rat-plugin:0.11:check (default) @ torque-runtime ---
[INFO] 51 implicit excludes (use -debug for more details).
[INFO] Exclude: velocity.log
[INFO] Exclude: .checkstyle
[INFO] Exclude: checkstyle-cache.ccf
[INFO] Exclude: derby.log
[INFO] Exclude: LICENSE-EDL.txt
[INFO] Exclude: DEPENDENCIES
[INFO] Exclude: torque-test/target/**/*
[INFO] Exclude: torque-test/.classpath
[INFO] Exclude: torque-test/.project
[INFO] Exclude: torque-test/.settings/**
[INFO] Exclude: torque-test/src/main/generated-java/**/*
[INFO] Exclude: torque-test/derby.log
[INFO] 182 resources included (use -debug for more details)
[INFO] Rat check: Summary of files. Unapproved: 0 unknown: 0 generated: 0 approved: 180 licence.
[CHECKSTYLE] No report found for mojo check
[PMD] No report found for mojo check
[INFO] 
[INFO] --- dependency-check-maven:3.1.2:check (default) @ torque-runtime ---
[INFO] Skipping dependency-check
[CHECKSTYLE] No report found for mojo check
[PMD] No report found for mojo check
[INFO] 
[INFO] --- maven-install-plugin:2.5.2:install (default-install) @ torque-runtime ---
[INFO] Installing <https://builds.apache.org/job/Torque4-trunk/ws/torque4-trunk/torque-runtime/target/torque-runtime-4.1-SNAPSHOT.jar>
to /home/jenkins/jenkins-slave/maven-repositories/1/org/apache/torque/torque-runtime/4.1-SNAPSHOT/torque-runtime-4.1-SNAPSHOT.jar
[INFO] Installing <https://builds.apache.org/job/Torque4-trunk/ws/torque4-trunk/torque-runtime/pom.xml>
to /home/jenkins/jenkins-slave/maven-repositories/1/org/apache/torque/torque-runtime/4.1-SNAPSHOT/torque-runtime-4.1-SNAPSHOT.pom
[INFO] Installing <https://builds.apache.org/job/Torque4-trunk/ws/torque4-trunk/torque-runtime/target/torque-runtime-4.1-SNAPSHOT-sources.jar>
to /home/jenkins/jenkins-slave/maven-repositories/1/org/apache/torque/torque-runtime/4.1-SNAPSHOT/torque-runtime-4.1-SNAPSHOT-sources.jar
[INFO] 
[INFO] >>> cobertura-maven-plugin:2.3:cobertura (default-cli) > [cobertura]test
@ torque-runtime >>>
[INFO] 
[INFO] --- maven-remote-resources-plugin:1.5:process (process-resource-bundles) @ torque-runtime
---
[INFO] 
[INFO] --- maven-resources-plugin:2.7:resources (default-resources) @ torque-runtime ---
[INFO] Using 'ISO-8859-1' encoding to copy filtered resources.
[INFO] skip non existing resourceDirectory <https://builds.apache.org/job/Torque4-trunk/ws/torque4-trunk/torque-runtime/src/main/resources>
[INFO] Copying 3 resources
[INFO] Copying 3 resources
[INFO] 
[INFO] --- maven-compiler-plugin:3.5.1:compile (default-compile) @ torque-runtime ---
[INFO] Nothing to compile - all classes are up to date
[INFO] 
[INFO] --- cobertura-maven-plugin:2.3:instrument (default-cli) @ torque-runtime ---
[INFO] Cobertura 1.9.2 - GNU GPL License (NO WARRANTY) - See COPYRIGHT file
Instrumenting 122 files to <https://builds.apache.org/job/Torque4-trunk/ws/torque4-trunk/torque-runtime/target/generated-classes/cobertura>
Cobertura: Saved information on 122 classes.
Instrument time: 471ms

[INFO] Instrumentation was successful.
[INFO] 
[INFO] --- maven-resources-plugin:2.7:testResources (default-testResources) @ torque-runtime
---
[INFO] Using 'ISO-8859-1' encoding to copy filtered resources.
[INFO] Copying 5 resources
[INFO] Copying 3 resources
[INFO] Copying 3 resources
[INFO] 
[INFO] --- maven-compiler-plugin:3.5.1:testCompile (default-testCompile) @ torque-runtime
---
[INFO] Nothing to compile - all classes are up to date
[INFO] 
[INFO] --- maven-surefire-plugin:2.19.1:test (default-test) @ torque-runtime ---

-------------------------------------------------------
 T E S T S
-------------------------------------------------------

Results :

Tests run: 0, Failures: 0, Errors: 0, Skipped: 0

[JENKINS] Recording test results
[INFO] ------------------------------------------------------------------------
[INFO] Reactor Summary:
[INFO] 
[INFO] Torque Maven Parent 4.1-SNAPSHOT ................... SUCCESS [01:18 min]
[INFO] Torque Runtime ..................................... FAILURE [ 48.854 s]
[INFO] Torque Generator ................................... SKIPPED
[INFO] Torque Templates ................................... SKIPPED
[INFO] Torque Generator Maven 2 Plugin .................... SKIPPED
[INFO] Torque Generator Ant tasks ......................... SKIPPED
[INFO] Torque Site 4.1-SNAPSHOT ........................... SKIPPED
[INFO] ------------------------------------------------------------------------
[INFO] BUILD FAILURE
[INFO] ------------------------------------------------------------------------
[INFO] Total time: 02:25 min
[INFO] Finished at: 2018-08-16T09:34:05Z
[INFO] ------------------------------------------------------------------------
Waiting for Jenkins to finish collecting data
[ERROR] Failed to execute goal org.apache.maven.plugins:maven-surefire-plugin:2.19.1:test
(default-test) on project torque-runtime: Execution default-test of goal org.apache.maven.plugins:maven-surefire-plugin:2.19.1:test
failed: There was an error in the forked process
[ERROR] java.lang.VerifyError:
[ERROR] Expecting a stackmap frame at branch target 107
[ERROR] Exception Details:
[ERROR] Location:
[ERROR] org/apache/torque/manager/AbstractBaseManager.dispose()V @32: ifnull
[ERROR] Reason:
[ERROR] Expected stackmap frame at this location.
[ERROR] Bytecode:
[ERROR] 0x0000000: 033c 11ff ff3d b800 2e12 30b6 0034 1101
[ERROR] 0x0000010: 17b6 003a 2ab4 00c0 1101 173c 1100 003d
[ERROR] 0x0000020: c600 4b1b 1101 17a0 001c 1c11 0000 a000
[ERROR] 0x0000030: 15b8 002e 1230 b600 341b 1c04 b600 9c11
[ERROR] 0x0000040: ffff 3db8 002e 1230 b600 3411 0119 b600
[ERROR] 0x0000050: 3a2a b400 c0b6 00d3 b800 2e12 30b6 0034
[ERROR] 0x0000060: 1101 1ab6 003a 2a01 b500 c01c 9b00 15b8
[ERROR] 0x0000070: 002e 1230 b600 341b 1c03 b600 9c11 ffff
[ERROR] 0x0000080: 3db8 002e 1230 b600 3411 011d b600 3a2a
[ERROR] 0x0000090: b400 d511 011d 3c11 0000 3dc6 004b 1b11
[ERROR] 0x00000a0: 011d a000 1c1c 1100 00a0 0015 b800 2e12
[ERROR] 0x00000b0: 30b6 0034 1b1c 04b6 009c 11ff ff3d b800
[ERROR] 0x00000c0: 2e12 30b6 0034 1101 1fb6 003a 2ab4 00d5
[ERROR] 0x00000d0: b600 d8b8 002e 1230 b600 3411 0120 b600
[ERROR] 0x00000e0: 3a2a 01b5 00d5 1c9b 0015 b800 2e12 30b6
[ERROR] 0x00000f0: 0034 1b1c 03b6 009c 11ff ff3d b800 2e12
[ERROR] 0x0000100: 30b6 0034 1101 23b6 003a 2ab4 0043 b600
[ERROR] 0x0000110: d9b8 002e 1230 b600 3411 0124 b600 3a2a
[ERROR] 0x0000120: b400 48b9 00dc 0100 b800 2e12 30b6 0034
[ERROR] 0x0000130: 1101 25b6 003a b1
[ERROR] Stackmap Table:
[ERROR] same_frame_extended(@143)
[ERROR] same_frame_extended(@266)
[ERROR] 
[ERROR] at java.lang.Class.getDeclaredMethods0(Native Method)
[ERROR] at java.lang.Class.privateGetDeclaredMethods(Class.java:2701)
[ERROR] at java.lang.Class.privateGetMethodRecursive(Class.java:3048)
[ERROR] at java.lang.Class.getMethod0(Class.java:3018)
[ERROR] at java.lang.Class.getMethod(Class.java:1784)
[ERROR] at org.apache.maven.surefire.util.ReflectionUtils.tryGetMethod(ReflectionUtils.java:61)
[ERROR] at org.apache.maven.surefire.common.junit3.JUnit3TestChecker.isSuiteOnly(JUnit3TestChecker.java:64)
[ERROR] at org.apache.maven.surefire.common.junit3.JUnit3TestChecker.isValidJUnit3Test(JUnit3TestChecker.java:59)
[ERROR] at org.apache.maven.surefire.common.junit3.JUnit3TestChecker.accept(JUnit3TestChecker.java:54)
[ERROR] at org.apache.maven.surefire.common.junit4.JUnit4TestChecker.accept(JUnit4TestChecker.java:52)
[ERROR] at org.apache.maven.surefire.util.DefaultScanResult.applyFilter(DefaultScanResult.java:98)
[ERROR] at org.apache.maven.surefire.junit4.JUnit4Provider.scanClassPath(JUnit4Provider.java:311)
[ERROR] at org.apache.maven.surefire.junit4.JUnit4Provider.setTestsToRun(JUnit4Provider.java:191)
[ERROR] at org.apache.maven.surefire.junit4.JUnit4Provider.invoke(JUnit4Provider.java:134)
[ERROR] at org.apache.maven.surefire.booter.ForkedBooter.invokeProviderInSameClassLoader(ForkedBooter.java:290)
[ERROR] at org.apache.maven.surefire.booter.ForkedBooter.runSuitesInProcess(ForkedBooter.java:242)
[ERROR] at org.apache.maven.surefire.booter.ForkedBooter.main(ForkedBooter.java:121)
[ERROR] -> [Help 1]
[ERROR] 
[ERROR] To see the full stack trace of the errors, re-run Maven with the -e switch.
[ERROR] Re-run Maven using the -X switch to enable full debug logging.
[ERROR] 
[ERROR] For more information about the errors and possible solutions, please read the following
articles:
[ERROR] [Help 1] http://cwiki.apache.org/confluence/display/MAVEN/PluginExecutionException
[ERROR] 
[ERROR] After correcting the problems, you can resume the build with the command
[ERROR]   mvn <goals> -rf :torque-runtime
[JENKINS] Archiving <https://builds.apache.org/job/Torque4-trunk/ws/torque4-trunk/torque-maven-plugin/pom.xml>
to org.apache.torque/torque-maven-plugin/4.1-SNAPSHOT/torque-maven-plugin-4.1-SNAPSHOT.pom
[JENKINS] Archiving <https://builds.apache.org/job/Torque4-trunk/ws/torque4-trunk/pom.xml>
to org.apache.torque/torque/4.1-SNAPSHOT/torque-4.1-SNAPSHOT.pom
<https://builds.apache.org/job/Torque4-trunk/ws/torque4-trunk/pom.xml> is not inside
<https://builds.apache.org/job/Torque4-trunk/ws/torque4-trunk/torque4-trunk/;> will
archive in a separate pass
[JENKINS] Archiving <https://builds.apache.org/job/Torque4-trunk/ws/torque4-trunk/torque-site/pom.xml>
to org.apache.torque/torque-site/4.1-SNAPSHOT/torque-site-4.1-SNAPSHOT.pom
[JENKINS] Archiving <https://builds.apache.org/job/Torque4-trunk/ws/torque4-trunk/torque-generator/pom.xml>
to org.apache.torque/torque-generator/4.1-SNAPSHOT/torque-generator-4.1-SNAPSHOT.pom
[JENKINS] Archiving <https://builds.apache.org/job/Torque4-trunk/ws/torque4-trunk/torque-templates/pom.xml>
to org.apache.torque/torque-templates/4.1-SNAPSHOT/torque-templates-4.1-SNAPSHOT.pom
[JENKINS] Archiving <https://builds.apache.org/job/Torque4-trunk/ws/torque4-trunk/torque-runtime/pom.xml>
to org.apache.torque/torque-runtime/4.1-SNAPSHOT/torque-runtime-4.1-SNAPSHOT.pom
[JENKINS] Archiving <https://builds.apache.org/job/Torque4-trunk/ws/torque4-trunk/torque-runtime/target/torque-runtime-4.1-SNAPSHOT.jar>
to org.apache.torque/torque-runtime/4.1-SNAPSHOT/torque-runtime-4.1-SNAPSHOT.jar
[JENKINS] Archiving <https://builds.apache.org/job/Torque4-trunk/ws/torque4-trunk/torque-runtime/target/torque-runtime-4.1-SNAPSHOT-sources.jar>
to org.apache.torque/torque-runtime/4.1-SNAPSHOT/torque-runtime-4.1-SNAPSHOT-sources.jar
[JENKINS] Archiving <https://builds.apache.org/job/Torque4-trunk/ws/torque4-trunk/torque-ant-tasks/pom.xml>
to org.apache.torque/torque-ant-tasks/4.1-SNAPSHOT/torque-ant-tasks-4.1-SNAPSHOT.pom
Sending e-mails to: torque-dev@db.apache.org
channel stopped
[Cobertura] Publishing Cobertura coverage report...


---------------------------------------------------------------------
To unsubscribe, e-mail: torque-dev-unsubscribe@db.apache.org
For additional commands, e-mail: torque-dev-help@db.apache.org


Mime
View raw message