db-torque-dev mailing list archives

Site index · List index
Message view « Date » · « Thread »
Top « Date » · « Thread »
From Apache Jenkins Server <jenk...@builds.apache.org>
Subject Build failed in Jenkins: torque4-test-project-hsqldb » Torque Test Project #359
Date Thu, 03 Jan 2019 16:41:13 GMT
See <https://builds.apache.org/job/torque4-test-project-hsqldb/org.apache.torque$torque-test/359/display/redirect>

------------------------------------------
[INFO] 
[INFO] -------------------< org.apache.torque:torque-test >--------------------
[INFO] Building Torque Test Project 4.1-SNAPSHOT                          [8/8]
[INFO] --------------------------------[ jar ]---------------------------------
[INFO] Downloading from central: https://repo.maven.apache.org/maven2/org/codehaus/mojo/sql-maven-plugin/1.4/sql-maven-plugin-1.4.pom
[INFO] Downloaded from central: https://repo.maven.apache.org/maven2/org/codehaus/mojo/sql-maven-plugin/1.4/sql-maven-plugin-1.4.pom
(5.9 kB at 296 kB/s)
[INFO] Downloading from central: https://repo.maven.apache.org/maven2/org/codehaus/mojo/sql-maven-plugin/1.4/sql-maven-plugin-1.4.jar
[INFO] Downloaded from central: https://repo.maven.apache.org/maven2/org/codehaus/mojo/sql-maven-plugin/1.4/sql-maven-plugin-1.4.jar
(25 kB at 1.5 MB/s)
[INFO] Downloading from central: https://repo.maven.apache.org/maven2/tomcat/naming-common/5.0.28/naming-common-5.0.28.pom
[INFO] Downloaded from central: https://repo.maven.apache.org/maven2/tomcat/naming-common/5.0.28/naming-common-5.0.28.pom
(154 B at 1.9 kB/s)
[INFO] Downloading from central: https://repo.maven.apache.org/maven2/tomcat/naming-java/5.0.28/naming-java-5.0.28.pom
[INFO] Downloaded from central: https://repo.maven.apache.org/maven2/tomcat/naming-java/5.0.28/naming-java-5.0.28.pom
(152 B at 11 kB/s)
[INFO] Downloading from central: https://repo.maven.apache.org/maven2/org/hsqldb/hsqldb/2.2.8/hsqldb-2.2.8.pom
[INFO] Downloaded from central: https://repo.maven.apache.org/maven2/org/hsqldb/hsqldb/2.2.8/hsqldb-2.2.8.pom
(1.1 kB at 74 kB/s)
[INFO] Downloading from central: https://repo.maven.apache.org/maven2/tomcat/naming-common/5.0.28/naming-common-5.0.28.jar
[INFO] Downloading from central: https://repo.maven.apache.org/maven2/tomcat/naming-java/5.0.28/naming-java-5.0.28.jar
[INFO] Downloading from central: https://repo.maven.apache.org/maven2/org/hsqldb/hsqldb/2.2.8/hsqldb-2.2.8.jar
[INFO] Downloaded from central: https://repo.maven.apache.org/maven2/tomcat/naming-java/5.0.28/naming-java-5.0.28.jar
(2.1 kB at 114 kB/s)
[INFO] Downloaded from central: https://repo.maven.apache.org/maven2/tomcat/naming-common/5.0.28/naming-common-5.0.28.jar
(28 kB at 314 kB/s)
[INFO] Downloaded from central: https://repo.maven.apache.org/maven2/org/hsqldb/hsqldb/2.2.8/hsqldb-2.2.8.jar
(1.4 MB at 11 MB/s)
[INFO] 
[INFO] --- maven-clean-plugin:3.1.0:clean (default-clean) @ torque-test ---
[INFO] 
[INFO] --- maven-antrun-plugin:1.8:run (clean-generated-sources) @ torque-test ---
[INFO] Executing tasks

main:
     [echo] Deleting directory src/main/generated-java
     [echo] Deleting directory target/torque
[INFO] Executed tasks
[INFO] 
[INFO] --- maven-enforcer-plugin:1.4.1:enforce (enforce-maven-version) @ torque-test ---
[INFO] 
[INFO] --- maven-antrun-plugin:1.8:run (filter-schema) @ torque-test ---
[INFO] Executing tasks

main:
     [copy] Copying 15 files to <https://builds.apache.org/job/torque4-test-project-hsqldb/org.apache.torque$torque-test/ws/target/torque/test/schema>
     [copy] Copying 2 files to <https://builds.apache.org/job/torque4-test-project-hsqldb/org.apache.torque$torque-test/ws/target/torque/test/sql>
[INFO] Executed tasks
[INFO] 
[INFO] --- maven-antrun-plugin:1.8:run (test-database-filled) @ torque-test ---
[INFO] Executing tasks

main:
      [sql] Executing commands
      [sql] Failed to execute:  select count(*) from book
[INFO] An Ant BuildException has occured: java.sql.SQLSyntaxErrorException: user lacks privilege
or object not found: BOOK
around Ant part ...<sql password="" driver="org.hsqldb.jdbcDriver" errorproperty="cannot.access.book.table"
userid="sa" url="jdbc:hsqldb:torque-test/target/sqltest;shutdown=true">select count(*)
from book;</sql>... @ 4:163 in <https://builds.apache.org/job/torque4-test-project-hsqldb/org.apache.torque$torque-test/ws/target/antrun/build-main.xml>
org.apache.tools.ant.BuildException: java.sql.SQLSyntaxErrorException: user lacks privilege
or object not found: BOOK
    at org.apache.tools.ant.taskdefs.SQLExec.execute (SQLExec.java:691)
    at org.apache.tools.ant.UnknownElement.execute (UnknownElement.java:292)
    at sun.reflect.NativeMethodAccessorImpl.invoke0 (Native Method)
    at sun.reflect.NativeMethodAccessorImpl.invoke (NativeMethodAccessorImpl.java:62)
    at sun.reflect.DelegatingMethodAccessorImpl.invoke (DelegatingMethodAccessorImpl.java:43)
    at java.lang.reflect.Method.invoke (Method.java:498)
    at org.apache.tools.ant.dispatch.DispatchUtils.execute (DispatchUtils.java:106)
    at org.apache.tools.ant.Task.perform (Task.java:348)
    at org.apache.tools.ant.Target.execute (Target.java:435)
    at org.apache.tools.ant.Target.performTasks (Target.java:456)
    at org.apache.tools.ant.Project.executeSortedTargets (Project.java:1393)
    at org.apache.tools.ant.Project.executeTarget (Project.java:1364)
    at org.apache.maven.plugin.antrun.AntRunMojo.execute (AntRunMojo.java:313)
    at org.apache.maven.plugin.DefaultBuildPluginManager.executeMojo (DefaultBuildPluginManager.java:137)
    at org.apache.maven.lifecycle.internal.MojoExecutor.execute (MojoExecutor.java:210)
    at org.apache.maven.lifecycle.internal.MojoExecutor.execute (MojoExecutor.java:156)
    at org.apache.maven.lifecycle.internal.MojoExecutor.execute (MojoExecutor.java:148)
    at org.apache.maven.lifecycle.internal.LifecycleModuleBuilder.buildProject (LifecycleModuleBuilder.java:117)
    at org.apache.maven.lifecycle.internal.LifecycleModuleBuilder.buildProject (LifecycleModuleBuilder.java:81)
    at org.apache.maven.lifecycle.internal.builder.singlethreaded.SingleThreadedBuilder.build
(SingleThreadedBuilder.java:56)
    at org.apache.maven.lifecycle.internal.LifecycleStarter.execute (LifecycleStarter.java:128)
    at org.apache.maven.DefaultMaven.doExecute (DefaultMaven.java:305)
    at org.apache.maven.DefaultMaven.doExecute (DefaultMaven.java:192)
    at org.apache.maven.DefaultMaven.execute (DefaultMaven.java:105)
    at org.jvnet.hudson.maven3.launcher.Maven35Launcher.main (Maven35Launcher.java:130)
    at sun.reflect.NativeMethodAccessorImpl.invoke0 (Native Method)
    at sun.reflect.NativeMethodAccessorImpl.invoke (NativeMethodAccessorImpl.java:62)
    at sun.reflect.DelegatingMethodAccessorImpl.invoke (DelegatingMethodAccessorImpl.java:43)
    at java.lang.reflect.Method.invoke (Method.java:498)
    at org.codehaus.plexus.classworlds.launcher.Launcher.launchEnhanced (Launcher.java:289)
    at org.codehaus.plexus.classworlds.launcher.Launcher.launch (Launcher.java:229)
    at jenkins.maven3.agent.Maven35Main.launch (Maven35Main.java:176)
    at sun.reflect.NativeMethodAccessorImpl.invoke0 (Native Method)
    at sun.reflect.NativeMethodAccessorImpl.invoke (NativeMethodAccessorImpl.java:62)
    at sun.reflect.DelegatingMethodAccessorImpl.invoke (DelegatingMethodAccessorImpl.java:43)
    at java.lang.reflect.Method.invoke (Method.java:498)
    at hudson.maven.Maven3Builder.call (Maven3Builder.java:139)
    at hudson.maven.Maven3Builder.call (Maven3Builder.java:70)
    at hudson.remoting.UserRequest.perform (UserRequest.java:212)
    at hudson.remoting.UserRequest.perform (UserRequest.java:54)
    at hudson.remoting.Request$2.run (Request.java:369)
    at hudson.remoting.InterceptingExecutorService$1.call (InterceptingExecutorService.java:72)
    at java.util.concurrent.FutureTask.run (FutureTask.java:266)
    at java.util.concurrent.ThreadPoolExecutor.runWorker (ThreadPoolExecutor.java:1149)
    at java.util.concurrent.ThreadPoolExecutor$Worker.run (ThreadPoolExecutor.java:624)
    at java.lang.Thread.run (Thread.java:748)
Caused by: java.sql.SQLSyntaxErrorException: user lacks privilege or object not found: BOOK
    at org.hsqldb.jdbc.JDBCUtil.sqlException (Unknown Source)
    at org.hsqldb.jdbc.JDBCUtil.sqlException (Unknown Source)
    at org.hsqldb.jdbc.JDBCStatement.fetchResult (Unknown Source)
    at org.hsqldb.jdbc.JDBCStatement.execute (Unknown Source)
    at org.apache.tools.ant.taskdefs.SQLExec.execSQL (SQLExec.java:794)
    at org.apache.tools.ant.taskdefs.SQLExec.runStatements (SQLExec.java:764)
    at org.apache.tools.ant.taskdefs.SQLExec$Transaction.runTransaction (SQLExec.java:1062)
    at org.apache.tools.ant.taskdefs.SQLExec$Transaction.access$000 (SQLExec.java:1004)
    at org.apache.tools.ant.taskdefs.SQLExec.execute (SQLExec.java:672)
    at org.apache.tools.ant.UnknownElement.execute (UnknownElement.java:292)
    at sun.reflect.NativeMethodAccessorImpl.invoke0 (Native Method)
    at sun.reflect.NativeMethodAccessorImpl.invoke (NativeMethodAccessorImpl.java:62)
    at sun.reflect.DelegatingMethodAccessorImpl.invoke (DelegatingMethodAccessorImpl.java:43)
    at java.lang.reflect.Method.invoke (Method.java:498)
    at org.apache.tools.ant.dispatch.DispatchUtils.execute (DispatchUtils.java:106)
    at org.apache.tools.ant.Task.perform (Task.java:348)
    at org.apache.tools.ant.Target.execute (Target.java:435)
    at org.apache.tools.ant.Target.performTasks (Target.java:456)
    at org.apache.tools.ant.Project.executeSortedTargets (Project.java:1393)
    at org.apache.tools.ant.Project.executeTarget (Project.java:1364)
    at org.apache.maven.plugin.antrun.AntRunMojo.execute (AntRunMojo.java:313)
    at org.apache.maven.plugin.DefaultBuildPluginManager.executeMojo (DefaultBuildPluginManager.java:137)
    at org.apache.maven.lifecycle.internal.MojoExecutor.execute (MojoExecutor.java:210)
    at org.apache.maven.lifecycle.internal.MojoExecutor.execute (MojoExecutor.java:156)
    at org.apache.maven.lifecycle.internal.MojoExecutor.execute (MojoExecutor.java:148)
    at org.apache.maven.lifecycle.internal.LifecycleModuleBuilder.buildProject (LifecycleModuleBuilder.java:117)
    at org.apache.maven.lifecycle.internal.LifecycleModuleBuilder.buildProject (LifecycleModuleBuilder.java:81)
    at org.apache.maven.lifecycle.internal.builder.singlethreaded.SingleThreadedBuilder.build
(SingleThreadedBuilder.java:56)
    at org.apache.maven.lifecycle.internal.LifecycleStarter.execute (LifecycleStarter.java:128)
    at org.apache.maven.DefaultMaven.doExecute (DefaultMaven.java:305)
    at org.apache.maven.DefaultMaven.doExecute (DefaultMaven.java:192)
    at org.apache.maven.DefaultMaven.execute (DefaultMaven.java:105)
    at org.jvnet.hudson.maven3.launcher.Maven35Launcher.main (Maven35Launcher.java:130)
    at sun.reflect.NativeMethodAccessorImpl.invoke0 (Native Method)
    at sun.reflect.NativeMethodAccessorImpl.invoke (NativeMethodAccessorImpl.java:62)
    at sun.reflect.DelegatingMethodAccessorImpl.invoke (DelegatingMethodAccessorImpl.java:43)
    at java.lang.reflect.Method.invoke (Method.java:498)
    at org.codehaus.plexus.classworlds.launcher.Launcher.launchEnhanced (Launcher.java:289)
    at org.codehaus.plexus.classworlds.launcher.Launcher.launch (Launcher.java:229)
    at jenkins.maven3.agent.Maven35Main.launch (Maven35Main.java:176)
    at sun.reflect.NativeMethodAccessorImpl.invoke0 (Native Method)
    at sun.reflect.NativeMethodAccessorImpl.invoke (NativeMethodAccessorImpl.java:62)
    at sun.reflect.DelegatingMethodAccessorImpl.invoke (DelegatingMethodAccessorImpl.java:43)
    at java.lang.reflect.Method.invoke (Method.java:498)
    at hudson.maven.Maven3Builder.call (Maven3Builder.java:139)
    at hudson.maven.Maven3Builder.call (Maven3Builder.java:70)
    at hudson.remoting.UserRequest.perform (UserRequest.java:212)
    at hudson.remoting.UserRequest.perform (UserRequest.java:54)
    at hudson.remoting.Request$2.run (Request.java:369)
    at hudson.remoting.InterceptingExecutorService$1.call (InterceptingExecutorService.java:72)
    at java.util.concurrent.FutureTask.run (FutureTask.java:266)
    at java.util.concurrent.ThreadPoolExecutor.runWorker (ThreadPoolExecutor.java:1149)
    at java.util.concurrent.ThreadPoolExecutor$Worker.run (ThreadPoolExecutor.java:624)
    at java.lang.Thread.run (Thread.java:748)
Caused by: org.hsqldb.HsqlException: user lacks privilege or object not found: BOOK
    at org.hsqldb.error.Error.error (Unknown Source)
    at org.hsqldb.error.Error.error (Unknown Source)
    at org.hsqldb.ParserDQL.readTableName (Unknown Source)
    at org.hsqldb.ParserDQL.readTableOrSubquery (Unknown Source)
    at org.hsqldb.ParserDQL.XreadTableReference (Unknown Source)
    at org.hsqldb.ParserDQL.XreadFromClause (Unknown Source)
    at org.hsqldb.ParserDQL.XreadTableExpression (Unknown Source)
    at org.hsqldb.ParserDQL.XreadQuerySpecification (Unknown Source)
    at org.hsqldb.ParserDQL.XreadSimpleTable (Unknown Source)
    at org.hsqldb.ParserDQL.XreadQueryPrimary (Unknown Source)
    at org.hsqldb.ParserDQL.XreadQueryTerm (Unknown Source)
    at org.hsqldb.ParserDQL.XreadQueryExpressionBody (Unknown Source)
    at org.hsqldb.ParserDQL.XreadQueryExpression (Unknown Source)
    at org.hsqldb.ParserDQL.compileCursorSpecification (Unknown Source)
    at org.hsqldb.ParserCommand.compilePart (Unknown Source)
    at org.hsqldb.ParserCommand.compileStatements (Unknown Source)
    at org.hsqldb.Session.executeDirectStatement (Unknown Source)
    at org.hsqldb.Session.execute (Unknown Source)
    at org.hsqldb.jdbc.JDBCStatement.fetchResult (Unknown Source)
    at org.hsqldb.jdbc.JDBCStatement.execute (Unknown Source)
    at org.apache.tools.ant.taskdefs.SQLExec.execSQL (SQLExec.java:794)
    at org.apache.tools.ant.taskdefs.SQLExec.runStatements (SQLExec.java:764)
    at org.apache.tools.ant.taskdefs.SQLExec$Transaction.runTransaction (SQLExec.java:1062)
    at org.apache.tools.ant.taskdefs.SQLExec$Transaction.access$000 (SQLExec.java:1004)
    at org.apache.tools.ant.taskdefs.SQLExec.execute (SQLExec.java:672)
    at org.apache.tools.ant.UnknownElement.execute (UnknownElement.java:292)
    at sun.reflect.NativeMethodAccessorImpl.invoke0 (Native Method)
    at sun.reflect.NativeMethodAccessorImpl.invoke (NativeMethodAccessorImpl.java:62)
    at sun.reflect.DelegatingMethodAccessorImpl.invoke (DelegatingMethodAccessorImpl.java:43)
    at java.lang.reflect.Method.invoke (Method.java:498)
    at org.apache.tools.ant.dispatch.DispatchUtils.execute (DispatchUtils.java:106)
    at org.apache.tools.ant.Task.perform (Task.java:348)
    at org.apache.tools.ant.Target.execute (Target.java:435)
    at org.apache.tools.ant.Target.performTasks (Target.java:456)
    at org.apache.tools.ant.Project.executeSortedTargets (Project.java:1393)
    at org.apache.tools.ant.Project.executeTarget (Project.java:1364)
    at org.apache.maven.plugin.antrun.AntRunMojo.execute (AntRunMojo.java:313)
    at org.apache.maven.plugin.DefaultBuildPluginManager.executeMojo (DefaultBuildPluginManager.java:137)
    at org.apache.maven.lifecycle.internal.MojoExecutor.execute (MojoExecutor.java:210)
    at org.apache.maven.lifecycle.internal.MojoExecutor.execute (MojoExecutor.java:156)
    at org.apache.maven.lifecycle.internal.MojoExecutor.execute (MojoExecutor.java:148)
    at org.apache.maven.lifecycle.internal.LifecycleModuleBuilder.buildProject (LifecycleModuleBuilder.java:117)
    at org.apache.maven.lifecycle.internal.LifecycleModuleBuilder.buildProject (LifecycleModuleBuilder.java:81)
    at org.apache.maven.lifecycle.internal.builder.singlethreaded.SingleThreadedBuilder.build
(SingleThreadedBuilder.java:56)
    at org.apache.maven.lifecycle.internal.LifecycleStarter.execute (LifecycleStarter.java:128)
    at org.apache.maven.DefaultMaven.doExecute (DefaultMaven.java:305)
    at org.apache.maven.DefaultMaven.doExecute (DefaultMaven.java:192)
    at org.apache.maven.DefaultMaven.execute (DefaultMaven.java:105)
    at org.jvnet.hudson.maven3.launcher.Maven35Launcher.main (Maven35Launcher.java:130)
    at sun.reflect.NativeMethodAccessorImpl.invoke0 (Native Method)
    at sun.reflect.NativeMethodAccessorImpl.invoke (NativeMethodAccessorImpl.java:62)
    at sun.reflect.DelegatingMethodAccessorImpl.invoke (DelegatingMethodAccessorImpl.java:43)
    at java.lang.reflect.Method.invoke (Method.java:498)
    at org.codehaus.plexus.classworlds.launcher.Launcher.launchEnhanced (Launcher.java:289)
    at org.codehaus.plexus.classworlds.launcher.Launcher.launch (Launcher.java:229)
    at jenkins.maven3.agent.Maven35Main.launch (Maven35Main.java:176)
    at sun.reflect.NativeMethodAccessorImpl.invoke0 (Native Method)
    at sun.reflect.NativeMethodAccessorImpl.invoke (NativeMethodAccessorImpl.java:62)
    at sun.reflect.DelegatingMethodAccessorImpl.invoke (DelegatingMethodAccessorImpl.java:43)
    at java.lang.reflect.Method.invoke (Method.java:498)
    at hudson.maven.Maven3Builder.call (Maven3Builder.java:139)
    at hudson.maven.Maven3Builder.call (Maven3Builder.java:70)
    at hudson.remoting.UserRequest.perform (UserRequest.java:212)
    at hudson.remoting.UserRequest.perform (UserRequest.java:54)
    at hudson.remoting.Request$2.run (Request.java:369)
    at hudson.remoting.InterceptingExecutorService$1.call (InterceptingExecutorService.java:72)
    at java.util.concurrent.FutureTask.run (FutureTask.java:266)
    at java.util.concurrent.ThreadPoolExecutor.runWorker (ThreadPoolExecutor.java:1149)
    at java.util.concurrent.ThreadPoolExecutor$Worker.run (ThreadPoolExecutor.java:624)
    at java.lang.Thread.run (Thread.java:748)
[INFO] 
[INFO] --- maven-antrun-plugin:1.8:run (shutdown-db-after-test-database) @ torque-test ---
[INFO] Skipping Antrun execution
[INFO] 
[INFO] --- torque-maven-plugin:4.1-SNAPSHOT:generate (generate-sources) @ torque-test ---

---------------------------------------------------------------------
To unsubscribe, e-mail: torque-dev-unsubscribe@db.apache.org
For additional commands, e-mail: torque-dev-help@db.apache.org


Mime
View raw message