db-torque-dev mailing list archives

Site index · List index
Message view « Date » · « Thread »
Top « Date » · « Thread »
From Apache Jenkins Server <jenk...@builds.apache.org>
Subject Build failed in Jenkins: torque4-test-project-hsqldb #359
Date Thu, 03 Jan 2019 16:41:16 GMT
See <https://builds.apache.org/job/torque4-test-project-hsqldb/359/display/redirect?page=changes>

Changes:

[tv] Fix deprecation warnings

[tv] Use computeIfAbsent() --> less code

------------------------------------------
[...truncated 1.39 MB...]
[INFO] --- maven-antrun-plugin:1.8:run (clean-generated-sources) @ torque-test ---
[INFO] Executing tasks

main:
     [echo] Deleting directory src/main/generated-java
     [echo] Deleting directory target/torque
[INFO] Executed tasks
[INFO] 
[INFO] --- maven-enforcer-plugin:1.4.1:enforce (enforce-maven-version) @ torque-test ---
[INFO] 
[INFO] --- maven-antrun-plugin:1.8:run (filter-schema) @ torque-test ---
[INFO] Executing tasks

main:
     [copy] Copying 15 files to <https://builds.apache.org/job/torque4-test-project-hsqldb/ws/torque-test/target/torque/test/schema>
     [copy] Copying 2 files to <https://builds.apache.org/job/torque4-test-project-hsqldb/ws/torque-test/target/torque/test/sql>
[INFO] Executed tasks
[INFO] 
[INFO] --- maven-antrun-plugin:1.8:run (test-database-filled) @ torque-test ---
[INFO] Executing tasks

main:
      [sql] Executing commands
      [sql] Failed to execute:  select count(*) from book
[INFO] An Ant BuildException has occured: java.sql.SQLSyntaxErrorException: user lacks privilege
or object not found: BOOK
around Ant part ...<sql password="" driver="org.hsqldb.jdbcDriver" errorproperty="cannot.access.book.table"
userid="sa" url="jdbc:hsqldb:torque-test/target/sqltest;shutdown=true">select count(*)
from book;</sql>... @ 4:163 in <https://builds.apache.org/job/torque4-test-project-hsqldb/ws/torque-test/target/antrun/build-main.xml>
org.apache.tools.ant.BuildException: java.sql.SQLSyntaxErrorException: user lacks privilege
or object not found: BOOK
    at org.apache.tools.ant.taskdefs.SQLExec.execute (SQLExec.java:691)
    at org.apache.tools.ant.UnknownElement.execute (UnknownElement.java:292)
    at sun.reflect.NativeMethodAccessorImpl.invoke0 (Native Method)
    at sun.reflect.NativeMethodAccessorImpl.invoke (NativeMethodAccessorImpl.java:62)
    at sun.reflect.DelegatingMethodAccessorImpl.invoke (DelegatingMethodAccessorImpl.java:43)
    at java.lang.reflect.Method.invoke (Method.java:498)
    at org.apache.tools.ant.dispatch.DispatchUtils.execute (DispatchUtils.java:106)
    at org.apache.tools.ant.Task.perform (Task.java:348)
    at org.apache.tools.ant.Target.execute (Target.java:435)
    at org.apache.tools.ant.Target.performTasks (Target.java:456)
    at org.apache.tools.ant.Project.executeSortedTargets (Project.java:1393)
    at org.apache.tools.ant.Project.executeTarget (Project.java:1364)
    at org.apache.maven.plugin.antrun.AntRunMojo.execute (AntRunMojo.java:313)
    at org.apache.maven.plugin.DefaultBuildPluginManager.executeMojo (DefaultBuildPluginManager.java:137)
    at org.apache.maven.lifecycle.internal.MojoExecutor.execute (MojoExecutor.java:210)
    at org.apache.maven.lifecycle.internal.MojoExecutor.execute (MojoExecutor.java:156)
    at org.apache.maven.lifecycle.internal.MojoExecutor.execute (MojoExecutor.java:148)
    at org.apache.maven.lifecycle.internal.LifecycleModuleBuilder.buildProject (LifecycleModuleBuilder.java:117)
    at org.apache.maven.lifecycle.internal.LifecycleModuleBuilder.buildProject (LifecycleModuleBuilder.java:81)
    at org.apache.maven.lifecycle.internal.builder.singlethreaded.SingleThreadedBuilder.build
(SingleThreadedBuilder.java:56)
    at org.apache.maven.lifecycle.internal.LifecycleStarter.execute (LifecycleStarter.java:128)
    at org.apache.maven.DefaultMaven.doExecute (DefaultMaven.java:305)
    at org.apache.maven.DefaultMaven.doExecute (DefaultMaven.java:192)
    at org.apache.maven.DefaultMaven.execute (DefaultMaven.java:105)
    at org.jvnet.hudson.maven3.launcher.Maven35Launcher.main (Maven35Launcher.java:130)
    at sun.reflect.NativeMethodAccessorImpl.invoke0 (Native Method)
    at sun.reflect.NativeMethodAccessorImpl.invoke (NativeMethodAccessorImpl.java:62)
    at sun.reflect.DelegatingMethodAccessorImpl.invoke (DelegatingMethodAccessorImpl.java:43)
    at java.lang.reflect.Method.invoke (Method.java:498)
    at org.codehaus.plexus.classworlds.launcher.Launcher.launchEnhanced (Launcher.java:289)
    at org.codehaus.plexus.classworlds.launcher.Launcher.launch (Launcher.java:229)
    at jenkins.maven3.agent.Maven35Main.launch (Maven35Main.java:176)
    at sun.reflect.NativeMethodAccessorImpl.invoke0 (Native Method)
    at sun.reflect.NativeMethodAccessorImpl.invoke (NativeMethodAccessorImpl.java:62)
    at sun.reflect.DelegatingMethodAccessorImpl.invoke (DelegatingMethodAccessorImpl.java:43)
    at java.lang.reflect.Method.invoke (Method.java:498)
    at hudson.maven.Maven3Builder.call (Maven3Builder.java:139)
    at hudson.maven.Maven3Builder.call (Maven3Builder.java:70)
    at hudson.remoting.UserRequest.perform (UserRequest.java:212)
    at hudson.remoting.UserRequest.perform (UserRequest.java:54)
    at hudson.remoting.Request$2.run (Request.java:369)
    at hudson.remoting.InterceptingExecutorService$1.call (InterceptingExecutorService.java:72)
    at java.util.concurrent.FutureTask.run (FutureTask.java:266)
    at java.util.concurrent.ThreadPoolExecutor.runWorker (ThreadPoolExecutor.java:1149)
    at java.util.concurrent.ThreadPoolExecutor$Worker.run (ThreadPoolExecutor.java:624)
    at java.lang.Thread.run (Thread.java:748)
Caused by: java.sql.SQLSyntaxErrorException: user lacks privilege or object not found: BOOK
    at org.hsqldb.jdbc.JDBCUtil.sqlException (Unknown Source)
    at org.hsqldb.jdbc.JDBCUtil.sqlException (Unknown Source)
    at org.hsqldb.jdbc.JDBCStatement.fetchResult (Unknown Source)
    at org.hsqldb.jdbc.JDBCStatement.execute (Unknown Source)
    at org.apache.tools.ant.taskdefs.SQLExec.execSQL (SQLExec.java:794)
    at org.apache.tools.ant.taskdefs.SQLExec.runStatements (SQLExec.java:764)
    at org.apache.tools.ant.taskdefs.SQLExec$Transaction.runTransaction (SQLExec.java:1062)
    at org.apache.tools.ant.taskdefs.SQLExec$Transaction.access$000 (SQLExec.java:1004)
    at org.apache.tools.ant.taskdefs.SQLExec.execute (SQLExec.java:672)
    at org.apache.tools.ant.UnknownElement.execute (UnknownElement.java:292)
    at sun.reflect.NativeMethodAccessorImpl.invoke0 (Native Method)
    at sun.reflect.NativeMethodAccessorImpl.invoke (NativeMethodAccessorImpl.java:62)
    at sun.reflect.DelegatingMethodAccessorImpl.invoke (DelegatingMethodAccessorImpl.java:43)
    at java.lang.reflect.Method.invoke (Method.java:498)
    at org.apache.tools.ant.dispatch.DispatchUtils.execute (DispatchUtils.java:106)
    at org.apache.tools.ant.Task.perform (Task.java:348)
    at org.apache.tools.ant.Target.execute (Target.java:435)
    at org.apache.tools.ant.Target.performTasks (Target.java:456)
    at org.apache.tools.ant.Project.executeSortedTargets (Project.java:1393)
    at org.apache.tools.ant.Project.executeTarget (Project.java:1364)
    at org.apache.maven.plugin.antrun.AntRunMojo.execute (AntRunMojo.java:313)
    at org.apache.maven.plugin.DefaultBuildPluginManager.executeMojo (DefaultBuildPluginManager.java:137)
    at org.apache.maven.lifecycle.internal.MojoExecutor.execute (MojoExecutor.java:210)
    at org.apache.maven.lifecycle.internal.MojoExecutor.execute (MojoExecutor.java:156)
    at org.apache.maven.lifecycle.internal.MojoExecutor.execute (MojoExecutor.java:148)
    at org.apache.maven.lifecycle.internal.LifecycleModuleBuilder.buildProject (LifecycleModuleBuilder.java:117)
    at org.apache.maven.lifecycle.internal.LifecycleModuleBuilder.buildProject (LifecycleModuleBuilder.java:81)
    at org.apache.maven.lifecycle.internal.builder.singlethreaded.SingleThreadedBuilder.build
(SingleThreadedBuilder.java:56)
    at org.apache.maven.lifecycle.internal.LifecycleStarter.execute (LifecycleStarter.java:128)
    at org.apache.maven.DefaultMaven.doExecute (DefaultMaven.java:305)
    at org.apache.maven.DefaultMaven.doExecute (DefaultMaven.java:192)
    at org.apache.maven.DefaultMaven.execute (DefaultMaven.java:105)
    at org.jvnet.hudson.maven3.launcher.Maven35Launcher.main (Maven35Launcher.java:130)
    at sun.reflect.NativeMethodAccessorImpl.invoke0 (Native Method)
    at sun.reflect.NativeMethodAccessorImpl.invoke (NativeMethodAccessorImpl.java:62)
    at sun.reflect.DelegatingMethodAccessorImpl.invoke (DelegatingMethodAccessorImpl.java:43)
    at java.lang.reflect.Method.invoke (Method.java:498)
    at org.codehaus.plexus.classworlds.launcher.Launcher.launchEnhanced (Launcher.java:289)
    at org.codehaus.plexus.classworlds.launcher.Launcher.launch (Launcher.java:229)
    at jenkins.maven3.agent.Maven35Main.launch (Maven35Main.java:176)
    at sun.reflect.NativeMethodAccessorImpl.invoke0 (Native Method)
    at sun.reflect.NativeMethodAccessorImpl.invoke (NativeMethodAccessorImpl.java:62)
    at sun.reflect.DelegatingMethodAccessorImpl.invoke (DelegatingMethodAccessorImpl.java:43)
    at java.lang.reflect.Method.invoke (Method.java:498)
    at hudson.maven.Maven3Builder.call (Maven3Builder.java:139)
    at hudson.maven.Maven3Builder.call (Maven3Builder.java:70)
    at hudson.remoting.UserRequest.perform (UserRequest.java:212)
    at hudson.remoting.UserRequest.perform (UserRequest.java:54)
    at hudson.remoting.Request$2.run (Request.java:369)
    at hudson.remoting.InterceptingExecutorService$1.call (InterceptingExecutorService.java:72)
    at java.util.concurrent.FutureTask.run (FutureTask.java:266)
    at java.util.concurrent.ThreadPoolExecutor.runWorker (ThreadPoolExecutor.java:1149)
    at java.util.concurrent.ThreadPoolExecutor$Worker.run (ThreadPoolExecutor.java:624)
    at java.lang.Thread.run (Thread.java:748)
Caused by: org.hsqldb.HsqlException: user lacks privilege or object not found: BOOK
    at org.hsqldb.error.Error.error (Unknown Source)
    at org.hsqldb.error.Error.error (Unknown Source)
    at org.hsqldb.ParserDQL.readTableName (Unknown Source)
    at org.hsqldb.ParserDQL.readTableOrSubquery (Unknown Source)
    at org.hsqldb.ParserDQL.XreadTableReference (Unknown Source)
    at org.hsqldb.ParserDQL.XreadFromClause (Unknown Source)
    at org.hsqldb.ParserDQL.XreadTableExpression (Unknown Source)
    at org.hsqldb.ParserDQL.XreadQuerySpecification (Unknown Source)
    at org.hsqldb.ParserDQL.XreadSimpleTable (Unknown Source)
    at org.hsqldb.ParserDQL.XreadQueryPrimary (Unknown Source)
    at org.hsqldb.ParserDQL.XreadQueryTerm (Unknown Source)
    at org.hsqldb.ParserDQL.XreadQueryExpressionBody (Unknown Source)
    at org.hsqldb.ParserDQL.XreadQueryExpression (Unknown Source)
    at org.hsqldb.ParserDQL.compileCursorSpecification (Unknown Source)
    at org.hsqldb.ParserCommand.compilePart (Unknown Source)
    at org.hsqldb.ParserCommand.compileStatements (Unknown Source)
    at org.hsqldb.Session.executeDirectStatement (Unknown Source)
    at org.hsqldb.Session.execute (Unknown Source)
    at org.hsqldb.jdbc.JDBCStatement.fetchResult (Unknown Source)
    at org.hsqldb.jdbc.JDBCStatement.execute (Unknown Source)
    at org.apache.tools.ant.taskdefs.SQLExec.execSQL (SQLExec.java:794)
    at org.apache.tools.ant.taskdefs.SQLExec.runStatements (SQLExec.java:764)
    at org.apache.tools.ant.taskdefs.SQLExec$Transaction.runTransaction (SQLExec.java:1062)
    at org.apache.tools.ant.taskdefs.SQLExec$Transaction.access$000 (SQLExec.java:1004)
    at org.apache.tools.ant.taskdefs.SQLExec.execute (SQLExec.java:672)
    at org.apache.tools.ant.UnknownElement.execute (UnknownElement.java:292)
    at sun.reflect.NativeMethodAccessorImpl.invoke0 (Native Method)
    at sun.reflect.NativeMethodAccessorImpl.invoke (NativeMethodAccessorImpl.java:62)
    at sun.reflect.DelegatingMethodAccessorImpl.invoke (DelegatingMethodAccessorImpl.java:43)
    at java.lang.reflect.Method.invoke (Method.java:498)
    at org.apache.tools.ant.dispatch.DispatchUtils.execute (DispatchUtils.java:106)
    at org.apache.tools.ant.Task.perform (Task.java:348)
    at org.apache.tools.ant.Target.execute (Target.java:435)
    at org.apache.tools.ant.Target.performTasks (Target.java:456)
    at org.apache.tools.ant.Project.executeSortedTargets (Project.java:1393)
    at org.apache.tools.ant.Project.executeTarget (Project.java:1364)
    at org.apache.maven.plugin.antrun.AntRunMojo.execute (AntRunMojo.java:313)
    at org.apache.maven.plugin.DefaultBuildPluginManager.executeMojo (DefaultBuildPluginManager.java:137)
    at org.apache.maven.lifecycle.internal.MojoExecutor.execute (MojoExecutor.java:210)
    at org.apache.maven.lifecycle.internal.MojoExecutor.execute (MojoExecutor.java:156)
    at org.apache.maven.lifecycle.internal.MojoExecutor.execute (MojoExecutor.java:148)
    at org.apache.maven.lifecycle.internal.LifecycleModuleBuilder.buildProject (LifecycleModuleBuilder.java:117)
    at org.apache.maven.lifecycle.internal.LifecycleModuleBuilder.buildProject (LifecycleModuleBuilder.java:81)
    at org.apache.maven.lifecycle.internal.builder.singlethreaded.SingleThreadedBuilder.build
(SingleThreadedBuilder.java:56)
    at org.apache.maven.lifecycle.internal.LifecycleStarter.execute (LifecycleStarter.java:128)
    at org.apache.maven.DefaultMaven.doExecute (DefaultMaven.java:305)
    at org.apache.maven.DefaultMaven.doExecute (DefaultMaven.java:192)
    at org.apache.maven.DefaultMaven.execute (DefaultMaven.java:105)
    at org.jvnet.hudson.maven3.launcher.Maven35Launcher.main (Maven35Launcher.java:130)
    at sun.reflect.NativeMethodAccessorImpl.invoke0 (Native Method)
    at sun.reflect.NativeMethodAccessorImpl.invoke (NativeMethodAccessorImpl.java:62)
    at sun.reflect.DelegatingMethodAccessorImpl.invoke (DelegatingMethodAccessorImpl.java:43)
    at java.lang.reflect.Method.invoke (Method.java:498)
    at org.codehaus.plexus.classworlds.launcher.Launcher.launchEnhanced (Launcher.java:289)
    at org.codehaus.plexus.classworlds.launcher.Launcher.launch (Launcher.java:229)
    at jenkins.maven3.agent.Maven35Main.launch (Maven35Main.java:176)
    at sun.reflect.NativeMethodAccessorImpl.invoke0 (Native Method)
    at sun.reflect.NativeMethodAccessorImpl.invoke (NativeMethodAccessorImpl.java:62)
    at sun.reflect.DelegatingMethodAccessorImpl.invoke (DelegatingMethodAccessorImpl.java:43)
    at java.lang.reflect.Method.invoke (Method.java:498)
    at hudson.maven.Maven3Builder.call (Maven3Builder.java:139)
    at hudson.maven.Maven3Builder.call (Maven3Builder.java:70)
    at hudson.remoting.UserRequest.perform (UserRequest.java:212)
    at hudson.remoting.UserRequest.perform (UserRequest.java:54)
    at hudson.remoting.Request$2.run (Request.java:369)
    at hudson.remoting.InterceptingExecutorService$1.call (InterceptingExecutorService.java:72)
    at java.util.concurrent.FutureTask.run (FutureTask.java:266)
    at java.util.concurrent.ThreadPoolExecutor.runWorker (ThreadPoolExecutor.java:1149)
    at java.util.concurrent.ThreadPoolExecutor$Worker.run (ThreadPoolExecutor.java:624)
    at java.lang.Thread.run (Thread.java:748)
[INFO] 
[INFO] --- maven-antrun-plugin:1.8:run (shutdown-db-after-test-database) @ torque-test ---
[INFO] Skipping Antrun execution
[INFO] 
[INFO] --- torque-maven-plugin:4.1-SNAPSHOT:generate (generate-sources) @ torque-test ---
[INFO] ------------------------------------------------------------------------
[INFO] Reactor Summary for Torque Maven Parent 4.1-SNAPSHOT:
[INFO] 
[INFO] Torque Maven Parent ................................ SUCCESS [  6.151 s]
[INFO] Torque Runtime ..................................... SUCCESS [01:31 min]
[INFO] Torque Generator ................................... SUCCESS [ 14.896 s]
[INFO] Torque Templates ................................... SUCCESS [ 12.539 s]
[INFO] Torque Generator Maven 2 Plugin .................... SUCCESS [  9.233 s]
[INFO] Torque Generator Ant tasks ......................... SUCCESS [  5.099 s]
[INFO] Torque Site ........................................ SUCCESS [  2.405 s]
[INFO] Torque Test Project ................................ FAILURE [  3.442 s]
[INFO] ------------------------------------------------------------------------
[INFO] BUILD FAILURE
[INFO] ------------------------------------------------------------------------
[INFO] Total time:  03:02 min
[INFO] Finished at: 2019-01-03T16:41:06Z
[INFO] ------------------------------------------------------------------------
Waiting for Jenkins to finish collecting data
[ERROR] Failed to execute goal org.apache.torque:torque-maven-plugin:4.1-SNAPSHOT:generate
(generate-sources) on project torque-test: Unable to parse configuration of mojo org.apache.torque:torque-maven-plugin:4.1-SNAPSHOT:generate
for parameter project: Cannot find default setter in class org.apache.maven.project.MavenProject
-> [Help 1]
[ERROR] 
[ERROR] To see the full stack trace of the errors, re-run Maven with the -e switch.
[ERROR] Re-run Maven using the -X switch to enable full debug logging.
[ERROR] 
[ERROR] For more information about the errors and possible solutions, please read the following
articles:
[ERROR] [Help 1] http://cwiki.apache.org/confluence/display/MAVEN/PluginConfigurationException
[ERROR] 
[ERROR] After correcting the problems, you can resume the build with the command
[ERROR]   mvn <goals> -rf :torque-test
[JENKINS] Archiving <https://builds.apache.org/job/torque4-test-project-hsqldb/ws/torque-maven-plugin/pom.xml>
to org.apache.torque/torque-maven-plugin/4.1-SNAPSHOT/torque-maven-plugin-4.1-SNAPSHOT.pom
[JENKINS] Archiving <https://builds.apache.org/job/torque4-test-project-hsqldb/ws/torque-maven-plugin/target/torque-maven-plugin-4.1-SNAPSHOT.jar>
to org.apache.torque/torque-maven-plugin/4.1-SNAPSHOT/torque-maven-plugin-4.1-SNAPSHOT.jar
[JENKINS] Archiving <https://builds.apache.org/job/torque4-test-project-hsqldb/ws/pom.xml>
to org.apache.torque/torque/4.1-SNAPSHOT/torque-4.1-SNAPSHOT.pom
[JENKINS] Archiving <https://builds.apache.org/job/torque4-test-project-hsqldb/ws/torque-site/pom.xml>
to org.apache.torque/torque-site/4.1-SNAPSHOT/torque-site-4.1-SNAPSHOT.pom
[JENKINS] Archiving <https://builds.apache.org/job/torque4-test-project-hsqldb/ws/torque-site/target/torque-site-4.1-SNAPSHOT-site.xml>
to org.apache.torque/torque-site/4.1-SNAPSHOT/torque-site-4.1-SNAPSHOT-site.xml
[JENKINS] Archiving <https://builds.apache.org/job/torque4-test-project-hsqldb/ws/torque-generator/pom.xml>
to org.apache.torque/torque-generator/4.1-SNAPSHOT/torque-generator-4.1-SNAPSHOT.pom
[JENKINS] Archiving <https://builds.apache.org/job/torque4-test-project-hsqldb/ws/torque-generator/target/torque-generator-4.1-SNAPSHOT.jar>
to org.apache.torque/torque-generator/4.1-SNAPSHOT/torque-generator-4.1-SNAPSHOT.jar
[JENKINS] Archiving <https://builds.apache.org/job/torque4-test-project-hsqldb/ws/torque-templates/pom.xml>
to org.apache.torque/torque-templates/4.1-SNAPSHOT/torque-templates-4.1-SNAPSHOT.pom
[JENKINS] Archiving <https://builds.apache.org/job/torque4-test-project-hsqldb/ws/torque-templates/target/torque-templates-4.1-SNAPSHOT.jar>
to org.apache.torque/torque-templates/4.1-SNAPSHOT/torque-templates-4.1-SNAPSHOT.jar
[JENKINS] Archiving <https://builds.apache.org/job/torque4-test-project-hsqldb/ws/torque-test/pom.xml>
to org.apache.torque/torque-test/4.1-SNAPSHOT/torque-test-4.1-SNAPSHOT.pom
[Fast Archiver] Compressed 52.05 KB of artifacts by 61.5% relative to #357
[JENKINS] Archiving <https://builds.apache.org/job/torque4-test-project-hsqldb/ws/torque-runtime/pom.xml>
to org.apache.torque/torque-runtime/4.1-SNAPSHOT/torque-runtime-4.1-SNAPSHOT.pom
[JENKINS] Archiving <https://builds.apache.org/job/torque4-test-project-hsqldb/ws/torque-runtime/target/torque-runtime-4.1-SNAPSHOT.jar>
to org.apache.torque/torque-runtime/4.1-SNAPSHOT/torque-runtime-4.1-SNAPSHOT.jar
[JENKINS] Archiving <https://builds.apache.org/job/torque4-test-project-hsqldb/ws/torque-ant-tasks/pom.xml>
to org.apache.torque/torque-ant-tasks/4.1-SNAPSHOT/torque-ant-tasks-4.1-SNAPSHOT.pom
[JENKINS] Archiving <https://builds.apache.org/job/torque4-test-project-hsqldb/ws/torque-ant-tasks/target/torque-ant-tasks-4.1-SNAPSHOT.jar>
to org.apache.torque/torque-ant-tasks/4.1-SNAPSHOT/torque-ant-tasks-4.1-SNAPSHOT.jar
Sending e-mails to: torque-dev@db.apache.org
channel stopped

---------------------------------------------------------------------
To unsubscribe, e-mail: torque-dev-unsubscribe@db.apache.org
For additional commands, e-mail: torque-dev-help@db.apache.org


Mime
View raw message