db-torque-dev mailing list archives

Site index · List index
Message view « Date » · « Thread »
Top « Date » · « Thread »
From Apache Jenkins Server <jenk...@builds.apache.org>
Subject Build failed in Jenkins: Torque4-trunk #671
Date Tue, 07 Jan 2020 15:03:15 GMT
See <https://builds.apache.org/job/Torque4-trunk/671/display/redirect?page=changes>

Changes:

[gk] - cleanup code, use intermediate parent class DockerDatabaseAbstractExtension for configuration
docker database
- add some docker-testcontainer info in site
- add Documented to annotations


------------------------------------------
Started by an SCM change
Running as SYSTEM
[EnvInject] - Loading node environment variables.
Building remotely on H36 (ubuntu) in workspace <https://builds.apache.org/job/Torque4-trunk/ws/>
Cleaning up <https://builds.apache.org/job/Torque4-trunk/ws/torque4-trunk>
Deleting <https://builds.apache.org/job/Torque4-trunk/ws/torque4-trunk/torque-runtime/target>
Deleting <https://builds.apache.org/job/Torque4-trunk/ws/torque4-trunk/torque-ant-tasks/target>
Deleting <https://builds.apache.org/job/Torque4-trunk/ws/torque4-trunk/torque-maven-plugin/target>
Deleting <https://builds.apache.org/job/Torque4-trunk/ws/torque4-trunk/target>
Deleting <https://builds.apache.org/job/Torque4-trunk/ws/torque4-trunk/torque-generator/target>
Deleting <https://builds.apache.org/job/Torque4-trunk/ws/torque4-trunk/torque-site/target>
Deleting <https://builds.apache.org/job/Torque4-trunk/ws/torque4-trunk/torque-templates/target>
Updating http://svn.apache.org/repos/asf/db/torque/torque4/trunk at revision '2020-01-07T15:01:47.476
+0000'
U         torque-site/src/site/xdoc/developer-info/developer-guide.xml
U         torque-site/src/site/xdoc/developer-info/test-project.xml
U         torque-test/src/test/java/org/apache/torque/testcontainer/junit5/extension/DockerCallback.java
U         torque-test/src/test/java/org/apache/torque/testcontainer/junit5/extension/DockerCallbackExtension.java
U         torque-test/src/test/java/org/apache/torque/testcontainer/junit5/extension/DockerCallbackMySQLExtension.java
U         torque-test/src/test/java/org/apache/torque/testcontainer/junit5/extension/DockerCallbackPostgreSQLExtension.java
AU        torque-test/src/test/java/org/apache/torque/testcontainer/junit5/extension/DockerDatabaseAbstractExtension.java
U         torque-test/src/test/java/org/apache/torque/testcontainer/junit5/extension/DockerMySQLCallback.java
U         torque-test/src/test/java/org/apache/torque/testcontainer/junit5/extension/DockerPostGresCallback.java
At revision 1872444

Parsing POMs
Established TCP socket on 38385
maven35-agent.jar already up to date
maven35-interceptor.jar already up to date
maven3-interceptor-commons.jar already up to date
[torque4-trunk] $ /home/jenkins/tools/java/latest1.8/bin/java -Xmx4g -Xms4g -cp /home/jenkins/jenkins-slave/maven35-agent.jar:/home/jenkins/tools/maven/latest3/boot/plexus-classworlds-2.6.0.jar:/home/jenkins/tools/maven/latest3/conf/logging
jenkins.maven3.agent.Maven35Main /home/jenkins/tools/maven/latest3/ /home/jenkins/jenkins-slave/remoting.jar
/home/jenkins/jenkins-slave/maven35-interceptor.jar /home/jenkins/jenkins-slave/maven3-interceptor-commons.jar
38385
<===[JENKINS REMOTING CAPACITY]===>   channel started
Executing Maven:  -B -f <https://builds.apache.org/job/Torque4-trunk/ws/torque4-trunk/pom.xml>
-Dmaven.repo.local=/home/jenkins/jenkins-slave/maven-repositories/0 clean install cobertura:cobertura
findbugs:findbugs checkstyle:checkstyle pmd:pmd pmd:cpd
[INFO] Scanning for projects...
[INFO] ------------------------------------------------------------------------
[INFO] Reactor Build Order:
[INFO] 
[INFO] Torque Maven Parent                                                [pom]
[INFO] Torque Runtime                                                     [jar]
[INFO] Torque Generator                                                   [jar]
[INFO] Torque Templates                                                   [jar]
[INFO] Torque Generator Maven 2 Plugin                           [maven-plugin]
[INFO] Torque Generator Ant tasks                                         [jar]
[INFO] Torque Site                                                        [pom]
[INFO] 
[INFO] ----------------------< org.apache.torque:torque >----------------------
[INFO] Building Torque Maven Parent 4.1-SNAPSHOT                          [1/7]
[INFO] --------------------------------[ pom ]---------------------------------
[INFO] 
[INFO] --- maven-clean-plugin:3.1.0:clean (default-clean) @ torque ---
[INFO] 
[INFO] --- maven-enforcer-plugin:1.4.1:enforce (enforce-maven-version) @ torque ---
[INFO] 
[INFO] --- maven-remote-resources-plugin:1.5:process (process-resource-bundles) @ torque ---
[INFO] 
[INFO] --- maven-site-plugin:3.7.1:attach-descriptor (attach-descriptor) @ torque ---
[INFO] No site descriptor found: nothing to attach.
[INFO] 
[INFO] --- apache-rat-plugin:0.12:check (default) @ torque ---
[INFO] Enabled default license matchers.
[INFO] Will parse SCM ignores for exclusions...
[INFO] Finished adding exclusions from SCM ignore files.
[INFO] 67 implicit excludes (use -debug for more details).
[INFO] Exclude: velocity.log
[INFO] Exclude: .checkstyle
[INFO] Exclude: checkstyle-cache.ccf
[INFO] Exclude: **/derby.log
[INFO] Exclude: **/LICENSE-EDL.txt
[INFO] Exclude: DEPENDENCIES
[INFO] Exclude: torque-test/src/main/generated-java/**/*
[INFO] Exclude: torque-test/torque-test/**
[INFO] Exclude: **/target/**
[INFO] Exclude: **/.classpath
[INFO] Exclude: **/.project
[INFO] Exclude: **/.settings/**
[INFO] Exclude: **/torque.usersettings.properties
[INFO] 148 resources included (use -debug for more details)
[INFO] Rat check: Summary over all files. Unapproved: 1, unknown: 1, generated: 0, approved:
142 licenses.
[WARNING] Attempt to (de-)serialize anonymous class hudson.plugins.analysis.core.HealthAwareReporter$2;
see: https://jenkins.io/redirect/serialization-of-anonymous-classes/
[WARNING] Attempt to (de-)serialize anonymous class hudson.plugins.analysis.core.HealthAwareReporter$3;
see: https://jenkins.io/redirect/serialization-of-anonymous-classes/
[CHECKSTYLE] No report found for mojo check
[PMD] No report found for mojo check
[INFO] ------------------------------------------------------------------------
[INFO] Reactor Summary for Torque Maven Parent 4.1-SNAPSHOT:
[INFO] 
[INFO] Torque Maven Parent ................................ FAILURE [ 15.414 s]
[INFO] Torque Runtime ..................................... SKIPPED
[INFO] Torque Generator ................................... SKIPPED
[INFO] Torque Templates ................................... SKIPPED
[INFO] Torque Generator Maven 2 Plugin .................... SKIPPED
[INFO] Torque Generator Ant tasks ......................... SKIPPED
[INFO] Torque Site ........................................ SKIPPED
[INFO] ------------------------------------------------------------------------
[INFO] BUILD FAILURE
[INFO] ------------------------------------------------------------------------
[INFO] Total time:  30.416 s
[INFO] Finished at: 2020-01-07T15:02:52Z
[INFO] ------------------------------------------------------------------------
Waiting for Jenkins to finish collecting data
[ERROR] Failed to execute goal org.apache.rat:apache-rat-plugin:0.12:check (default) on project
torque: Too many files with unapproved license: 1 See RAT report in: <https://builds.apache.org/job/Torque4-trunk/ws/torque4-trunk/target/rat.txt>
-> [Help 1]
[ERROR] 
[ERROR] To see the full stack trace of the errors, re-run Maven with the -e switch.
[ERROR] Re-run Maven using the -X switch to enable full debug logging.
[ERROR] 
[ERROR] For more information about the errors and possible solutions, please read the following
articles:
[ERROR] [Help 1] http://cwiki.apache.org/confluence/display/MAVEN/MojoFailureException
[JENKINS] Archiving <https://builds.apache.org/job/Torque4-trunk/ws/torque4-trunk/torque-maven-plugin/pom.xml>
to org.apache.torque/torque-maven-plugin/4.1-SNAPSHOT/torque-maven-plugin-4.1-SNAPSHOT.pom
[JENKINS] Archiving <https://builds.apache.org/job/Torque4-trunk/ws/torque4-trunk/pom.xml>
to org.apache.torque/torque/4.1-SNAPSHOT/torque-4.1-SNAPSHOT.pom
[JENKINS] Archiving <https://builds.apache.org/job/Torque4-trunk/ws/torque4-trunk/torque-site/pom.xml>
to org.apache.torque/torque-site/4.1-SNAPSHOT/torque-site-4.1-SNAPSHOT.pom
[JENKINS] Archiving <https://builds.apache.org/job/Torque4-trunk/ws/torque4-trunk/torque-generator/pom.xml>
to org.apache.torque/torque-generator/4.1-SNAPSHOT/torque-generator-4.1-SNAPSHOT.pom
[JENKINS] Archiving <https://builds.apache.org/job/Torque4-trunk/ws/torque4-trunk/torque-templates/pom.xml>
to org.apache.torque/torque-templates/4.1-SNAPSHOT/torque-templates-4.1-SNAPSHOT.pom
[JENKINS] Archiving <https://builds.apache.org/job/Torque4-trunk/ws/torque4-trunk/torque-runtime/pom.xml>
to org.apache.torque/torque-runtime/4.1-SNAPSHOT/torque-runtime-4.1-SNAPSHOT.pom
[JENKINS] Archiving <https://builds.apache.org/job/Torque4-trunk/ws/torque4-trunk/torque-ant-tasks/pom.xml>
to org.apache.torque/torque-ant-tasks/4.1-SNAPSHOT/torque-ant-tasks-4.1-SNAPSHOT.pom
No mail will be sent out, as 'Torque4-trunk » Torque Generator Maven 2 Plugin #671' does
not have a result yet. Please make sure you set a proper result in case of pipeline/build
scripts.
Sending e-mails to: torque-dev@db.apache.org
No mail will be sent out, as 'Torque4-trunk » Torque Site #671' does not have a result
yet. Please make sure you set a proper result in case of pipeline/build scripts.
No mail will be sent out, as 'Torque4-trunk » Torque Generator #671' does not have a result
yet. Please make sure you set a proper result in case of pipeline/build scripts.
No mail will be sent out, as 'Torque4-trunk » Torque Templates #671' does not have a result
yet. Please make sure you set a proper result in case of pipeline/build scripts.
No mail will be sent out, as 'Torque4-trunk » Torque Runtime #671' does not have a result
yet. Please make sure you set a proper result in case of pipeline/build scripts.
No mail will be sent out, as 'Torque4-trunk » Torque Generator Ant tasks #671' does not
have a result yet. Please make sure you set a proper result in case of pipeline/build scripts.
channel stopped
[torque4-trunk] $ /home/jenkins/tools/maven/latest3/bin/mvn -Dmaven.repo.local=<https://builds.apache.org/job/Torque4-trunk/ws/.repository>
-Powasp -Dtest=false -DfailIfNoTests=false clean verify
[INFO] Scanning for projects...
[INFO] ------------------------------------------------------------------------
[INFO] Reactor Build Order:
[INFO] 
[INFO] Torque Maven Parent                                                [pom]
[INFO] Torque Runtime                                                     [jar]
[INFO] Torque Generator                                                   [jar]
[INFO] Torque Templates                                                   [jar]
[INFO] Torque Generator Maven 2 Plugin                           [maven-plugin]
[INFO] Torque Generator Ant tasks                                         [jar]
[INFO] Torque Site                                                        [pom]
[INFO] 
[INFO] ----------------------< org.apache.torque:torque >----------------------
[INFO] Building Torque Maven Parent 4.1-SNAPSHOT                          [1/7]
[INFO] --------------------------------[ pom ]---------------------------------
[INFO] 
[INFO] --- maven-clean-plugin:3.1.0:clean (default-clean) @ torque ---
[INFO] Deleting <https://builds.apache.org/job/Torque4-trunk/ws/torque4-trunk/target>
[INFO] 
[INFO] --- maven-enforcer-plugin:1.4.1:enforce (enforce-maven-version) @ torque ---
[INFO] 
[INFO] --- maven-remote-resources-plugin:1.5:process (process-resource-bundles) @ torque ---
[INFO] 
[INFO] --- maven-site-plugin:3.7.1:attach-descriptor (attach-descriptor) @ torque ---
[INFO] No site descriptor found: nothing to attach.
[INFO] 
[INFO] --- apache-rat-plugin:0.12:check (default) @ torque ---
[INFO] Enabled default license matchers.
[INFO] Will parse SCM ignores for exclusions...
[INFO] Finished adding exclusions from SCM ignore files.
[INFO] 67 implicit excludes (use -debug for more details).
[INFO] Exclude: velocity.log
[INFO] Exclude: .checkstyle
[INFO] Exclude: checkstyle-cache.ccf
[INFO] Exclude: **/derby.log
[INFO] Exclude: **/LICENSE-EDL.txt
[INFO] Exclude: DEPENDENCIES
[INFO] Exclude: torque-test/src/main/generated-java/**/*
[INFO] Exclude: torque-test/torque-test/**
[INFO] Exclude: **/target/**
[INFO] Exclude: **/.classpath
[INFO] Exclude: **/.project
[INFO] Exclude: **/.settings/**
[INFO] Exclude: **/torque.usersettings.properties
[INFO] 148 resources included (use -debug for more details)
[INFO] Rat check: Summary over all files. Unapproved: 1, unknown: 1, generated: 0, approved:
142 licenses.
[INFO] ------------------------------------------------------------------------
[INFO] Reactor Summary for Torque Maven Parent 4.1-SNAPSHOT:
[INFO] 
[INFO] Torque Maven Parent ................................ FAILURE [  2.667 s]
[INFO] Torque Runtime ..................................... SKIPPED
[INFO] Torque Generator ................................... SKIPPED
[INFO] Torque Templates ................................... SKIPPED
[INFO] Torque Generator Maven 2 Plugin .................... SKIPPED
[INFO] Torque Generator Ant tasks ......................... SKIPPED
[INFO] Torque Site ........................................ SKIPPED
[INFO] ------------------------------------------------------------------------
[INFO] BUILD FAILURE
[INFO] ------------------------------------------------------------------------
[INFO] Total time:  3.072 s
[INFO] Finished at: 2020-01-07T15:03:12Z
[INFO] ------------------------------------------------------------------------
[ERROR] Failed to execute goal org.apache.rat:apache-rat-plugin:0.12:check (default) on project
torque: Too many files with unapproved license: 1 See RAT report in: <https://builds.apache.org/job/Torque4-trunk/ws/torque4-trunk/target/rat.txt>
-> [Help 1]
[ERROR] 
[ERROR] To see the full stack trace of the errors, re-run Maven with the -e switch.
[ERROR] Re-run Maven using the -X switch to enable full debug logging.
[ERROR] 
[ERROR] For more information about the errors and possible solutions, please read the following
articles:
[ERROR] [Help 1] http://cwiki.apache.org/confluence/display/MAVEN/MojoFailureException
Build step 'Invoke top-level Maven targets' marked build as failure
[Cobertura] Publishing Cobertura coverage report...


---------------------------------------------------------------------
To unsubscribe, e-mail: torque-dev-unsubscribe@db.apache.org
For additional commands, e-mail: torque-dev-help@db.apache.org


Mime
View raw message