db-torque-dev mailing list archives

Site index · List index
Message view « Date » · « Thread »
Top « Date » · « Thread »
From Apache Jenkins Server <jenk...@builds.apache.org>
Subject Build failed in Jenkins: Torque4-trunk #673
Date Fri, 10 Jan 2020 12:51:54 GMT
See <https://builds.apache.org/job/Torque4-trunk/673/display/redirect?page=changes>

Changes:

[gk] - add task Torque4JDBCTransformTask.java with test (using derby-embedded as in org.apache.torque.generator.source.jdbc.JdbcMetadataSourceTest
to get some data from schema) and dependencies.
- update ant task documentation
- add missing xsd files in site (?)


------------------------------------------
[...truncated 1.10 MB...]
[INFO] Checking for updates
[INFO] Skipping NVD check since last check was within 4 hours.
[INFO] Skipping RetireJS update since last update was within 24 hours.
[INFO] Check for updates complete (2 ms)
[INFO] 

Dependency-Check is an open source tool performing a best effort analysis of 3rd party dependencies;
false positives and false negatives may exist in the analysis performed by the tool. Use of
the tool and the reporting provided constitutes acceptance for use in an AS IS condition,
and there are NO warranties, implied or otherwise, with regard to the analysis or its use.
Any use of the tool and the reporting provided is at the user?s risk. In no event shall the
copyright holder or OWASP be held liable for any damages whatsoever arising out of or in connection
with the use of this tool, the analysis performed, or the resulting report.


[INFO] Analysis Started
[INFO] Finished Archive Analyzer (0 seconds)
[INFO] Finished File Name Analyzer (0 seconds)
[INFO] Finished Jar Analyzer (0 seconds)
[INFO] Finished Dependency Merging Analyzer (0 seconds)
[INFO] Finished Version Filter Analyzer (0 seconds)
[INFO] Finished Hint Analyzer (0 seconds)
[INFO] Created CPE Index (1 seconds)
[INFO] Finished CPE Analyzer (2 seconds)
[INFO] Finished False Positive Analyzer (0 seconds)
[INFO] Finished NVD CVE Analyzer (0 seconds)
[INFO] Finished Sonatype OSS Index Analyzer (0 seconds)
[INFO] Finished Vulnerability Suppression Analyzer (0 seconds)
[INFO] Finished Dependency Bundling Analyzer (0 seconds)
[INFO] Analysis Complete (2 seconds)
[INFO] 
[INFO] ---------------< org.apache.torque:torque-maven-plugin >----------------
[INFO] Building Torque Generator Maven 2 Plugin 4.1-SNAPSHOT              [5/7]
[INFO] ----------------------------[ maven-plugin ]----------------------------
Downloading from central: https://repo.maven.apache.org/maven2/org/apache/logging/log4j/log4j-slf4j-impl/2.13.0/log4j-slf4j-impl-2.13.0.pom
Progress (1): 2.2/12 kBProgress (1): 5.0/12 kBProgress (1): 7.8/12 kBProgress (1): 11/12 kB
Progress (1): 12 kB                      Downloaded from central: https://repo.maven.apache.org/maven2/org/apache/logging/log4j/log4j-slf4j-impl/2.13.0/log4j-slf4j-impl-2.13.0.pom
(12 kB at 389 kB/s)
Downloading from central: https://repo.maven.apache.org/maven2/org/apache/logging/log4j/log4j/2.13.0/log4j-2.13.0.pom
Progress (1): 2.2/65 kBProgress (1): 5.0/65 kBProgress (1): 7.8/65 kBProgress (1): 11/65 kB
Progress (1): 13/65 kBProgress (1): 16/65 kBProgress (1): 19/65 kBProgress (1): 21/65 kBProgress
(1): 24/65 kBProgress (1): 27/65 kBProgress (1): 30/65 kBProgress (1): 32/65 kBProgress (1):
36/65 kBProgress (1): 40/65 kBProgress (1): 45/65 kBProgress (1): 49/65 kBProgress (1): 53/65
kBProgress (1): 57/65 kBProgress (1): 61/65 kBProgress (1): 65/65 kBProgress (1): 65 kB  
                   Downloaded from central: https://repo.maven.apache.org/maven2/org/apache/logging/log4j/log4j/2.13.0/log4j-2.13.0.pom
(65 kB at 3.4 MB/s)
Downloading from central: https://repo.maven.apache.org/maven2/org/apache/logging/log4j/log4j-slf4j-impl/2.13.0/log4j-slf4j-impl-2.13.0.jar
Progress (1): 2.8/24 kBProgress (1): 5.5/24 kBProgress (1): 8.3/24 kBProgress (1): 11/24 kB
Progress (1): 14/24 kBProgress (1): 16/24 kBProgress (1): 19/24 kBProgress (1): 22/24 kBProgress
(1): 24 kB                      Downloaded from central: https://repo.maven.apache.org/maven2/org/apache/logging/log4j/log4j-slf4j-impl/2.13.0/log4j-slf4j-impl-2.13.0.jar
(24 kB at 1.5 MB/s)
[INFO] 
[INFO] --- maven-clean-plugin:3.1.0:clean (default-clean) @ torque-maven-plugin ---
[INFO] Deleting <https://builds.apache.org/job/Torque4-trunk/ws/torque4-trunk/torque-maven-plugin/target>
[INFO] 
[INFO] --- maven-enforcer-plugin:1.4.1:enforce (enforce-maven-version) @ torque-maven-plugin
---
[INFO] 
[INFO] --- maven-remote-resources-plugin:1.5:process (process-resource-bundles) @ torque-maven-plugin
---
[INFO] 
[INFO] --- maven-resources-plugin:3.1.0:resources (default-resources) @ torque-maven-plugin
---
[INFO] Using 'ISO-8859-1' encoding to copy filtered resources.
[INFO] Copying 1 resource
[INFO] Copying 3 resources
[INFO] 
[INFO] --- maven-compiler-plugin:3.7.0:compile (default-compile) @ torque-maven-plugin ---
[INFO] Changes detected - recompiling the module!
[INFO] Compiling 1 source file to <https://builds.apache.org/job/Torque4-trunk/ws/torque4-trunk/torque-maven-plugin/target/classes>
[INFO] 
[INFO] --- maven-plugin-plugin:3.5.2:descriptor (default-descriptor) @ torque-maven-plugin
---
[INFO] Using 'ISO-8859-1' encoding to read mojo source files.
[INFO] java-javadoc mojo extractor found 0 mojo descriptor.
[INFO] java-annotations mojo extractor found 1 mojo descriptor.
[INFO] 
[INFO] --- maven-resources-plugin:3.1.0:testResources (default-testResources) @ torque-maven-plugin
---
[INFO] Using 'ISO-8859-1' encoding to copy filtered resources.
[INFO] Copying 1 resource
[INFO] Copying 3 resources
[INFO] 
[INFO] --- maven-compiler-plugin:3.7.0:testCompile (default-testCompile) @ torque-maven-plugin
---
[INFO] Changes detected - recompiling the module!
[INFO] Compiling 1 source file to <https://builds.apache.org/job/Torque4-trunk/ws/torque4-trunk/torque-maven-plugin/target/test-classes>
[INFO] 
[INFO] --- maven-surefire-plugin:3.0.0-M4:test (default-test) @ torque-maven-plugin ---
[INFO] 
[INFO] --- maven-jar-plugin:3.1.0:jar (default-jar) @ torque-maven-plugin ---
[INFO] Building jar: <https://builds.apache.org/job/Torque4-trunk/ws/torque4-trunk/torque-maven-plugin/target/torque-maven-plugin-4.1-SNAPSHOT.jar>
[INFO] 
[INFO] --- maven-plugin-plugin:3.5.2:addPluginArtifactMetadata (default-addPluginArtifactMetadata)
@ torque-maven-plugin ---
[INFO] 
[INFO] --- maven-site-plugin:3.7.1:attach-descriptor (attach-descriptor) @ torque-maven-plugin
---
[INFO] Skipping because packaging 'maven-plugin' is not pom.
[INFO] 
[INFO] --- apache-rat-plugin:0.12:check (default) @ torque-maven-plugin ---
[INFO] Enabled default license matchers.
[INFO] Will parse SCM ignores for exclusions...
[INFO] Finished adding exclusions from SCM ignore files.
[INFO] 61 implicit excludes (use -debug for more details).
[INFO] Exclude: velocity.log
[INFO] Exclude: .checkstyle
[INFO] Exclude: checkstyle-cache.ccf
[INFO] Exclude: **/derby.log
[INFO] Exclude: **/LICENSE-EDL.txt
[INFO] Exclude: DEPENDENCIES
[INFO] Exclude: torque-test/src/main/generated-java/**/*
[INFO] Exclude: torque-test/torque-test/**
[INFO] Exclude: **/target/**
[INFO] Exclude: **/.classpath
[INFO] Exclude: **/.project
[INFO] Exclude: **/.settings/**
[INFO] Exclude: **/torque.usersettings.properties
[INFO] 18 resources included (use -debug for more details)
[INFO] Rat check: Summary over all files. Unapproved: 0, unknown: 0, generated: 0, approved:
16 licenses.
[INFO] 
[INFO] --- dependency-check-maven:5.2.2:check (default) @ torque-maven-plugin ---
[WARNING] No analyzer could be found for 'org.codehaus.groovy:groovy-all:pom:2.5.6:compile'
in project Torque Generator Maven 2 Plugin
[INFO] Checking for updates
[INFO] Skipping NVD check since last check was within 4 hours.
[INFO] Skipping RetireJS update since last update was within 24 hours.
[INFO] Check for updates complete (1 ms)
[INFO] 

Dependency-Check is an open source tool performing a best effort analysis of 3rd party dependencies;
false positives and false negatives may exist in the analysis performed by the tool. Use of
the tool and the reporting provided constitutes acceptance for use in an AS IS condition,
and there are NO warranties, implied or otherwise, with regard to the analysis or its use.
Any use of the tool and the reporting provided is at the user?s risk. In no event shall the
copyright holder or OWASP be held liable for any damages whatsoever arising out of or in connection
with the use of this tool, the analysis performed, or the resulting report.


[INFO] Analysis Started
[INFO] Finished Archive Analyzer (0 seconds)
[INFO] Finished File Name Analyzer (0 seconds)
[INFO] Finished Jar Analyzer (0 seconds)
[INFO] Finished Dependency Merging Analyzer (0 seconds)
[INFO] Finished Version Filter Analyzer (0 seconds)
[INFO] Finished Hint Analyzer (0 seconds)
[INFO] Created CPE Index (1 seconds)
[INFO] Finished CPE Analyzer (1 seconds)
[INFO] Finished False Positive Analyzer (0 seconds)
[INFO] Finished NVD CVE Analyzer (0 seconds)
[INFO] Finished Sonatype OSS Index Analyzer (1 seconds)
[INFO] Finished Vulnerability Suppression Analyzer (0 seconds)
[INFO] Finished Dependency Bundling Analyzer (0 seconds)
[INFO] Analysis Complete (3 seconds)
[INFO] 
[INFO] -----------------< org.apache.torque:torque-ant-tasks >-----------------
[INFO] Building Torque Generator Ant tasks 4.1-SNAPSHOT                   [6/7]
[INFO] --------------------------------[ jar ]---------------------------------
Downloading from central: https://repo.maven.apache.org/maven2/org/apache/ant/ant/1.10.7/ant-1.10.7.pom
Progress (1): 2.2/16 kBProgress (1): 5.0/16 kBProgress (1): 7.8/16 kBProgress (1): 11/16 kB
Progress (1): 13/16 kBProgress (1): 16/16 kBProgress (1): 16 kB                      Downloaded
from central: https://repo.maven.apache.org/maven2/org/apache/ant/ant/1.10.7/ant-1.10.7.pom
(16 kB at 861 kB/s)
Downloading from central: https://repo.maven.apache.org/maven2/org/apache/ant/ant-parent/1.10.7/ant-parent-1.10.7.pom
Progress (1): 2.2/6.5 kBProgress (1): 5.0/6.5 kBProgress (1): 6.5 kB                     
  Downloaded from central: https://repo.maven.apache.org/maven2/org/apache/ant/ant-parent/1.10.7/ant-parent-1.10.7.pom
(6.5 kB at 466 kB/s)
Downloading from central: https://repo.maven.apache.org/maven2/org/apache/ant/ant-launcher/1.10.7/ant-launcher-1.10.7.pom
Progress (1): 2.2/3.2 kBProgress (1): 3.2 kB                        Downloaded from central:
https://repo.maven.apache.org/maven2/org/apache/ant/ant-launcher/1.10.7/ant-launcher-1.10.7.pom
(3.2 kB at 243 kB/s)
Downloading from central: https://repo.maven.apache.org/maven2/org/apache/ant/ant/1.10.7/ant-1.10.7.jar
Downloading from central: https://repo.maven.apache.org/maven2/org/apache/ant/ant-launcher/1.10.7/ant-launcher-1.10.7.jar
Progress (1): 0/2.2 MBProgress (1): 0/2.2 MBProgress (1): 0/2.2 MBProgress (1): 0/2.2 MBProgress
(1): 0.1/2.2 MBProgress (1): 0.1/2.2 MBProgress (1): 0.1/2.2 MBProgress (1): 0.1/2.2 MBProgress
(1): 0.1/2.2 MBProgress (1): 0.1/2.2 MBProgress (1): 0.2/2.2 MBProgress (1): 0.2/2.2 MBProgress
(1): 0.2/2.2 MBProgress (1): 0.2/2.2 MBProgress (1): 0.2/2.2 MBProgress (1): 0.2/2.2 MBProgress
(1): 0.3/2.2 MBProgress (1): 0.3/2.2 MBProgress (1): 0.3/2.2 MBProgress (1): 0.3/2.2 MBProgress
(1): 0.3/2.2 MBProgress (1): 0.3/2.2 MBProgress (1): 0.4/2.2 MBProgress (1): 0.4/2.2 MBProgress
(1): 0.4/2.2 MBProgress (1): 0.4/2.2 MBProgress (1): 0.4/2.2 MBProgress (1): 0.4/2.2 MBProgress
(2): 0.4/2.2 MB | 2.8/19 kBProgress (2): 0.5/2.2 MB | 2.8/19 kBProgress (2): 0.5/2.2 MB |
5.5/19 kBProgress (2): 0.5/2.2 MB | 8.3/19 kBProgress (2): 0.5/2.2 MB | 8.3/19 kBProgress
(2): 0.5/2.2 MB | 11/19 kB Progress (2): 0.5/2.2 MB | 11/19 kBProgress (2): 0.5/2.2 MB | 11/19
kBProgress (2): 0.5/2.2 MB | 14/19 kBProgress (2): 0.5/2.2 MB | 16/19 kBProgress (2): 0.5/2.2
MB | 16/19 kBProgress (2): 0.5/2.2 MB | 19 kB   Progress (2): 0.5/2.2 MB | 19 kBProgress (2):
0.6/2.2 MB | 19 kBProgress (2): 0.6/2.2 MB | 19 kBProgress (2): 0.6/2.2 MB | 19 kBProgress
(2): 0.6/2.2 MB | 19 kBProgress (2): 0.6/2.2 MB | 19 kBProgress (2): 0.6/2.2 MB | 19 kBProgress
(2): 0.7/2.2 MB | 19 kB                                Downloaded from central: https://repo.maven.apache.org/maven2/org/apache/ant/ant-launcher/1.10.7/ant-launcher-1.10.7.jar
(19 kB at 347 kB/s)
Progress (1): 0.7/2.2 MBProgress (1): 0.7/2.2 MBProgress (1): 0.7/2.2 MBProgress (1): 0.7/2.2
MBProgress (1): 0.7/2.2 MBProgress (1): 0.8/2.2 MBProgress (1): 0.8/2.2 MBProgress (1): 0.8/2.2
MBProgress (1): 0.8/2.2 MBProgress (1): 0.8/2.2 MBProgress (1): 0.8/2.2 MBProgress (1): 0.9/2.2
MBProgress (1): 0.9/2.2 MBProgress (1): 0.9/2.2 MBProgress (1): 0.9/2.2 MBProgress (1): 0.9/2.2
MBProgress (1): 0.9/2.2 MBProgress (1): 0.9/2.2 MBProgress (1): 1.0/2.2 MBProgress (1): 1.0/2.2
MBProgress (1): 1.0/2.2 MBProgress (1): 1.0/2.2 MBProgress (1): 1.0/2.2 MBProgress (1): 1.0/2.2
MBProgress (1): 1.1/2.2 MBProgress (1): 1.1/2.2 MBProgress (1): 1.1/2.2 MBProgress (1): 1.1/2.2
MBProgress (1): 1.1/2.2 MBProgress (1): 1.1/2.2 MBProgress (1): 1.2/2.2 MBProgress (1): 1.2/2.2
MBProgress (1): 1.2/2.2 MBProgress (1): 1.2/2.2 MBProgress (1): 1.2/2.2 MBProgress (1): 1.2/2.2
MBProgress (1): 1.3/2.2 MBProgress (1): 1.3/2.2 MBProgress (1): 1.3/2.2 MBProgress (1): 1.3/2.2
MBProgress (1): 1.3/2.2 MBProgress (1): 1.3/2.2 MBProgress (1): 1.4/2.2 MBProgress (1): 1.4/2.2
MBProgress (1): 1.4/2.2 MBProgress (1): 1.4/2.2 MBProgress (1): 1.4/2.2 MBProgress (1): 1.4/2.2
MBProgress (1): 1.5/2.2 MBProgress (1): 1.5/2.2 MBProgress (1): 1.5/2.2 MBProgress (1): 1.5/2.2
MBProgress (1): 1.5/2.2 MBProgress (1): 1.5/2.2 MBProgress (1): 1.6/2.2 MBProgress (1): 1.6/2.2
MBProgress (1): 1.6/2.2 MBProgress (1): 1.6/2.2 MBProgress (1): 1.6/2.2 MBProgress (1): 1.6/2.2
MBProgress (1): 1.7/2.2 MBProgress (1): 1.7/2.2 MBProgress (1): 1.7/2.2 MBProgress (1): 1.7/2.2
MBProgress (1): 1.7/2.2 MBProgress (1): 1.7/2.2 MBProgress (1): 1.8/2.2 MBProgress (1): 1.8/2.2
MBProgress (1): 1.8/2.2 MBProgress (1): 1.8/2.2 MBProgress (1): 1.8/2.2 MBProgress (1): 1.8/2.2
MBProgress (1): 1.9/2.2 MBProgress (1): 1.9/2.2 MBProgress (1): 1.9/2.2 MBProgress (1): 1.9/2.2
MBProgress (1): 1.9/2.2 MBProgress (1): 1.9/2.2 MBProgress (1): 1.9/2.2 MBProgress (1): 2.0/2.2
MBProgress (1): 2.0/2.2 MBProgress (1): 2.0/2.2 MBProgress (1): 2.0/2.2 MBProgress (1): 2.0/2.2
MBProgress (1): 2.0/2.2 MBProgress (1): 2.1/2.2 MBProgress (1): 2.1/2.2 MBProgress (1): 2.1/2.2
MBProgress (1): 2.1/2.2 MBProgress (1): 2.1/2.2 MBProgress (1): 2.1/2.2 MBProgress (1): 2.2/2.2
MBProgress (1): 2.2/2.2 MBProgress (1): 2.2/2.2 MBProgress (1): 2.2/2.2 MBProgress (1): 2.2/2.2
MBProgress (1): 2.2 MB                        Downloaded from central: https://repo.maven.apache.org/maven2/org/apache/ant/ant/1.10.7/ant-1.10.7.jar
(2.2 MB at 16 MB/s)
[INFO] 
[INFO] --- maven-clean-plugin:3.1.0:clean (default-clean) @ torque-ant-tasks ---
[INFO] Deleting <https://builds.apache.org/job/Torque4-trunk/ws/torque4-trunk/torque-ant-tasks/target>
[INFO] 
[INFO] --- maven-enforcer-plugin:1.4.1:enforce (enforce-maven-version) @ torque-ant-tasks
---
[INFO] 
[INFO] --- maven-remote-resources-plugin:1.5:process (process-resource-bundles) @ torque-ant-tasks
---
[INFO] 
[INFO] --- maven-resources-plugin:3.1.0:resources (default-resources) @ torque-ant-tasks ---
[INFO] Using 'ISO-8859-1' encoding to copy filtered resources.
[INFO] skip non existing resourceDirectory <https://builds.apache.org/job/Torque4-trunk/ws/torque4-trunk/torque-ant-tasks/src/main/resources>
[INFO] Copying 3 resources
[INFO] 
[INFO] --- maven-compiler-plugin:3.7.0:compile (default-compile) @ torque-ant-tasks ---
[INFO] Changes detected - recompiling the module!
[INFO] Compiling 3 source files to <https://builds.apache.org/job/Torque4-trunk/ws/torque4-trunk/torque-ant-tasks/target/classes>
[INFO] 
[INFO] --- maven-resources-plugin:3.1.0:testResources (default-testResources) @ torque-ant-tasks
---
[INFO] Using 'ISO-8859-1' encoding to copy filtered resources.
[INFO] Copying 3 resources
[INFO] Copying 3 resources
[INFO] 
[INFO] --- maven-compiler-plugin:3.7.0:testCompile (default-testCompile) @ torque-ant-tasks
---
[INFO] Changes detected - recompiling the module!
[INFO] Compiling 1 source file to <https://builds.apache.org/job/Torque4-trunk/ws/torque4-trunk/torque-ant-tasks/target/test-classes>
[INFO] 
[INFO] --- maven-surefire-plugin:3.0.0-M4:test (default-test) @ torque-ant-tasks ---
[INFO] 
[INFO] --- maven-jar-plugin:3.1.0:jar (default-jar) @ torque-ant-tasks ---
[INFO] Building jar: <https://builds.apache.org/job/Torque4-trunk/ws/torque4-trunk/torque-ant-tasks/target/torque-ant-tasks-4.1-SNAPSHOT.jar>
[INFO] 
[INFO] --- maven-site-plugin:3.7.1:attach-descriptor (attach-descriptor) @ torque-ant-tasks
---
[INFO] Skipping because packaging 'jar' is not pom.
[INFO] 
[INFO] --- apache-rat-plugin:0.12:check (default) @ torque-ant-tasks ---
[INFO] Enabled default license matchers.
[INFO] Will parse SCM ignores for exclusions...
[INFO] Finished adding exclusions from SCM ignore files.
[INFO] 61 implicit excludes (use -debug for more details).
[INFO] Exclude: velocity.log
[INFO] Exclude: .checkstyle
[INFO] Exclude: checkstyle-cache.ccf
[INFO] Exclude: **/derby.log
[INFO] Exclude: **/LICENSE-EDL.txt
[INFO] Exclude: DEPENDENCIES
[INFO] Exclude: torque-test/src/main/generated-java/**/*
[INFO] Exclude: torque-test/torque-test/**
[INFO] Exclude: **/target/**
[INFO] Exclude: **/.classpath
[INFO] Exclude: **/.project
[INFO] Exclude: **/.settings/**
[INFO] Exclude: **/torque.usersettings.properties
[INFO] 29 resources included (use -debug for more details)
[INFO] Rat check: Summary over all files. Unapproved: 0, unknown: 0, generated: 0, approved:
27 licenses.
[INFO] 
[INFO] --- dependency-check-maven:5.2.2:check (default) @ torque-ant-tasks ---
[WARNING] No analyzer could be found for 'org.codehaus.groovy:groovy-all:pom:2.5.6:compile'
in project Torque Generator Ant tasks
[ERROR] Unable to resolve system scoped dependency: com.sun:tools:jar:1.8.0:system
[INFO] Checking for updates
[INFO] Skipping NVD check since last check was within 4 hours.
[INFO] Skipping RetireJS update since last update was within 24 hours.
[INFO] Check for updates complete (2 ms)
[INFO] 

Dependency-Check is an open source tool performing a best effort analysis of 3rd party dependencies;
false positives and false negatives may exist in the analysis performed by the tool. Use of
the tool and the reporting provided constitutes acceptance for use in an AS IS condition,
and there are NO warranties, implied or otherwise, with regard to the analysis or its use.
Any use of the tool and the reporting provided is at the user?s risk. In no event shall the
copyright holder or OWASP be held liable for any damages whatsoever arising out of or in connection
with the use of this tool, the analysis performed, or the resulting report.


[INFO] Analysis Started
[INFO] Finished Archive Analyzer (0 seconds)
[INFO] Finished File Name Analyzer (0 seconds)
[INFO] Finished Jar Analyzer (0 seconds)
[INFO] Finished Dependency Merging Analyzer (0 seconds)
[INFO] Finished Version Filter Analyzer (0 seconds)
[INFO] Finished Hint Analyzer (0 seconds)
[INFO] Created CPE Index (1 seconds)
[INFO] Finished CPE Analyzer (1 seconds)
[INFO] Finished False Positive Analyzer (0 seconds)
[INFO] Finished NVD CVE Analyzer (0 seconds)
[INFO] Finished Sonatype OSS Index Analyzer (0 seconds)
[INFO] Finished Vulnerability Suppression Analyzer (0 seconds)
[INFO] Finished Dependency Bundling Analyzer (0 seconds)
[INFO] Analysis Complete (2 seconds)
[INFO] ------------------------------------------------------------------------
[INFO] Reactor Summary for Torque Maven Parent 4.1-SNAPSHOT:
[INFO] 
[INFO] Torque Maven Parent ................................ SUCCESS [08:30 min]
[INFO] Torque Runtime ..................................... SUCCESS [ 11.628 s]
[INFO] Torque Generator ................................... SUCCESS [ 18.953 s]
[INFO] Torque Templates ................................... SUCCESS [  6.218 s]
[INFO] Torque Generator Maven 2 Plugin .................... SUCCESS [  9.718 s]
[INFO] Torque Generator Ant tasks ......................... FAILURE [  4.299 s]
[INFO] Torque Site ........................................ SKIPPED
[INFO] ------------------------------------------------------------------------
[INFO] BUILD FAILURE
[INFO] ------------------------------------------------------------------------
[INFO] Total time:  09:23 min
[INFO] Finished at: 2020-01-10T12:51:49Z
[INFO] ------------------------------------------------------------------------
[ERROR] Failed to execute goal org.owasp:dependency-check-maven:5.2.2:check (default) on project
torque-ant-tasks: One or more exceptions occurred during dependency-check analysis: One or
more exceptions occurred during analysis:
[ERROR] 	Unable to resolve system scoped dependency: com.sun:tools:jar:1.8.0:system
[ERROR] -> [Help 1]
[ERROR] 
[ERROR] To see the full stack trace of the errors, re-run Maven with the -e switch.
[ERROR] Re-run Maven using the -X switch to enable full debug logging.
[ERROR] 
[ERROR] For more information about the errors and possible solutions, please read the following
articles:
[ERROR] [Help 1] http://cwiki.apache.org/confluence/display/MAVEN/MojoExecutionException
[ERROR] 
[ERROR] After correcting the problems, you can resume the build with the command
[ERROR]   mvn <args> -rf :torque-ant-tasks
Build step 'Invoke top-level Maven targets' marked build as failure
[Cobertura] Publishing Cobertura coverage report...


---------------------------------------------------------------------
To unsubscribe, e-mail: torque-dev-unsubscribe@db.apache.org
For additional commands, e-mail: torque-dev-help@db.apache.org


Mime
View raw message