directory-fortress mailing list archives

Site index · List index
Message view « Date » · « Thread »
Top « Date » · « Thread »
From Stefan Seelmann <m...@stefan-seelmann.de>
Subject Re: [VOTE] Apache Fortress 2.0.1 release, Take 2
Date Tue, 17 Jul 2018 21:45:05 GMT
When I run core tests against OpenLDAP (I use
src/docker/openldap-for-apache-fortress-tests/run-tests.sh) I get 5 test
failures which I didn't got last week, see below. I saw some changes in
slapd.properties.example, is that related? I won't have time to dig
deeper before the weekend but don't want to block the release if it's
only a problem with the test script.

Test against ApacheDS
(src/docker/apacheds-for-apache-fortress-tests/run-tests.sh) worked
fine, also everything else looks good.

Kind Regards,
Stefan



Tests run: 129, Failures: 5, Errors: 0, Skipped: 0, Time elapsed:
192.234 sec <<< FAILURE! - in
org.apache.directory.fortress.core.impl.FortressJUnitTest

testSearchBinds(org.apache.directory.fortress.core.impl.AuditMgrImplTest)
 Time elapsed: 0.07 sec  <<< FAILURE!

junit.framework.AssertionFailedError: LdapException in
AuditDAO.searchBinds
id=org.apache.directory.api.ldap.model.exception.LdapException:
org.apache.directory.api.ldap.model.exception.Ldap
InvalidDnException: ERR_04202 A value is missing on some RDN


        at junit.framework.Assert.fail(Assert.java:57)


        at junit.framework.TestCase.fail(TestCase.java:227)


        at
org.apache.directory.fortress.core.impl.AuditMgrImplTest.searchBinds(AuditMgrImplTest.java:444)


        at
org.apache.directory.fortress.core.impl.AuditMgrImplTest.testSearchBinds(AuditMgrImplTest.java:399)





testGetAuthZs(org.apache.directory.fortress.core.impl.AuditMgrImplTest)
Time elapsed: 0.011 sec  <<< FAILURE!

junit.framework.AssertionFailedError: LdapException in
AuditDAO.getAllAuthZs
id=org.apache.directory.api.ldap.model.exception.LdapException:
org.apache.directory.api.ldap.model.exception.Lda
pInvalidDnException: ERR_04202 A value is missing on some RDN


        at junit.framework.Assert.fail(Assert.java:57)
        at junit.framework.TestCase.fail(TestCase.java:227)

        at
org.apache.directory.fortress.core.impl.AuditMgrImplTest.getAuthZs(AuditMgrImplTest.java:355)
        at
org.apache.directory.fortress.core.impl.AuditMgrImplTest.testGetAuthZs(AuditMgrImplTest.java:311)

testSearchAuthZs(org.apache.directory.fortress.core.impl.AuditMgrImplTest)
 Time elapsed: 0.01 sec  <<< FAILURE!
junit.framework.AssertionFailedError: LdapException in
AuditDAO.searchAuthZs
id=org.apache.directory.api.ldap.model.exception.LdapException:
org.apache.directory.api.ldap.model.exception.Ld$
pInvalidDnException: ERR_04202 A value is missing on some RDN

        at junit.framework.Assert.fail(Assert.java:57)


        at junit.framework.TestCase.fail(TestCase.java:227)

        at
org.apache.directory.fortress.core.impl.AuditMgrImplTest.searchAuthZs(AuditMgrImplTest.java:301)

        at
org.apache.directory.fortress.core.impl.AuditMgrImplTest.testSearchAuthZs(AuditMgrImplTest.java:248)


testSearchMods(org.apache.directory.fortress.core.impl.AuditMgrImplTest)
 Time elapsed: 0.006 sec  <<< FAILURE!

junit.framework.AssertionFailedError: searchUserMods caught
LdapException
id=org.apache.directory.api.ldap.model.exception.LdapException:
org.apache.directory.api.ldap.model.exception.LdapI$
validDnException: ERR_04202 A value is missing on some RDN

        at junit.framework.Assert.fail(Assert.java:57)

        at junit.framework.TestCase.fail(TestCase.java:227)
        at
org.apache.directory.fortress.core.impl.AuditMgrImplTest.searchMods(AuditMgrImplTest.java:241)

        at
org.apache.directory.fortress.core.impl.AuditMgrImplTest.testSearchMods(AuditMgrImplTest.java:205)


testSearchAdminMods(org.apache.directory.fortress.core.impl.AuditMgrImplTest)
 Time elapsed: 0.007 sec  <<< FAILURE!
junit.framework.AssertionFailedError: searchAdminMods caught
LdapException
id=org.apache.directory.api.ldap.model.exception.LdapException:
org.apache.directory.api.ldap.model.exception.Ldap$
nvalidDnException: ERR_04202 A value is missing on some RDN

        at junit.framework.Assert.fail(Assert.java:57)

        at junit.framework.TestCase.fail(TestCase.java:227)

        at
org.apache.directory.fortress.core.impl.AuditMgrImplTest.searchAdminMods(AuditMgrImplTest.java:195)
        at
org.apache.directory.fortress.core.impl.AuditMgrImplTest.testSearchAdminMods(AuditMgrImplTest.java:94)



Mime
View raw message