drill-dev mailing list archives

Site index · List index
Message view « Date » · « Thread »
Top « Date » · « Thread »
From "ASF GitHub Bot (JIRA)" <j...@apache.org>
Subject [jira] [Commented] (DRILL-514) hbase-storage-plugin tests failing on MapR profile
Date Sun, 04 May 2014 00:42:17 GMT

    [ https://issues.apache.org/jira/browse/DRILL-514?page=com.atlassian.jira.plugin.system.issuetabpanels:comment-tabpanel&focusedCommentId=13988872#comment-13988872
] 

ASF GitHub Bot commented on DRILL-514:
--------------------------------------

Github user jacques-n commented on the pull request:

    https://github.com/apache/incubator-drill/pull/58#issuecomment-42120523
  
    please close, i believe this is merged.


> hbase-storage-plugin tests failing on MapR profile
> --------------------------------------------------
>
>                 Key: DRILL-514
>                 URL: https://issues.apache.org/jira/browse/DRILL-514
>             Project: Apache Drill
>          Issue Type: Bug
>         Environment: Java 1.7, Maven 3.0.3
>            Reporter: Patrick Wong
>            Assignee: Jacques Nadeau
>            Priority: Minor
>
> Command line is: {{clean install deploy -Pmapr rat.numUnapprovedLicenses=100}}
> {code}
> HBaseStorageHandlerTest: setUpBeforeClass()
> 15:09:07.436 [main] INFO  o.a.h.h.mapred.TestTableInputFormat - Starting HBase mini cluster.
> 15:09:07.627 [main] INFO  o.a.hadoop.hbase.HBaseTestingUtility - Starting up minicluster
with 1 master(s) and 1 regionserver(s) and 1 datanode(s)
> HBaseStorageHandlerTest: tearDownAfterClass()
> Tests run: 2, Failures: 0, Errors: 2, Skipped: 0, Time elapsed: 6.619 sec <<<
FAILURE! - in org.apache.drill.hbase.HBaseRecordReaderTest
> org.apache.drill.hbase.HBaseRecordReaderTest  Time elapsed: 6.619 sec  <<< ERROR!
> java.lang.NoSuchFieldError: RECOVER
> 	at org.apache.hadoop.hdfs.MiniDFSCluster.<init>(MiniDFSCluster.java:280)
> 	at org.apache.hadoop.hbase.HBaseTestingUtility.startMiniDFSCluster(HBaseTestingUtility.java:452)
> 	at org.apache.hadoop.hbase.HBaseTestingUtility.startMiniCluster(HBaseTestingUtility.java:620)
> 	at org.apache.hadoop.hbase.HBaseTestingUtility.startMiniCluster(HBaseTestingUtility.java:576)
> 	at org.apache.hadoop.hbase.HBaseTestingUtility.startMiniCluster(HBaseTestingUtility.java:545)
> 	at org.apache.drill.hbase.HBaseTestsSuite.setUp(HBaseTestsSuite.java:62)
> 	at org.apache.drill.hbase.HBaseRecordReaderTest.setUpBeforeClass(HBaseRecordReaderTest.java:72)
> org.apache.drill.hbase.HBaseRecordReaderTest  Time elapsed: 6.619 sec  <<< ERROR!
> java.lang.NullPointerException: null
> 	at org.apache.drill.hbase.HBaseRecordReaderTest.tearDownAfterClass(HBaseRecordReaderTest.java:80)
> Results :
> Tests in error: 
>   HBaseRecordReaderTest.setUpBeforeClass:72 ยป NoSuchField RECOVER
>   HBaseRecordReaderTest.tearDownAfterClass:80 NullPointer
> Tests run: 2, Failures: 0, Errors: 2, Skipped: 0
> [INFO] ------------------------------------------------------------------------
> [INFO] Reactor Summary:
> [INFO] 
> [INFO] Apache Drill Root POM ............................. SUCCESS [9.514s]
> [INFO] Drill Protocol .................................... SUCCESS [14.853s]
> [INFO] Common (Logical Plan, Base expressions) ........... SUCCESS [13.768s]
> [INFO] contrib/Parent Pom ................................ SUCCESS [1.163s]
> [INFO] contrib/data/Parent Pom ........................... SUCCESS [0.451s]
> [INFO] contrib/data/tpch-sample-data ..................... SUCCESS [5.622s]
> [INFO] contrib/storage-hive .............................. SUCCESS [25.144s]
> [INFO] exec/Parent Pom ................................... SUCCESS [1.064s]
> [INFO] exec/Netty Little Endian Buffers .................. SUCCESS [1.658s]
> [INFO] exec/Java Execution Engine ........................ SUCCESS [3:49.730s]
> [INFO] contrib/hbase-storage-plugin ...................... FAILURE [9.476s]
> [INFO] SQL Parser ........................................ SKIPPED
> [INFO] contrib/sqlline ................................... SKIPPED
> [INFO] Packaging and Distribution Assembly ............... SKIPPED
> [INFO] ------------------------------------------------------------------------
> [INFO] BUILD FAILURE
> [INFO] ------------------------------------------------------------------------
> {code}



--
This message was sent by Atlassian JIRA
(v6.2#6252)

Mime
View raw message