drill-dev mailing list archives

Site index · List index
Message view « Date » · « Thread »
Top « Date » · « Thread »
From "Aditya Kishore (JIRA)" <j...@apache.org>
Subject [jira] [Updated] (DRILL-656) Fix for test case failure in TestPoolChunkTrim
Date Sat, 10 May 2014 22:05:06 GMT

     [ https://issues.apache.org/jira/browse/DRILL-656?page=com.atlassian.jira.plugin.system.issuetabpanels:all-tabpanel
]

Aditya Kishore updated DRILL-656:
---------------------------------

    Fix Version/s: 1.0.0-rc1

> Fix for test case failure in TestPoolChunkTrim
> ----------------------------------------------
>
>                 Key: DRILL-656
>                 URL: https://issues.apache.org/jira/browse/DRILL-656
>             Project: Apache Drill
>          Issue Type: Bug
>         Environment: Windows
>            Reporter: Aditya Kishore
>            Assignee: Aditya Kishore
>             Fix For: 1.0.0-rc1
>
>         Attachments: DRILL-656-Fix-for-test-case-failure-in-TestPoolChunk.patch, DRILL-656-Fix-for-test-case-failure-in-TestPoolChunk.patch
>
>
> {noformat}
> ....
> Tests run: 9, Failures: 9, Errors: 0, Skipped: 0, Time elapsed: 0.434 sec <<<
FAILURE! - in io.netty.buffer.TestPoolChunkTrim
> tinyGrow(io.netty.buffer.TestPoolChunkTrim)  Time elapsed: 0.176 sec  <<< FAILURE!
> java.lang.AssertionError: Test failed to match pattern Chunk.* 8192/
>         at io.netty.buffer.TestPoolChunkTrim$TestAllocator.assertMatch(TestPoolChunkTrim.java:211)
>         at io.netty.buffer.TestPoolChunkTrim$TestAllocator.assertPages(TestPoolChunkTrim.java:184)
>         at io.netty.buffer.TestPoolChunkTrim.tinyGrow(TestPoolChunkTrim.java:133)
> multiPageTest(io.netty.buffer.TestPoolChunkTrim)  Time elapsed: 0.013 sec  <<<
FAILURE!
> java.lang.AssertionError: Test failed to match pattern Chunk.* 262144/
>         at io.netty.buffer.TestPoolChunkTrim$TestAllocator.assertMatch(TestPoolChunkTrim.java:211)
>         at io.netty.buffer.TestPoolChunkTrim$TestAllocator.assertPages(TestPoolChunkTrim.java:184)
>         at io.netty.buffer.TestPoolChunkTrim.normalTest(TestPoolChunkTrim.java:152)
>         at io.netty.buffer.TestPoolChunkTrim.multiPageTest(TestPoolChunkTrim.java:66)
> ....
> {noformat}



--
This message was sent by Atlassian JIRA
(v6.2#6252)

Mime
View raw message