drill-dev mailing list archives

Site index · List index
Message view « Date » · « Thread »
Top « Date » · « Thread »
From Apache Jenkins Server <jenk...@builds.apache.org>
Subject Build failed in Jenkins: drill-scm #590
Date Fri, 13 Nov 2015 23:07:05 GMT
See <https://builds.apache.org/job/drill-scm/590/changes>

Changes:

[altekrusejason] DRILL-3791: MySQL tests for JDBC plugin

[altekrusejason] DRILL-4082: Better error message when multiple versions of the same

------------------------------------------
[...truncated 84899 lines...]
                                              
Downloaded: http://repo.maven.apache.org/maven2/org/hsqldb/sqltool/2.3.2/sqltool-2.3.2.jar
(144 KB at 1199.8 KB/sec)
4/4 KB   90/548 KB   99/247 KB                
4/4 KB   94/548 KB   99/247 KB   
4/4 KB   98/548 KB   99/247 KB   
4/4 KB   99/548 KB   99/247 KB   
4/4 KB   102/548 KB   99/247 KB   
4/4 KB   106/548 KB   99/247 KB   
4/4 KB   110/548 KB   99/247 KB   
4/4 KB   114/548 KB   99/247 KB   
4/4 KB   118/548 KB   99/247 KB   
4/4 KB   122/548 KB   99/247 KB   
4/4 KB   125/548 KB   99/247 KB   
4/4 KB   125/548 KB   4/14 KB   99/247 KB   
4/4 KB   125/548 KB   8/14 KB   99/247 KB   
4/4 KB   125/548 KB   12/14 KB   99/247 KB   
4/4 KB   125/548 KB   14/14 KB   99/247 KB   
                                             
Downloaded: http://repo.maven.apache.org/maven2/org/slf4j/slf4j-nop/1.7.7/slf4j-nop-1.7.7.jar
(4 KB at 78.3 KB/sec)
125/548 KB   14/14 KB   103/247 KB           
125/548 KB   14/14 KB   107/247 KB   
125/548 KB   14/14 KB   111/247 KB   
125/548 KB   14/14 KB   115/247 KB   
125/548 KB   14/14 KB   119/247 KB   
125/548 KB   14/14 KB   123/247 KB   
125/548 KB   14/14 KB   127/247 KB   
125/548 KB   14/14 KB   131/247 KB   
125/548 KB   14/14 KB   135/247 KB   
125/548 KB   14/14 KB   139/247 KB   
125/548 KB   14/14 KB   143/247 KB   
125/548 KB   14/14 KB   147/247 KB   
125/548 KB   14/14 KB   151/247 KB   
125/548 KB   14/14 KB   155/247 KB   
125/548 KB   14/14 KB   159/247 KB   
125/548 KB   14/14 KB   163/247 KB   
125/548 KB   14/14 KB   167/247 KB   
125/548 KB   14/14 KB   171/247 KB   
125/548 KB   14/14 KB   175/247 KB   
125/548 KB   14/14 KB   179/247 KB   
125/548 KB   14/14 KB   183/247 KB   
125/548 KB   14/14 KB   187/247 KB   
125/548 KB   14/14 KB   191/247 KB   
125/548 KB   14/14 KB   195/247 KB   
125/548 KB   14/14 KB   199/247 KB   
125/548 KB   14/14 KB   203/247 KB   
125/548 KB   14/14 KB   207/247 KB   
125/548 KB   14/14 KB   211/247 KB   
125/548 KB   14/14 KB   212/247 KB   
129/548 KB   14/14 KB   212/247 KB   
133/548 KB   14/14 KB   212/247 KB   
137/548 KB   14/14 KB   212/247 KB   
141/548 KB   14/14 KB   212/247 KB   
145/548 KB   14/14 KB   212/247 KB   
149/548 KB   14/14 KB   212/247 KB   
153/548 KB   14/14 KB   212/247 KB   
156/548 KB   14/14 KB   212/247 KB   
160/548 KB   14/14 KB   212/247 KB   
162/548 KB   14/14 KB   212/247 KB   
166/548 KB   14/14 KB   212/247 KB   
170/548 KB   14/14 KB   212/247 KB   
173/548 KB   14/14 KB   212/247 KB   
177/548 KB   14/14 KB   212/247 KB   
179/548 KB   14/14 KB   212/247 KB   
183/548 KB   14/14 KB   212/247 KB   
187/548 KB   14/14 KB   212/247 KB   
189/548 KB   14/14 KB   212/247 KB   
189/548 KB   14/14 KB   216/247 KB   
189/548 KB   14/14 KB   220/247 KB   
189/548 KB   14/14 KB   224/247 KB   
189/548 KB   14/14 KB   228/247 KB   
189/548 KB   14/14 KB   232/247 KB   
189/548 KB   14/14 KB   236/247 KB   
189/548 KB   14/14 KB   240/247 KB   
189/548 KB   14/14 KB   244/247 KB   
189/548 KB   14/14 KB   247/247 KB   
                                     
Downloaded: http://repo.maven.apache.org/maven2/com/btmatthews/utils/monitor/2.1.3/monitor-2.1.3.jar
(14 KB at 265.9 KB/sec)
193/548 KB   247/247 KB              
197/548 KB   247/247 KB   
201/548 KB   247/247 KB   
205/548 KB   247/247 KB   
209/548 KB   247/247 KB   
213/548 KB   247/247 KB   
217/548 KB   247/247 KB   
221/548 KB   247/247 KB   
225/548 KB   247/247 KB   
229/548 KB   247/247 KB   
233/548 KB   247/247 KB   
236/548 KB   247/247 KB   
240/548 KB   247/247 KB   
244/548 KB   247/247 KB   
244/548 KB   247/247 KB   
248/548 KB   247/247 KB   
249/548 KB   247/247 KB   
253/548 KB   247/247 KB   
                          
Downloaded: http://repo.maven.apache.org/maven2/org/apache/derby/derbynet/10.10.2.0/derbynet-10.10.2.0.jar
(247 KB at 1318.1 KB/sec)
257/548 KB                
261/548 KB   
265/548 KB   
269/548 KB   
273/548 KB   
277/548 KB   
281/548 KB   
285/548 KB   
289/548 KB   
291/548 KB   
295/548 KB   
299/548 KB   
300/548 KB   
301/548 KB   
304/548 KB   
308/548 KB   
312/548 KB   
316/548 KB   
317/548 KB   
321/548 KB   
323/548 KB   
327/548 KB   
331/548 KB   
335/548 KB   
339/548 KB   
343/548 KB   
347/548 KB   
347/548 KB   
351/548 KB   
352/548 KB   
356/548 KB   
360/548 KB   
364/548 KB   
368/548 KB   
372/548 KB   
376/548 KB   
380/548 KB   
384/548 KB   
388/548 KB   
392/548 KB   
396/548 KB   
400/548 KB   
404/548 KB   
408/548 KB   
412/548 KB   
416/548 KB   
420/548 KB   
424/548 KB   
428/548 KB   
432/548 KB   
436/548 KB   
440/548 KB   
440/548 KB   
444/548 KB   
446/548 KB   
450/548 KB   
450/548 KB   
454/548 KB   
458/548 KB   
462/548 KB   
466/548 KB   
470/548 KB   
474/548 KB   
474/548 KB   
478/548 KB   
482/548 KB   
486/548 KB   
490/548 KB   
494/548 KB   
498/548 KB   
502/548 KB   
506/548 KB   
510/548 KB   
514/548 KB   
518/548 KB   
522/548 KB   
526/548 KB   
530/548 KB   
534/548 KB   
536/548 KB   
540/548 KB   
544/548 KB   
548/548 KB   
548/548 KB   
             
Downloaded: http://repo.maven.apache.org/maven2/org/dbunit/dbunit/2.5.0/dbunit-2.5.0.jar (548
KB at 2036.7 KB/sec)
[INFO] Skipping inmemdb:run because inmemdb.skip=='true'
[INFO] 
[INFO] --- jcabi-mysql-maven-plugin:0.8.2:start (mysql-test) @ drill-jdbc-storage ---
[INFO] jcabi-aspects 0.20.1/f0aff93 started new daemon thread jcabi-cacheable for automated
cleaning of expired @Cacheable values
Nov 13, 2015 11:01:57 PM org.hibernate.validator.internal.util.Version <clinit>
INFO: HV000001: Hibernate Validator 5.2.0.Alpha1
[ERROR] JSR-303 validator failed to initialize: HV000183: Unable to load 'javax.el.ExpressionFactory'.
Check that you have the EL dependencies on the classpath, or use ParameterMessageInterpolator
instead (see http://aspects.jcabi.com/jsr-303.html)
[INFO] jcabi-aspects 0.20.1/f0aff93 started new daemon thread jcabi-loggable for watching
of @Loggable annotated methods
[INFO] reuse existing database false
[INFO] created <https://builds.apache.org/job/drill-scm/ws/contrib/storage-jdbc/target/mysql-data>
directory
[INFO] $ <https://builds.apache.org/job/drill-scm/ws/contrib/storage-jdbc/target/mysql-dist/scripts/mysql_install_db>
--defaults-file=<https://builds.apache.org/job/drill-scm/ws/contrib/storage-jdbc/target/mysql-data/my-default.cnf>
--force --innodb_use_native_aio=0 --datadir=<https://builds.apache.org/job/drill-scm/ws/contrib/storage-jdbc/target/mysql-data/data>
--basedir=<https://builds.apache.org/job/drill-scm/ws/contrib/storage-jdbc/target/mysql-dist>
[WARNING] >> <https://builds.apache.org/job/drill-scm/ws/contrib/storage-jdbc/target/mysql-dist/bin/mysqld>:
error while loading shared libraries: libaio.so.1: cannot open shared object file: No such
file or directory
[INFO] >> Installing MySQL system tables...
[INFO] $ <https://builds.apache.org/job/drill-scm/ws/contrib/storage-jdbc/target/mysql-dist/bin/mysqld>
--no-defaults --user=jenkins --general_log --console --innodb_buffer_pool_size=64M --innodb_log_file_size=64M
--log_warnings --innodb_use_native_aio=0 --binlog-ignore-db=drill_mysql_test --basedir=<https://builds.apache.org/job/drill-scm/ws/contrib/storage-jdbc/target/mysql-dist>
--lc-messages-dir=<https://builds.apache.org/job/drill-scm/ws/contrib/storage-jdbc/target/mysql-dist/share>
--datadir=<https://builds.apache.org/job/drill-scm/ws/contrib/storage-jdbc/target/mysql-data/data>
--tmpdir=<https://builds.apache.org/job/drill-scm/ws/contrib/storage-jdbc/target/mysql-data/temp>
--socket=<https://builds.apache.org/job/drill-scm/ws/contrib/storage-jdbc/target/mysql-data/mysql.sock>
--pid-file=<https://builds.apache.org/job/drill-scm/ws/contrib/storage-jdbc/target/mysql-data/mysql.pid>
--port=52209
[INFO] >> <https://builds.apache.org/job/drill-scm/ws/contrib/storage-jdbc/target/mysql-dist/bin/mysqld>:
error while loading shared libraries: libaio.so.1: cannot open shared object file: No such
file or directory
[ERROR] #start('Config(tcpport=52209, dbuser=root, dbpassword=root, name=drill_mysql_test,
dbopts=[])', <https://builds.apache.org/job/drill-scm/ws/contrib/storage-jdbc/target/mysql-dist,>
<https://builds.apache.org/job/drill-scm/ws/contrib/storage-jdbc/target/mysql-data,>
true, NULL): thrown java.io.IOException(socket <https://builds.apache.org/job/drill-scm/ws/contrib/storage-jdbc/target/mysql-data/mysql.sock>
is not available after 5min of waiting) out of com.jcabi.mysql.maven.plugin.Instances#waitFor[322]
in 5min
[INFO] ------------------------------------------------------------------------
[INFO] Reactor Summary:
[INFO] 
[INFO] Apache Drill Root POM ............................. SUCCESS [8.366s]
[INFO] tools/Parent Pom .................................. SUCCESS [0.733s]
[INFO] tools/freemarker codegen tooling .................. SUCCESS [4.896s]
[INFO] Drill Protocol .................................... SUCCESS [8.334s]
[INFO] Common (Logical Plan, Base expressions) ........... SUCCESS [5.346s]
[INFO] Logical Plan, Base expressions .................... SUCCESS [9.225s]
[INFO] exec/Parent Pom ................................... SUCCESS [0.940s]
[INFO] exec/memory/Parent Pom ............................ SUCCESS [0.546s]
[INFO] exec/memory/base .................................. SUCCESS [2.114s]
[INFO] exec/memory/impl .................................. SUCCESS [2.965s]
[INFO] exec/rpc .......................................... SUCCESS [2.901s]
[INFO] exec/Vectors ...................................... SUCCESS [1:10.089s]
[INFO] contrib/Parent Pom ................................ SUCCESS [0.928s]
[INFO] contrib/data/Parent Pom ........................... SUCCESS [0.531s]
[INFO] contrib/data/tpch-sample-data ..................... SUCCESS [3.261s]
[INFO] exec/Java Execution Engine ........................ SUCCESS [39.163s]
[INFO] exec/JDBC Driver using dependencies ............... SUCCESS [10.026s]
[INFO] JDBC JAR with all dependencies .................... SUCCESS [45.335s]
[INFO] contrib/mongo-storage-plugin ...................... SUCCESS [6.224s]
[INFO] contrib/hbase-storage-plugin ...................... SUCCESS [9.927s]
[INFO] contrib/jdbc-storage-plugin ....................... FAILURE [5:33.634s]
[INFO] contrib/hive-storage-plugin/Parent Pom ............ SKIPPED
[INFO] contrib/hive-storage-plugin/hive-exec-shaded ...... SKIPPED
[INFO] contrib/hive-storage-plugin/core .................. SKIPPED
[INFO] contrib/drill-gis-plugin .......................... SKIPPED
[INFO] Packaging and Distribution Assembly ............... SKIPPED
[INFO] contrib/sqlline ................................... SKIPPED
[INFO] ------------------------------------------------------------------------
[INFO] BUILD FAILURE
[INFO] ------------------------------------------------------------------------
[INFO] Total time: 9:26.597s
[INFO] Finished at: Fri Nov 13 23:06:58 UTC 2015
[INFO] Final Memory: 143M/2172M
[INFO] ------------------------------------------------------------------------
[ERROR] Failed to execute goal com.jcabi:jcabi-mysql-maven-plugin:0.8.2:start (mysql-test)
on project drill-jdbc-storage: failed to start MySQL server: socket <https://builds.apache.org/job/drill-scm/ws/contrib/storage-jdbc/target/mysql-data/mysql.sock>
is not available after 5min of waiting -> [Help 1]
[ERROR] 
[ERROR] To see the full stack trace of the errors, re-run Maven with the -e switch.
[ERROR] Re-run Maven using the -X switch to enable full debug logging.
[ERROR] 
[ERROR] For more information about the errors and possible solutions, please read the following
articles:
[ERROR] [Help 1] http://cwiki.apache.org/confluence/display/MAVEN/MojoFailureException
[ERROR] 
[ERROR] After correcting the problems, you can resume the build with the command
[ERROR]   mvn <goals> -rf :drill-jdbc-storage
Build step 'Invoke top-level Maven targets' marked build as failure
Archiving artifacts
Compressed 183.32 MB of artifacts by 100.0% relative to #589

Mime
View raw message