falcon-dev mailing list archives

Site index · List index
Message view « Date » · « Thread »
Top « Date » · « Thread »
From Apache Jenkins Server <jenk...@builds.apache.org>
Subject Build failed in Jenkins: apache-falcon-nightly #1
Date Fri, 19 Jul 2013 05:47:39 GMT
See <https://builds.apache.org/job/apache-falcon-nightly/1/>

------------------------------------------
[...truncated 8188 lines...]
Generating <https://builds.apache.org/job/apache-falcon-nightly/ws/oozie-el-extensions/target/apidocs/constant-values.html...>
Generating <https://builds.apache.org/job/apache-falcon-nightly/ws/oozie-el-extensions/target/apidocs/org/apache/oozie/extensions//class-use/OozieELExtensions.html...>
Generating <https://builds.apache.org/job/apache-falcon-nightly/ws/oozie-el-extensions/target/apidocs/org/apache/oozie/extensions//package-use.html...>
Building index for all the packages and classes...
Generating <https://builds.apache.org/job/apache-falcon-nightly/ws/oozie-el-extensions/target/apidocs/overview-tree.html...>
Generating <https://builds.apache.org/job/apache-falcon-nightly/ws/oozie-el-extensions/target/apidocs/index-all.html...>
Generating <https://builds.apache.org/job/apache-falcon-nightly/ws/oozie-el-extensions/target/apidocs/deprecated-list.html...>
Building index for all classes...
Generating <https://builds.apache.org/job/apache-falcon-nightly/ws/oozie-el-extensions/target/apidocs/allclasses-frame.html...>
Generating <https://builds.apache.org/job/apache-falcon-nightly/ws/oozie-el-extensions/target/apidocs/allclasses-noframe.html...>
Generating <https://builds.apache.org/job/apache-falcon-nightly/ws/oozie-el-extensions/target/apidocs/index.html...>
Generating <https://builds.apache.org/job/apache-falcon-nightly/ws/oozie-el-extensions/target/apidocs/help-doc.html...>
Generating <https://builds.apache.org/job/apache-falcon-nightly/ws/oozie-el-extensions/target/apidocs/stylesheet.css...>
[INFO] Building jar: <https://builds.apache.org/job/apache-falcon-nightly/ws/oozie-el-extensions/target/falcon-oozie-el-extension-0.3-SNAPSHOT-javadoc.jar>
[WARNING] Artifact org.apache.falcon:falcon-oozie-el-extension:javadoc:javadoc:0.3-SNAPSHOT
already attached to project, ignoring duplicate
[INFO] Exclude: CHANGES.txt
[INFO] [INFO] Exclude: .git/**
[INFO] Exclude: .idea/**
[INFO] Exclude: docs/src/site/twiki/*.twiki
[INFO] Exclude: **/*.iml
[INFO] Exclude: **/target/**
[INFO] Exclude: **/activemq-data/**
[INFO] Exclude: **/build/**
[INFO] Exclude: *.patch
[INFO] Exclude: derby.log
[INFO] Exclude: **/logs/**

[INFO] --- apache-rat-plugin:0.7:check (rat-check) @ falcon-oozie-el-extension ---
[CHECKSTYLE] No report found for mojo check
[PMD] No report found for mojo check
[INFO] 
[INFO] --- maven-checkstyle-plugin:2.9.1:check (checkstyle-check) @ falcon-oozie-el-extension
---
[INFO] Starting audit...
Audit done.

[CHECKSTYLE] Parsing file <https://builds.apache.org/job/apache-falcon-nightly/ws/oozie-el-extensions/target/checkstyle-result.xml>
[CHECKSTYLE] Successfully parsed file <https://builds.apache.org/job/apache-falcon-nightly/ws/oozie-el-extensions/target/checkstyle-result.xml>
of module Apache Falcon Oozie EL Extension with 0 warnings.
[PMD] No report found for mojo check[INFO] Fork Value is true

[INFO] 
[INFO] --- findbugs-maven-plugin:2.5.2:findbugs (findbugs) @ falcon-oozie-el-extension ---
[INFO] Done FindBugs Analysis....
[FINDBUGS] Finding all files that match the pattern findbugsXml.xml
[FINDBUGS] Parsing 1 files in <https://builds.apache.org/job/apache-falcon-nightly/ws/oozie-el-extensions/target>
[FINDBUGS] Successfully parsed file <https://builds.apache.org/job/apache-falcon-nightly/ws/oozie-el-extensions/target/findbugsXml.xml>
of module Apache Falcon Oozie EL Extension with 0 warnings.
[PMD] No report found for mojo check[INFO] BugInstance size is 0
[INFO] Error size is 0
[INFO] No errors/warnings found

[INFO] 
[INFO] --- findbugs-maven-plugin:2.5.2:check (findbugs-check) @ falcon-oozie-el-extension
---
[PMD] No report found for mojo check
[INFO]                                                                         
[INFO] ------------------------------------------------------------------------
[INFO] Building Apache Falcon Embedded Hadoop - Test Cluster 0.3-SNAPSHOT
[INFO] ------------------------------------------------------------------------
[INFO] 
[INFO] --- maven-clean-plugin:2.4.1:clean (default-clean) @ falcon-hadoop-webapp ---
[INFO] [INFO] Checking for local modifications: skipped.
[INFO] Updating project files from SCM: skipped.
[INFO] Executing: /bin/sh -c cd <https://builds.apache.org/job/apache-falcon-nightly/ws/hadoop-webapp>
&& git show
[INFO] Working directory: <https://builds.apache.org/job/apache-falcon-nightly/ws/hadoop-webapp>
[INFO] Storing buildNumber: 8d2d34b9d1999447b35495a75c0bd52b4396e1bb at timestamp: 1374212827053
[INFO] Executing: /bin/sh -c cd <https://builds.apache.org/job/apache-falcon-nightly/ws/hadoop-webapp>
&& git show
[INFO] Working directory: <https://builds.apache.org/job/apache-falcon-nightly/ws/hadoop-webapp>
[INFO] Storing buildScmBranch: UNKNOWN

[INFO] --- buildnumber-maven-plugin:1.0:create (default) @ falcon-hadoop-webapp ---
[INFO] [debug] execute contextualize
[INFO] Using 'UTF-8' encoding to copy filtered resources.
[INFO] Copying 5 resources

[INFO] --- maven-resources-plugin:2.5:resources (default-resources) @ falcon-hadoop-webapp
---
[INFO] [INFO] Compiling 1 source file to <https://builds.apache.org/job/apache-falcon-nightly/ws/hadoop-webapp/target/classes>

[INFO] --- maven-compiler-plugin:2.3.2:compile (default-compile) @ falcon-hadoop-webapp ---
[debug] execute contextualize
[INFO] [INFO] Using 'UTF-8' encoding to copy filtered resources.
[INFO] skip non existing resourceDirectory <https://builds.apache.org/job/apache-falcon-nightly/ws/hadoop-webapp/src/test/resources>

[INFO] --- maven-resources-plugin:2.5:testResources (default-testResources) @ falcon-hadoop-webapp
---
[INFO] [INFO] No sources to compile

[INFO] --- maven-compiler-plugin:2.3.2:testCompile (default-testCompile) @ falcon-hadoop-webapp
---
[INFO] [INFO] No tests to run.

[INFO] --- maven-surefire-plugin:2.14:test (default-test) @ falcon-hadoop-webapp ---
[JENKINS] Recording test results
[INFO] 
[INFO] --- maven-dependency-plugin:2.8:unpack (explode-war) @ falcon-hadoop-webapp ---
[INFO] Configured Artifact: org.apache.oozie:oozie-webapp:?:war
Downloading: http://repo1.maven.org/maven2/org/apache/oozie/oozie-webapp/3.2.2/oozie-webapp-3.2.2.war
Downloading: https://raw.github.com/InMobi/mvn-repo/master/releases/org/apache/oozie/oozie-webapp/3.2.2/oozie-webapp-3.2.2.war
Downloading: http://repository.codehaus.org/org/apache/oozie/oozie-webapp/3.2.2/oozie-webapp-3.2.2.war
Downloading: https://repository.apache.org/content/groups/snapshots/org/apache/oozie/oozie-webapp/3.2.2/oozie-webapp-3.2.2.war
Downloading: https://repository.apache.org/content/groups/public/org/apache/oozie/oozie-webapp/3.2.2/oozie-webapp-3.2.2.war
Downloading: https://maven.java.net/content/groups/public/org/apache/oozie/oozie-webapp/3.2.2/oozie-webapp-3.2.2.war
Downloading: https://repository.jboss.org/nexus/content/groups/public/org/apache/oozie/oozie-webapp/3.2.2/oozie-webapp-3.2.2.war
Downloading: https://repository.cloudera.com/content/groups/cloudera-repos/org/apache/oozie/oozie-webapp/3.2.2/oozie-webapp-3.2.2.war
[INFO] ------------------------------------------------------------------------
[INFO] Reactor Summary:
[INFO] 
[INFO] Build Tools ....................................... SUCCESS [1:24.535s]
[INFO] Apache Falcon ..................................... SUCCESS [19.846s]
[INFO] Apache Falcon CLI client .......................... SUCCESS [1:33.607s]
[INFO] Apache Falcon Metrics ............................. SUCCESS [18.858s]
[INFO] Apache Falcon Test Utility ........................ SUCCESS [20.565s]
[INFO] Apache Falcon Commons ............................. SUCCESS [2:38.542s]
[INFO] Apache Falcon Oozie EL Extension .................. SUCCESS [30.327s]
[INFO] Apache Falcon Embedded Hadoop - Test Cluster ...... FAILURE [5.485s]
[INFO] Apache Falcon Messaging ........................... SKIPPED
[INFO] Apache Falcon Oozie Adaptor ....................... SKIPPED
[INFO] Apache Falcon Feed ................................ SKIPPED
[INFO] Apache Falcon Process ............................. SKIPPED
[INFO] Apache Falcon Acquisition ......................... SKIPPED
[INFO] Apache Falcon Replication ......................... SKIPPED
[INFO] Apache Falcon Retention ........................... SKIPPED
[INFO] Apache Falcon Archival ............................ SKIPPED
[INFO] Apache Falcon Rerun ............................... SKIPPED
[INFO] Apache Falcon Prism ............................... SKIPPED
[INFO] Apache Falcon Web Application ..................... SKIPPED
[INFO] ------------------------------------------------------------------------
[INFO] BUILD FAILURE
[INFO] ------------------------------------------------------------------------
[INFO] Total time: 7:15.165s
[INFO] Finished at: Fri Jul 19 05:47:12 UTC 2013
[INFO] Final Memory: 74M/157M
[INFO] ------------------------------------------------------------------------
[JENKINS] Archiving <https://builds.apache.org/job/apache-falcon-nightly/ws/prism/pom.xml>
to /home/hudson/hudson/jobs/apache-falcon-nightly/modules/org.apache.falcon$falcon-prism/builds/2013-07-19_05-39-35/archive/org.apache.falcon/falcon-prism/0.3-SNAPSHOT/falcon-prism-0.3-SNAPSHOT.pom
[JENKINS] Archiving <https://builds.apache.org/job/apache-falcon-nightly/ws/oozie-el-extensions/pom.xml>
to /home/hudson/hudson/jobs/apache-falcon-nightly/modules/org.apache.falcon$falcon-oozie-el-extension/builds/2013-07-19_05-39-35/archive/org.apache.falcon/falcon-oozie-el-extension/0.3-SNAPSHOT/falcon-oozie-el-extension-0.3-SNAPSHOT.pom
[JENKINS] Archiving <https://builds.apache.org/job/apache-falcon-nightly/ws/oozie-el-extensions/target/falcon-oozie-el-extension-0.3-SNAPSHOT.jar>
to /home/hudson/hudson/jobs/apache-falcon-nightly/modules/org.apache.falcon$falcon-oozie-el-extension/builds/2013-07-19_05-39-35/archive/org.apache.falcon/falcon-oozie-el-extension/0.3-SNAPSHOT/falcon-oozie-el-extension-0.3-SNAPSHOT.jar
[JENKINS] Archiving <https://builds.apache.org/job/apache-falcon-nightly/ws/oozie-el-extensions/target/falcon-oozie-el-extension-0.3-SNAPSHOT-sources.jar>
to /home/hudson/hudson/jobs/apache-falcon-nightly/modules/org.apache.falcon$falcon-oozie-el-extension/builds/2013-07-19_05-39-35/archive/org.apache.falcon/falcon-oozie-el-extension/0.3-SNAPSHOT/falcon-oozie-el-extension-0.3-SNAPSHOT-sources.jar
[JENKINS] Archiving <https://builds.apache.org/job/apache-falcon-nightly/ws/oozie-el-extensions/target/falcon-oozie-el-extension-0.3-SNAPSHOT-javadoc.jar>
to /home/hudson/hudson/jobs/apache-falcon-nightly/modules/org.apache.falcon$falcon-oozie-el-extension/builds/2013-07-19_05-39-35/archive/org.apache.falcon/falcon-oozie-el-extension/0.3-SNAPSHOT/falcon-oozie-el-extension-0.3-SNAPSHOT-javadoc.jar
[JENKINS] Archiving <https://builds.apache.org/job/apache-falcon-nightly/ws/webapp/pom.xml>
to /home/hudson/hudson/jobs/apache-falcon-nightly/modules/org.apache.falcon$falcon-webapp/builds/2013-07-19_05-39-35/archive/org.apache.falcon/falcon-webapp/0.3-SNAPSHOT/falcon-webapp-0.3-SNAPSHOT.pom
[JENKINS] Archiving <https://builds.apache.org/job/apache-falcon-nightly/ws/acquisition/pom.xml>
to /home/hudson/hudson/jobs/apache-falcon-nightly/modules/org.apache.falcon$falcon-acquisition/builds/2013-07-19_05-39-35/archive/org.apache.falcon/falcon-acquisition/0.3-SNAPSHOT/falcon-acquisition-0.3-SNAPSHOT.pom
[JENKINS] Archiving <https://builds.apache.org/job/apache-falcon-nightly/ws/pom.xml>
to /home/hudson/hudson/jobs/apache-falcon-nightly/modules/org.apache.falcon$falcon-main/builds/2013-07-19_05-39-35/archive/org.apache.falcon/falcon-main/0.3-SNAPSHOT/falcon-main-0.3-SNAPSHOT.pom
[JENKINS] Archiving <https://builds.apache.org/job/apache-falcon-nightly/ws/metrics/pom.xml>
to /home/hudson/hudson/jobs/apache-falcon-nightly/modules/org.apache.falcon$falcon-metrics/builds/2013-07-19_05-39-35/archive/org.apache.falcon/falcon-metrics/0.3-SNAPSHOT/falcon-metrics-0.3-SNAPSHOT.pom
[JENKINS] Archiving <https://builds.apache.org/job/apache-falcon-nightly/ws/metrics/target/falcon-metrics-0.3-SNAPSHOT.jar>
to /home/hudson/hudson/jobs/apache-falcon-nightly/modules/org.apache.falcon$falcon-metrics/builds/2013-07-19_05-39-35/archive/org.apache.falcon/falcon-metrics/0.3-SNAPSHOT/falcon-metrics-0.3-SNAPSHOT.jar
[JENKINS] Archiving <https://builds.apache.org/job/apache-falcon-nightly/ws/metrics/target/falcon-metrics-0.3-SNAPSHOT-sources.jar>
to /home/hudson/hudson/jobs/apache-falcon-nightly/modules/org.apache.falcon$falcon-metrics/builds/2013-07-19_05-39-35/archive/org.apache.falcon/falcon-metrics/0.3-SNAPSHOT/falcon-metrics-0.3-SNAPSHOT-sources.jar
[JENKINS] Archiving <https://builds.apache.org/job/apache-falcon-nightly/ws/metrics/target/falcon-metrics-0.3-SNAPSHOT-javadoc.jar>
to /home/hudson/hudson/jobs/apache-falcon-nightly/modules/org.apache.falcon$falcon-metrics/builds/2013-07-19_05-39-35/archive/org.apache.falcon/falcon-metrics/0.3-SNAPSHOT/falcon-metrics-0.3-SNAPSHOT-javadoc.jar
[JENKINS] Archiving <https://builds.apache.org/job/apache-falcon-nightly/ws/feed/pom.xml>
to /home/hudson/hudson/jobs/apache-falcon-nightly/modules/org.apache.falcon$falcon-feed/builds/2013-07-19_05-39-35/archive/org.apache.falcon/falcon-feed/0.3-SNAPSHOT/falcon-feed-0.3-SNAPSHOT.pom
[JENKINS] Archiving <https://builds.apache.org/job/apache-falcon-nightly/ws/messaging/pom.xml>
to /home/hudson/hudson/jobs/apache-falcon-nightly/modules/org.apache.falcon$falcon-messaging/builds/2013-07-19_05-39-35/archive/org.apache.falcon/falcon-messaging/0.3-SNAPSHOT/falcon-messaging-0.3-SNAPSHOT.pom
[JENKINS] Archiving <https://builds.apache.org/job/apache-falcon-nightly/ws/retention/pom.xml>
to /home/hudson/hudson/jobs/apache-falcon-nightly/modules/org.apache.falcon$falcon-retention/builds/2013-07-19_05-39-35/archive/org.apache.falcon/falcon-retention/0.3-SNAPSHOT/falcon-retention-0.3-SNAPSHOT.pom
[JENKINS] Archiving <https://builds.apache.org/job/apache-falcon-nightly/ws/test-util/pom.xml>
to /home/hudson/hudson/jobs/apache-falcon-nightly/modules/org.apache.falcon$falcon-test-util/builds/2013-07-19_05-39-35/archive/org.apache.falcon/falcon-test-util/0.3-SNAPSHOT/falcon-test-util-0.3-SNAPSHOT.pom
[JENKINS] Archiving <https://builds.apache.org/job/apache-falcon-nightly/ws/test-util/target/falcon-test-util-0.3-SNAPSHOT.jar>
to /home/hudson/hudson/jobs/apache-falcon-nightly/modules/org.apache.falcon$falcon-test-util/builds/2013-07-19_05-39-35/archive/org.apache.falcon/falcon-test-util/0.3-SNAPSHOT/falcon-test-util-0.3-SNAPSHOT.jar
[JENKINS] Archiving <https://builds.apache.org/job/apache-falcon-nightly/ws/test-util/target/falcon-test-util-0.3-SNAPSHOT-sources.jar>
to /home/hudson/hudson/jobs/apache-falcon-nightly/modules/org.apache.falcon$falcon-test-util/builds/2013-07-19_05-39-35/archive/org.apache.falcon/falcon-test-util/0.3-SNAPSHOT/falcon-test-util-0.3-SNAPSHOT-sources.jar
[JENKINS] Archiving <https://builds.apache.org/job/apache-falcon-nightly/ws/test-util/target/falcon-test-util-0.3-SNAPSHOT-javadoc.jar>
to /home/hudson/hudson/jobs/apache-falcon-nightly/modules/org.apache.falcon$falcon-test-util/builds/2013-07-19_05-39-35/archive/org.apache.falcon/falcon-test-util/0.3-SNAPSHOT/falcon-test-util-0.3-SNAPSHOT-javadoc.jar
[JENKINS] Archiving <https://builds.apache.org/job/apache-falcon-nightly/ws/archival/pom.xml>
to /home/hudson/hudson/jobs/apache-falcon-nightly/modules/org.apache.falcon$falcon-archival/builds/2013-07-19_05-39-35/archive/org.apache.falcon/falcon-archival/0.3-SNAPSHOT/falcon-archival-0.3-SNAPSHOT.pom
[JENKINS] Archiving <https://builds.apache.org/job/apache-falcon-nightly/ws/replication/pom.xml>
to /home/hudson/hudson/jobs/apache-falcon-nightly/modules/org.apache.falcon$falcon-replication/builds/2013-07-19_05-39-35/archive/org.apache.falcon/falcon-replication/0.3-SNAPSHOT/falcon-replication-0.3-SNAPSHOT.pom
[JENKINS] Archiving <https://builds.apache.org/job/apache-falcon-nightly/ws/process/pom.xml>
to /home/hudson/hudson/jobs/apache-falcon-nightly/modules/org.apache.falcon$falcon-process/builds/2013-07-19_05-39-35/archive/org.apache.falcon/falcon-process/0.3-SNAPSHOT/falcon-process-0.3-SNAPSHOT.pom
[JENKINS] Archiving <https://builds.apache.org/job/apache-falcon-nightly/ws/common/pom.xml>
to /home/hudson/hudson/jobs/apache-falcon-nightly/modules/org.apache.falcon$falcon-common/builds/2013-07-19_05-39-35/archive/org.apache.falcon/falcon-common/0.3-SNAPSHOT/falcon-common-0.3-SNAPSHOT.pom
[JENKINS] Archiving <https://builds.apache.org/job/apache-falcon-nightly/ws/common/target/falcon-common-0.3-SNAPSHOT.jar>
to /home/hudson/hudson/jobs/apache-falcon-nightly/modules/org.apache.falcon$falcon-common/builds/2013-07-19_05-39-35/archive/org.apache.falcon/falcon-common/0.3-SNAPSHOT/falcon-common-0.3-SNAPSHOT.jar
[JENKINS] Archiving <https://builds.apache.org/job/apache-falcon-nightly/ws/common/target/falcon-common-0.3-SNAPSHOT-sources.jar>
to /home/hudson/hudson/jobs/apache-falcon-nightly/modules/org.apache.falcon$falcon-common/builds/2013-07-19_05-39-35/archive/org.apache.falcon/falcon-common/0.3-SNAPSHOT/falcon-common-0.3-SNAPSHOT-sources.jar
[JENKINS] Archiving <https://builds.apache.org/job/apache-falcon-nightly/ws/common/target/falcon-common-0.3-SNAPSHOT-javadoc.jar>
to /home/hudson/hudson/jobs/apache-falcon-nightly/modules/org.apache.falcon$falcon-common/builds/2013-07-19_05-39-35/archive/org.apache.falcon/falcon-common/0.3-SNAPSHOT/falcon-common-0.3-SNAPSHOT-javadoc.jar
[JENKINS] Archiving <https://builds.apache.org/job/apache-falcon-nightly/ws/build-tools/pom.xml>
to /home/hudson/hudson/jobs/apache-falcon-nightly/modules/org.apache.falcon$build-tools/builds/2013-07-19_05-39-35/archive/org.apache.falcon/build-tools/0.3-SNAPSHOT/build-tools-0.3-SNAPSHOT.pom
[JENKINS] Archiving <https://builds.apache.org/job/apache-falcon-nightly/ws/build-tools/target/build-tools-0.3-SNAPSHOT.jar>
to /home/hudson/hudson/jobs/apache-falcon-nightly/modules/org.apache.falcon$build-tools/builds/2013-07-19_05-39-35/archive/org.apache.falcon/build-tools/0.3-SNAPSHOT/build-tools-0.3-SNAPSHOT.jar
[JENKINS] Archiving <https://builds.apache.org/job/apache-falcon-nightly/ws/client/pom.xml>
to /home/hudson/hudson/jobs/apache-falcon-nightly/modules/org.apache.falcon$falcon-client/builds/2013-07-19_05-39-35/archive/org.apache.falcon/falcon-client/0.3-SNAPSHOT/falcon-client-0.3-SNAPSHOT.pom
[JENKINS] Archiving <https://builds.apache.org/job/apache-falcon-nightly/ws/client/target/falcon-client-0.3-SNAPSHOT.jar>
to /home/hudson/hudson/jobs/apache-falcon-nightly/modules/org.apache.falcon$falcon-client/builds/2013-07-19_05-39-35/archive/org.apache.falcon/falcon-client/0.3-SNAPSHOT/falcon-client-0.3-SNAPSHOT.jar
[JENKINS] Archiving <https://builds.apache.org/job/apache-falcon-nightly/ws/client/target/falcon-client-0.3-SNAPSHOT-sources.jar>
to /home/hudson/hudson/jobs/apache-falcon-nightly/modules/org.apache.falcon$falcon-client/builds/2013-07-19_05-39-35/archive/org.apache.falcon/falcon-client/0.3-SNAPSHOT/falcon-client-0.3-SNAPSHOT-sources.jar
[JENKINS] Archiving <https://builds.apache.org/job/apache-falcon-nightly/ws/client/target/falcon-client-0.3-SNAPSHOT-javadoc.jar>
to /home/hudson/hudson/jobs/apache-falcon-nightly/modules/org.apache.falcon$falcon-client/builds/2013-07-19_05-39-35/archive/org.apache.falcon/falcon-client/0.3-SNAPSHOT/falcon-client-0.3-SNAPSHOT-javadoc.jar
[JENKINS] Archiving <https://builds.apache.org/job/apache-falcon-nightly/ws/rerun/pom.xml>
to /home/hudson/hudson/jobs/apache-falcon-nightly/modules/org.apache.falcon$falcon-rerun/builds/2013-07-19_05-39-35/archive/org.apache.falcon/falcon-rerun/0.3-SNAPSHOT/falcon-rerun-0.3-SNAPSHOT.pom
[JENKINS] Archiving <https://builds.apache.org/job/apache-falcon-nightly/ws/hadoop-webapp/pom.xml>
to /home/hudson/hudson/jobs/apache-falcon-nightly/modules/org.apache.falcon$falcon-hadoop-webapp/builds/2013-07-19_05-39-35/archive/org.apache.falcon/falcon-hadoop-webapp/0.3-SNAPSHOT/falcon-hadoop-webapp-0.3-SNAPSHOT.pom
[JENKINS] Archiving <https://builds.apache.org/job/apache-falcon-nightly/ws/oozie/pom.xml>
to /home/hudson/hudson/jobs/apache-falcon-nightly/modules/org.apache.falcon$falcon-oozie-adaptor/builds/2013-07-19_05-39-35/archive/org.apache.falcon/falcon-oozie-adaptor/0.3-SNAPSHOT/falcon-oozie-adaptor-0.3-SNAPSHOT.pom
Waiting for Jenkins to finish collecting data
mavenExecutionResult exceptions not empty
message : Failed to execute goal org.apache.maven.plugins:maven-dependency-plugin:2.8:unpack
(explode-war) on project falcon-hadoop-webapp: Unable to find artifact.
cause : Unable to find artifact.
Stack trace : 
org.apache.maven.lifecycle.LifecycleExecutionException: Failed to execute goal org.apache.maven.plugins:maven-dependency-plugin:2.8:unpack
(explode-war) on project falcon-hadoop-webapp: Unable to find artifact.
	at org.apache.maven.lifecycle.internal.MojoExecutor.execute(MojoExecutor.java:217)
	at org.apache.maven.lifecycle.internal.MojoExecutor.execute(MojoExecutor.java:153)
	at org.apache.maven.lifecycle.internal.MojoExecutor.execute(MojoExecutor.java:145)
	at org.apache.maven.lifecycle.internal.LifecycleModuleBuilder.buildProject(LifecycleModuleBuilder.java:84)
	at org.apache.maven.lifecycle.internal.LifecycleModuleBuilder.buildProject(LifecycleModuleBuilder.java:59)
	at org.apache.maven.lifecycle.internal.LifecycleStarter.singleThreadedBuild(LifecycleStarter.java:183)
	at org.apache.maven.lifecycle.internal.LifecycleStarter.execute(LifecycleStarter.java:161)
	at org.apache.maven.DefaultMaven.doExecute(DefaultMaven.java:320)
	at org.apache.maven.DefaultMaven.execute(DefaultMaven.java:156)
	at org.jvnet.hudson.maven3.launcher.Maven3Launcher.main(Maven3Launcher.java:79)
	at sun.reflect.NativeMethodAccessorImpl.invoke0(Native Method)
	at sun.reflect.NativeMethodAccessorImpl.invoke(NativeMethodAccessorImpl.java:39)
	at sun.reflect.DelegatingMethodAccessorImpl.invoke(DelegatingMethodAccessorImpl.java:25)
	at java.lang.reflect.Method.invoke(Method.java:597)
	at org.codehaus.plexus.classworlds.launcher.Launcher.launchStandard(Launcher.java:329)
	at org.codehaus.plexus.classworlds.launcher.Launcher.launch(Launcher.java:239)
	at org.jvnet.hudson.maven3.agent.Maven3Main.launch(Maven3Main.java:158)
	at hudson.maven.Maven3Builder.call(Maven3Builder.java:100)
	at hudson.maven.Maven3Builder.call(Maven3Builder.java:66)
	at hudson.remoting.UserRequest.perform(UserRequest.java:118)
	at hudson.remoting.UserRequest.perform(UserRequest.java:48)
	at hudson.remoting.Request$2.run(Request.java:326)
	at hudson.remoting.InterceptingExecutorService$1.call(InterceptingExecutorService.java:72)
	at java.util.concurrent.FutureTask$Sync.innerRun(FutureTask.java:303)
	at java.util.concurrent.FutureTask.run(FutureTask.java:138)
	at java.util.concurrent.ThreadPoolExecutor$Worker.runTask(ThreadPoolExecutor.java:895)
	at java.util.concurrent.ThreadPoolExecutor$Worker.run(ThreadPoolExecutor.java:918)
	at java.lang.Thread.run(Thread.java:662)
Caused by: org.apache.maven.plugin.MojoExecutionException: Unable to find artifact.
	at org.apache.maven.plugin.dependency.fromConfiguration.AbstractFromConfigurationMojo.getArtifact(AbstractFromConfigurationMojo.java:265)
	at org.apache.maven.plugin.dependency.fromConfiguration.AbstractFromConfigurationMojo.getProcessedArtifactItems(AbstractFromConfigurationMojo.java:171)
	at org.apache.maven.plugin.dependency.fromConfiguration.UnpackMojo.getProcessedArtifactItems(UnpackMojo.java:144)
	at org.apache.maven.plugin.dependency.fromConfiguration.UnpackMojo.doExecute(UnpackMojo.java:101)
	at org.apache.maven.plugin.dependency.AbstractDependencyMojo.execute(AbstractDependencyMojo.java:167)
	at org.apache.maven.plugin.DefaultBuildPluginManager.executeMojo(DefaultBuildPluginManager.java:101)
	at org.apache.maven.lifecycle.internal.MojoExecutor.execute(MojoExecutor.java:209)
	... 27 more
Caused by: org.apache.maven.artifact.resolver.ArtifactNotFoundException: Could not find artifact
org.apache.oozie:oozie-webapp:war:3.2.2 in central (http://repo1.maven.org/maven2)

Try downloading the file manually from the project website.

Then, install it using the command: 
    mvn install:install-file -DgroupId=org.apache.oozie -DartifactId=oozie-webapp -Dversion=3.2.2
-Dpackaging=war -Dfile=/path/to/file

Alternatively, if you host your own repository you can deploy the file there: 
    mvn deploy:deploy-file -DgroupId=org.apache.oozie -DartifactId=oozie-webapp -Dversion=3.2.2
-Dpackaging=war -Dfile=/path/to/file -Durl=[url] -DrepositoryId=[id]


  org.apache.oozie:oozie-webapp:war:3.2.2

from the specified remote repositories:
  central (http://repo1.maven.org/maven2, releases=true, snapshots=false),
  im (https://raw.github.com/InMobi/mvn-repo/master/releases, releases=true, snapshots=false),
  Codehaus repository (http://repository.codehaus.org/, releases=true, snapshots=false),
  apache.snapshots.repo (https://repository.apache.org/content/groups/snapshots, releases=true,
snapshots=true),
  default (https://repository.apache.org/content/groups/public/, releases=true, snapshots=true),
  java.net-Public (https://maven.java.net/content/groups/public/, releases=true, snapshots=true),
  repository.jboss.org-public (https://repository.jboss.org/nexus/content/groups/public, releases=true,
snapshots=true),
  cdh.repo (https://repository.cloudera.com/content/groups/cloudera-repos, releases=true,
snapshots=false)

	at org.apache.maven.artifact.resolver.DefaultArtifactResolver.resolve(DefaultArtifactResolver.java:219)
	at org.apache.maven.artifact.resolver.DefaultArtifactResolver.resolve(DefaultArtifactResolver.java:157)
	at org.apache.maven.artifact.resolver.DefaultArtifactResolver.resolve(DefaultArtifactResolver.java:525)
	at org.apache.maven.plugin.dependency.fromConfiguration.AbstractFromConfigurationMojo.getArtifact(AbstractFromConfigurationMojo.java:257)
	... 33 more
Caused by: org.sonatype.aether.resolution.ArtifactResolutionException: Could not find artifact
org.apache.oozie:oozie-webapp:war:3.2.2 in central (http://repo1.maven.org/maven2)
	at org.sonatype.aether.impl.internal.DefaultArtifactResolver.resolve(DefaultArtifactResolver.java:538)
	at org.sonatype.aether.impl.internal.DefaultArtifactResolver.resolveArtifacts(DefaultArtifactResolver.java:216)
	at org.sonatype.aether.impl.internal.DefaultArtifactResolver.resolveArtifact(DefaultArtifactResolver.java:193)
	at org.sonatype.aether.impl.internal.DefaultRepositorySystem.resolveArtifact(DefaultRepositorySystem.java:286)
	at org.apache.maven.artifact.resolver.DefaultArtifactResolver.resolve(DefaultArtifactResolver.java:213)
	... 36 more
Caused by: org.sonatype.aether.transfer.ArtifactNotFoundException: Could not find artifact
org.apache.oozie:oozie-webapp:war:3.2.2 in central (http://repo1.maven.org/maven2)
	at org.sonatype.aether.connector.wagon.WagonRepositoryConnector$4.wrap(WagonRepositoryConnector.java:947)
	at org.sonatype.aether.connector.wagon.WagonRepositoryConnector$4.wrap(WagonRepositoryConnector.java:941)
	at org.sonatype.aether.connector.wagon.WagonRepositoryConnector$GetTask.run(WagonRepositoryConnector.java:669)
	at org.sonatype.aether.util.concurrency.RunnableErrorForwarder$1.run(RunnableErrorForwarder.java:60)
	... 3 more
Sending e-mails to: dev@falcon.incubator.apache.org
channel stopped

Mime
View raw message