falcon-dev mailing list archives

Site index · List index
Message view « Date » · « Thread »
Top « Date » · « Thread »
From Apache Jenkins Server <jenk...@builds.apache.org>
Subject Build failed in Jenkins: Apache-Falcon-Distributed-Assembly #3
Date Tue, 11 Mar 2014 13:09:40 GMT
See <https://builds.apache.org/job/Apache-Falcon-Distributed-Assembly/3/>

------------------------------------------
[...truncated 351 lines...]
[INFO] Copying 1 resource
[INFO] Copying 3 resources
[INFO] 
[INFO] --- maven-compiler-plugin:2.3.2:compile (default-compile) @ falcon-client ---
[INFO] Compiling 71 source files to <https://builds.apache.org/job/Apache-Falcon-Distributed-Assembly/ws/client/target/classes>
[INFO] 
[INFO] --- maven-resources-plugin:2.6:testResources (default-testResources) @ falcon-client
---
[INFO] Using 'UTF-8' encoding to copy filtered resources.
[INFO] skip non existing resourceDirectory <https://builds.apache.org/job/Apache-Falcon-Distributed-Assembly/ws/client/src/test/resources>
[INFO] Copying 3 resources
[INFO] 
[INFO] --- maven-compiler-plugin:2.3.2:testCompile (default-testCompile) @ falcon-client ---
[INFO] Compiling 3 source files to <https://builds.apache.org/job/Apache-Falcon-Distributed-Assembly/ws/client/target/test-classes>
[INFO] 
[INFO] --- maven-surefire-plugin:2.16:test (default-test) @ falcon-client ---
[INFO] Tests are skipped.
[INFO] 
[INFO] --- maven-site-plugin:3.2:site (default) @ falcon-client ---
[INFO] maven.site.skip = true: Skipping site generation
[INFO] 
[INFO] --- maven-jar-plugin:2.4:jar (default-jar) @ falcon-client ---
[INFO] Building jar: <https://builds.apache.org/job/Apache-Falcon-Distributed-Assembly/ws/client/target/falcon-client-0.5-incubating-SNAPSHOT.jar>
[INFO] 
[INFO] --- maven-site-plugin:3.2:attach-descriptor (attach-descriptor) @ falcon-client ---
[INFO] 
[INFO] --- maven-dependency-plugin:2.1:copy-dependencies (default) @ falcon-client ---
[INFO] Copying ant-1.6.5.jar to <https://builds.apache.org/job/Apache-Falcon-Distributed-Assembly/ws/client/target/dependency/ant-1.6.5.jar>
[INFO] Copying jcommander-1.12.jar to <https://builds.apache.org/job/Apache-Falcon-Distributed-Assembly/ws/client/target/dependency/jcommander-1.12.jar>
[INFO] Copying jersey-client-1.9.jar to <https://builds.apache.org/job/Apache-Falcon-Distributed-Assembly/ws/client/target/dependency/jersey-client-1.9.jar>
[INFO] Copying jersey-core-1.9.jar to <https://builds.apache.org/job/Apache-Falcon-Distributed-Assembly/ws/client/target/dependency/jersey-core-1.9.jar>
[INFO] Copying jersey-json-1.9.jar to <https://builds.apache.org/job/Apache-Falcon-Distributed-Assembly/ws/client/target/dependency/jersey-json-1.9.jar>
[INFO] Copying jaxb-impl-2.2.3-1.jar to <https://builds.apache.org/job/Apache-Falcon-Distributed-Assembly/ws/client/target/dependency/jaxb-impl-2.2.3-1.jar>
[INFO] Copying commons-beanutils-1.8.3.jar to <https://builds.apache.org/job/Apache-Falcon-Distributed-Assembly/ws/client/target/dependency/commons-beanutils-1.8.3.jar>
[INFO] Copying commons-beanutils-core-1.8.0.jar to <https://builds.apache.org/job/Apache-Falcon-Distributed-Assembly/ws/client/target/dependency/commons-beanutils-core-1.8.0.jar>
[INFO] Copying commons-cli-1.2.jar to <https://builds.apache.org/job/Apache-Falcon-Distributed-Assembly/ws/client/target/dependency/commons-cli-1.2.jar>
[INFO] Copying commons-codec-1.8.jar to <https://builds.apache.org/job/Apache-Falcon-Distributed-Assembly/ws/client/target/dependency/commons-codec-1.8.jar>
[INFO] Copying commons-collections-3.2.1.jar to <https://builds.apache.org/job/Apache-Falcon-Distributed-Assembly/ws/client/target/dependency/commons-collections-3.2.1.jar>
[INFO] Copying commons-configuration-1.6.jar to <https://builds.apache.org/job/Apache-Falcon-Distributed-Assembly/ws/client/target/dependency/commons-configuration-1.6.jar>
[INFO] Copying commons-digester-1.8.jar to <https://builds.apache.org/job/Apache-Falcon-Distributed-Assembly/ws/client/target/dependency/commons-digester-1.8.jar>
[INFO] Copying commons-el-1.0.jar to <https://builds.apache.org/job/Apache-Falcon-Distributed-Assembly/ws/client/target/dependency/commons-el-1.0.jar>
[INFO] Copying commons-httpclient-3.0.1.jar to <https://builds.apache.org/job/Apache-Falcon-Distributed-Assembly/ws/client/target/dependency/commons-httpclient-3.0.1.jar>
[INFO] Copying commons-io-2.2.jar to <https://builds.apache.org/job/Apache-Falcon-Distributed-Assembly/ws/client/target/dependency/commons-io-2.2.jar>
[INFO] Copying commons-lang-2.6.jar to <https://builds.apache.org/job/Apache-Falcon-Distributed-Assembly/ws/client/target/dependency/commons-lang-2.6.jar>
[INFO] Copying commons-logging-1.0.3.jar to <https://builds.apache.org/job/Apache-Falcon-Distributed-Assembly/ws/client/target/dependency/commons-logging-1.0.3.jar>
[INFO] Copying commons-net-1.4.1.jar to <https://builds.apache.org/job/Apache-Falcon-Distributed-Assembly/ws/client/target/dependency/commons-net-1.4.1.jar>
[INFO] Copying hsqldb-1.8.0.10.jar to <https://builds.apache.org/job/Apache-Falcon-Distributed-Assembly/ws/client/target/dependency/hsqldb-1.8.0.10.jar>
[INFO] Copying activation-1.1.jar to <https://builds.apache.org/job/Apache-Falcon-Distributed-Assembly/ws/client/target/dependency/activation-1.1.jar>
[INFO] Copying jaxb-api-2.1.jar to <https://builds.apache.org/job/Apache-Falcon-Distributed-Assembly/ws/client/target/dependency/jaxb-api-2.1.jar>
[INFO] Copying stax-api-1.0-2.jar to <https://builds.apache.org/job/Apache-Falcon-Distributed-Assembly/ws/client/target/dependency/stax-api-1.0-2.jar>
[INFO] Copying junit-3.8.1.jar to <https://builds.apache.org/job/Apache-Falcon-Distributed-Assembly/ws/client/target/dependency/junit-3.8.1.jar>
[INFO] Copying log4j-1.2.15.jar to <https://builds.apache.org/job/Apache-Falcon-Distributed-Assembly/ws/client/target/dependency/log4j-1.2.15.jar>
[INFO] Copying jets3t-0.6.1.jar to <https://builds.apache.org/job/Apache-Falcon-Distributed-Assembly/ws/client/target/dependency/jets3t-0.6.1.jar>
[INFO] Copying annotations-1.3.2.jar to <https://builds.apache.org/job/Apache-Falcon-Distributed-Assembly/ws/client/target/dependency/annotations-1.3.2.jar>
[INFO] Copying commons-math-2.1.jar to <https://builds.apache.org/job/Apache-Falcon-Distributed-Assembly/ws/client/target/dependency/commons-math-2.1.jar>
[INFO] Copying hadoop-core-1.1.2.jar to <https://builds.apache.org/job/Apache-Falcon-Distributed-Assembly/ws/client/target/dependency/hadoop-core-1.1.2.jar>
[INFO] Copying bsh-2.0b4.jar to <https://builds.apache.org/job/Apache-Falcon-Distributed-Assembly/ws/client/target/dependency/bsh-2.0b4.jar>
[INFO] Copying jackson-core-asl-1.5.2.jar to <https://builds.apache.org/job/Apache-Falcon-Distributed-Assembly/ws/client/target/dependency/jackson-core-asl-1.5.2.jar>
[INFO] Copying jackson-jaxrs-1.8.3.jar to <https://builds.apache.org/job/Apache-Falcon-Distributed-Assembly/ws/client/target/dependency/jackson-jaxrs-1.8.3.jar>
[INFO] Copying jackson-mapper-asl-1.5.2.jar to <https://builds.apache.org/job/Apache-Falcon-Distributed-Assembly/ws/client/target/dependency/jackson-mapper-asl-1.5.2.jar>
[INFO] Copying jackson-xc-1.8.3.jar to <https://builds.apache.org/job/Apache-Falcon-Distributed-Assembly/ws/client/target/dependency/jackson-xc-1.8.3.jar>
[INFO] Copying jettison-1.3.jar to <https://builds.apache.org/job/Apache-Falcon-Distributed-Assembly/ws/client/target/dependency/jettison-1.3.jar>
[INFO] Copying jetty-6.1.26.jar to <https://builds.apache.org/job/Apache-Falcon-Distributed-Assembly/ws/client/target/dependency/jetty-6.1.26.jar>
[INFO] Copying jetty-util-6.1.26.jar to <https://builds.apache.org/job/Apache-Falcon-Distributed-Assembly/ws/client/target/dependency/jetty-util-6.1.26.jar>
[INFO] Copying jsp-2.1-6.1.14.jar to <https://builds.apache.org/job/Apache-Falcon-Distributed-Assembly/ws/client/target/dependency/jsp-2.1-6.1.14.jar>
[INFO] Copying jsp-api-2.1-6.1.14.jar to <https://builds.apache.org/job/Apache-Falcon-Distributed-Assembly/ws/client/target/dependency/jsp-api-2.1-6.1.14.jar>
[INFO] Copying servlet-api-2.5-20081211.jar to <https://builds.apache.org/job/Apache-Falcon-Distributed-Assembly/ws/client/target/dependency/servlet-api-2.5-20081211.jar>
[INFO] Copying servlet-api-2.5-6.1.14.jar to <https://builds.apache.org/job/Apache-Falcon-Distributed-Assembly/ws/client/target/dependency/servlet-api-2.5-6.1.14.jar>
[INFO] Copying testng-6.1.1.jar to <https://builds.apache.org/job/Apache-Falcon-Distributed-Assembly/ws/client/target/dependency/testng-6.1.1.jar>
[INFO] Copying snakeyaml-1.6.jar to <https://builds.apache.org/job/Apache-Falcon-Distributed-Assembly/ws/client/target/dependency/snakeyaml-1.6.jar>
[INFO] Copying oro-2.0.8.jar to <https://builds.apache.org/job/Apache-Falcon-Distributed-Assembly/ws/client/target/dependency/oro-2.0.8.jar>
[INFO] Copying stax-api-1.0.1.jar to <https://builds.apache.org/job/Apache-Falcon-Distributed-Assembly/ws/client/target/dependency/stax-api-1.0.1.jar>
[INFO] Copying xmlenc-0.52.jar to <https://builds.apache.org/job/Apache-Falcon-Distributed-Assembly/ws/client/target/dependency/xmlenc-0.52.jar>
[INFO]                                                                         
[INFO] >>>>>>>>>>>>>>>>>>>>>>>>>>>>>>>>>>>>>>>>>>>>>>>>>>>>>>>>>>>>>>>>>>>>>>>>
[INFO] Forking Apache Falcon Metrics 0.5-incubating-SNAPSHOT
[INFO] >>>>>>>>>>>>>>>>>>>>>>>>>>>>>>>>>>>>>>>>>>>>>>>>>>>>>>>>>>>>>>>>>>>>>>>>
[INFO] 
[INFO] --- maven-enforcer-plugin:1.3.1:enforce (enforce-property) @ falcon-metrics ---
[INFO] 
[INFO] --- buildnumber-maven-plugin:1.0:create (default) @ falcon-metrics ---
[INFO] Checking for local modifications: skipped.
[INFO] Updating project files from SCM: skipped.
[INFO] Executing: /bin/sh -c cd <https://builds.apache.org/job/Apache-Falcon-Distributed-Assembly/ws/metrics>
&& git show
[INFO] Working directory: <https://builds.apache.org/job/Apache-Falcon-Distributed-Assembly/ws/metrics>
[INFO] Storing buildNumber: 6b3288621b2186abdf243d498a78df5f8c558caf at timestamp: 1394543378718
[INFO] Executing: /bin/sh -c cd <https://builds.apache.org/job/Apache-Falcon-Distributed-Assembly/ws/metrics>
&& git show
[INFO] Working directory: <https://builds.apache.org/job/Apache-Falcon-Distributed-Assembly/ws/metrics>
[INFO] Storing buildScmBranch: UNKNOWN
[INFO] 
[INFO] --- maven-remote-resources-plugin:1.4:process (default) @ falcon-metrics ---
[INFO] 
[INFO] --- maven-resources-plugin:2.6:resources (default-resources) @ falcon-metrics ---
[INFO] Using 'UTF-8' encoding to copy filtered resources.
[INFO] skip non existing resourceDirectory <https://builds.apache.org/job/Apache-Falcon-Distributed-Assembly/ws/metrics/src/main/resources>
[INFO] skip non existing resourceDirectory <https://builds.apache.org/job/Apache-Falcon-Distributed-Assembly/ws/metrics/src/main/resources>
[INFO] Copying 2 resources to META-INF
[INFO] Copying 3 resources
[INFO] 
[INFO] --- maven-compiler-plugin:2.3.2:compile (default-compile) @ falcon-metrics ---
[INFO] Compiling 9 source files to <https://builds.apache.org/job/Apache-Falcon-Distributed-Assembly/ws/metrics/target/classes>
[INFO] 
[INFO] --- maven-resources-plugin:2.6:testResources (default-testResources) @ falcon-metrics
---
[INFO] Using 'UTF-8' encoding to copy filtered resources.
[INFO] skip non existing resourceDirectory <https://builds.apache.org/job/Apache-Falcon-Distributed-Assembly/ws/metrics/src/test/resources>
[INFO] Copying 3 resources
[INFO] 
[INFO] --- maven-compiler-plugin:2.3.2:testCompile (default-testCompile) @ falcon-metrics
---
[INFO] No sources to compile
[INFO] 
[INFO] --- maven-surefire-plugin:2.16:test (default-test) @ falcon-metrics ---
[INFO] Tests are skipped.
[INFO] 
[INFO] --- maven-site-plugin:3.2:site (default) @ falcon-metrics ---
[INFO] maven.site.skip = true: Skipping site generation
[INFO] 
[INFO] --- maven-jar-plugin:2.4:jar (default-jar) @ falcon-metrics ---
[INFO] Building jar: <https://builds.apache.org/job/Apache-Falcon-Distributed-Assembly/ws/metrics/target/falcon-metrics-0.5-incubating-SNAPSHOT.jar>
[INFO] 
[INFO] --- maven-site-plugin:3.2:attach-descriptor (attach-descriptor) @ falcon-metrics ---
[INFO]                                                                         
[INFO] >>>>>>>>>>>>>>>>>>>>>>>>>>>>>>>>>>>>>>>>>>>>>>>>>>>>>>>>>>>>>>>>>>>>>>>>
[INFO] Forking Apache Falcon Hadoop Dependencies 0.5-incubating-SNAPSHOT
[INFO] >>>>>>>>>>>>>>>>>>>>>>>>>>>>>>>>>>>>>>>>>>>>>>>>>>>>>>>>>>>>>>>>>>>>>>>>
[INFO] 
[INFO] --- maven-enforcer-plugin:1.3.1:enforce (enforce-property) @ falcon-hadoop-dependencies
---
[INFO] 
[INFO] --- buildnumber-maven-plugin:1.0:create (default) @ falcon-hadoop-dependencies ---
[INFO] Checking for local modifications: skipped.
[INFO] Updating project files from SCM: skipped.
[INFO] Executing: /bin/sh -c cd <https://builds.apache.org/job/Apache-Falcon-Distributed-Assembly/ws/hadoop-dependencies>
&& git show
[INFO] Working directory: <https://builds.apache.org/job/Apache-Falcon-Distributed-Assembly/ws/hadoop-dependencies>
[INFO] Storing buildNumber: 6b3288621b2186abdf243d498a78df5f8c558caf at timestamp: 1394543379324
[INFO] Executing: /bin/sh -c cd <https://builds.apache.org/job/Apache-Falcon-Distributed-Assembly/ws/hadoop-dependencies>
&& git show
[INFO] Working directory: <https://builds.apache.org/job/Apache-Falcon-Distributed-Assembly/ws/hadoop-dependencies>
[INFO] Storing buildScmBranch: UNKNOWN
[INFO] 
[INFO] --- maven-remote-resources-plugin:1.4:process (default) @ falcon-hadoop-dependencies
---
[INFO] 
[INFO] --- maven-resources-plugin:2.6:resources (default-resources) @ falcon-hadoop-dependencies
---
[INFO] Using 'UTF-8' encoding to copy filtered resources.
[INFO] skip non existing resourceDirectory <https://builds.apache.org/job/Apache-Falcon-Distributed-Assembly/ws/hadoop-dependencies/src/main/resources>
[INFO] skip non existing resourceDirectory <https://builds.apache.org/job/Apache-Falcon-Distributed-Assembly/ws/hadoop-dependencies/src/main/resources>
[INFO] Copying 2 resources to META-INF
[INFO] Copying 3 resources
[INFO] 
[INFO] --- maven-compiler-plugin:2.3.2:compile (default-compile) @ falcon-hadoop-dependencies
---
[INFO] Compiling 2 source files to <https://builds.apache.org/job/Apache-Falcon-Distributed-Assembly/ws/hadoop-dependencies/target/classes>
[INFO] 
[INFO] --- maven-resources-plugin:2.6:testResources (default-testResources) @ falcon-hadoop-dependencies
---
[INFO] Using 'UTF-8' encoding to copy filtered resources.
[INFO] skip non existing resourceDirectory <https://builds.apache.org/job/Apache-Falcon-Distributed-Assembly/ws/hadoop-dependencies/src/test/resources>
[INFO] Copying 3 resources
[INFO] 
[INFO] --- maven-compiler-plugin:2.3.2:testCompile (default-testCompile) @ falcon-hadoop-dependencies
---
[INFO] No sources to compile
[INFO] 
[INFO] --- maven-surefire-plugin:2.16:test (default-test) @ falcon-hadoop-dependencies ---
[INFO] Tests are skipped.
[INFO] 
[INFO] --- maven-site-plugin:3.2:site (default) @ falcon-hadoop-dependencies ---
[INFO] maven.site.skip = true: Skipping site generation
[INFO] 
[INFO] --- maven-jar-plugin:2.4:jar (default-jar) @ falcon-hadoop-dependencies ---
[INFO] Building jar: <https://builds.apache.org/job/Apache-Falcon-Distributed-Assembly/ws/hadoop-dependencies/target/falcon-hadoop-dependencies-0.5-incubating-SNAPSHOT.jar>
[INFO] 
[INFO] --- maven-site-plugin:3.2:attach-descriptor (attach-descriptor) @ falcon-hadoop-dependencies
---
[INFO] 
[INFO] --- maven-dependency-plugin:2.1:copy-dependencies (default) @ falcon-hadoop-dependencies
---
[INFO] Copying ant-1.6.5.jar to <https://builds.apache.org/job/Apache-Falcon-Distributed-Assembly/ws/hadoop-dependencies/target/dependency/ant-1.6.5.jar>
[INFO] Copying jcommander-1.12.jar to <https://builds.apache.org/job/Apache-Falcon-Distributed-Assembly/ws/hadoop-dependencies/target/dependency/jcommander-1.12.jar>
[INFO] Copying commons-beanutils-1.8.3.jar to <https://builds.apache.org/job/Apache-Falcon-Distributed-Assembly/ws/hadoop-dependencies/target/dependency/commons-beanutils-1.8.3.jar>
[INFO] Copying commons-beanutils-core-1.8.0.jar to <https://builds.apache.org/job/Apache-Falcon-Distributed-Assembly/ws/hadoop-dependencies/target/dependency/commons-beanutils-core-1.8.0.jar>
[INFO] Copying commons-cli-1.2.jar to <https://builds.apache.org/job/Apache-Falcon-Distributed-Assembly/ws/hadoop-dependencies/target/dependency/commons-cli-1.2.jar>
[INFO] Copying commons-codec-1.8.jar to <https://builds.apache.org/job/Apache-Falcon-Distributed-Assembly/ws/hadoop-dependencies/target/dependency/commons-codec-1.8.jar>
[INFO] Copying commons-collections-3.2.1.jar to <https://builds.apache.org/job/Apache-Falcon-Distributed-Assembly/ws/hadoop-dependencies/target/dependency/commons-collections-3.2.1.jar>
[INFO] Copying commons-configuration-1.6.jar to <https://builds.apache.org/job/Apache-Falcon-Distributed-Assembly/ws/hadoop-dependencies/target/dependency/commons-configuration-1.6.jar>
[INFO] Copying commons-digester-1.8.jar to <https://builds.apache.org/job/Apache-Falcon-Distributed-Assembly/ws/hadoop-dependencies/target/dependency/commons-digester-1.8.jar>
[INFO] Copying commons-el-1.0.jar to <https://builds.apache.org/job/Apache-Falcon-Distributed-Assembly/ws/hadoop-dependencies/target/dependency/commons-el-1.0.jar>
[INFO] Copying commons-httpclient-3.0.1.jar to <https://builds.apache.org/job/Apache-Falcon-Distributed-Assembly/ws/hadoop-dependencies/target/dependency/commons-httpclient-3.0.1.jar>
[INFO] Copying commons-io-2.2.jar to <https://builds.apache.org/job/Apache-Falcon-Distributed-Assembly/ws/hadoop-dependencies/target/dependency/commons-io-2.2.jar>
[INFO] Copying commons-lang-2.6.jar to <https://builds.apache.org/job/Apache-Falcon-Distributed-Assembly/ws/hadoop-dependencies/target/dependency/commons-lang-2.6.jar>
[INFO] Copying commons-logging-1.0.3.jar to <https://builds.apache.org/job/Apache-Falcon-Distributed-Assembly/ws/hadoop-dependencies/target/dependency/commons-logging-1.0.3.jar>
[INFO] Copying commons-net-1.4.1.jar to <https://builds.apache.org/job/Apache-Falcon-Distributed-Assembly/ws/hadoop-dependencies/target/dependency/commons-net-1.4.1.jar>
[INFO] Copying hsqldb-1.8.0.10.jar to <https://builds.apache.org/job/Apache-Falcon-Distributed-Assembly/ws/hadoop-dependencies/target/dependency/hsqldb-1.8.0.10.jar>
[INFO] Copying junit-3.8.1.jar to <https://builds.apache.org/job/Apache-Falcon-Distributed-Assembly/ws/hadoop-dependencies/target/dependency/junit-3.8.1.jar>
[INFO] Copying jets3t-0.6.1.jar to <https://builds.apache.org/job/Apache-Falcon-Distributed-Assembly/ws/hadoop-dependencies/target/dependency/jets3t-0.6.1.jar>
[INFO] Copying commons-math-2.1.jar to <https://builds.apache.org/job/Apache-Falcon-Distributed-Assembly/ws/hadoop-dependencies/target/dependency/commons-math-2.1.jar>
[INFO] Copying hadoop-core-1.1.2.jar to <https://builds.apache.org/job/Apache-Falcon-Distributed-Assembly/ws/hadoop-dependencies/target/dependency/hadoop-core-1.1.2.jar>
[INFO] Copying bsh-2.0b4.jar to <https://builds.apache.org/job/Apache-Falcon-Distributed-Assembly/ws/hadoop-dependencies/target/dependency/bsh-2.0b4.jar>
[INFO] Copying jackson-core-asl-1.5.2.jar to <https://builds.apache.org/job/Apache-Falcon-Distributed-Assembly/ws/hadoop-dependencies/target/dependency/jackson-core-asl-1.5.2.jar>
[INFO] Copying jackson-mapper-asl-1.5.2.jar to <https://builds.apache.org/job/Apache-Falcon-Distributed-Assembly/ws/hadoop-dependencies/target/dependency/jackson-mapper-asl-1.5.2.jar>
[INFO] Copying jetty-6.1.26.jar to <https://builds.apache.org/job/Apache-Falcon-Distributed-Assembly/ws/hadoop-dependencies/target/dependency/jetty-6.1.26.jar>
[INFO] Copying jetty-util-6.1.26.jar to <https://builds.apache.org/job/Apache-Falcon-Distributed-Assembly/ws/hadoop-dependencies/target/dependency/jetty-util-6.1.26.jar>
[INFO] Copying jsp-2.1-6.1.14.jar to <https://builds.apache.org/job/Apache-Falcon-Distributed-Assembly/ws/hadoop-dependencies/target/dependency/jsp-2.1-6.1.14.jar>
[INFO] Copying jsp-api-2.1-6.1.14.jar to <https://builds.apache.org/job/Apache-Falcon-Distributed-Assembly/ws/hadoop-dependencies/target/dependency/jsp-api-2.1-6.1.14.jar>
[INFO] Copying servlet-api-2.5-20081211.jar to <https://builds.apache.org/job/Apache-Falcon-Distributed-Assembly/ws/hadoop-dependencies/target/dependency/servlet-api-2.5-20081211.jar>
[INFO] Copying servlet-api-2.5-6.1.14.jar to <https://builds.apache.org/job/Apache-Falcon-Distributed-Assembly/ws/hadoop-dependencies/target/dependency/servlet-api-2.5-6.1.14.jar>
[INFO] Copying testng-6.1.1.jar to <https://builds.apache.org/job/Apache-Falcon-Distributed-Assembly/ws/hadoop-dependencies/target/dependency/testng-6.1.1.jar>
[INFO] Copying snakeyaml-1.6.jar to <https://builds.apache.org/job/Apache-Falcon-Distributed-Assembly/ws/hadoop-dependencies/target/dependency/snakeyaml-1.6.jar>
[INFO] Copying oro-2.0.8.jar to <https://builds.apache.org/job/Apache-Falcon-Distributed-Assembly/ws/hadoop-dependencies/target/dependency/oro-2.0.8.jar>
[INFO] Copying xmlenc-0.52.jar to <https://builds.apache.org/job/Apache-Falcon-Distributed-Assembly/ws/hadoop-dependencies/target/dependency/xmlenc-0.52.jar>
[INFO]                                                                         
[INFO] >>>>>>>>>>>>>>>>>>>>>>>>>>>>>>>>>>>>>>>>>>>>>>>>>>>>>>>>>>>>>>>>>>>>>>>>
[INFO] Forking Apache Falcon Test Utility 0.5-incubating-SNAPSHOT
[INFO] >>>>>>>>>>>>>>>>>>>>>>>>>>>>>>>>>>>>>>>>>>>>>>>>>>>>>>>>>>>>>>>>>>>>>>>>
[INFO] ------------------------------------------------------------------------
[INFO] Reactor Summary:
[INFO] 
[INFO] Checkstyle ........................................ SUCCESS [0.094s]
[INFO] Apache Falcon ..................................... FAILURE [11.552s]
[INFO] Build Tools ....................................... SUCCESS [0.006s]
[INFO] Apache Falcon CLI client .......................... SUCCESS [0.029s]
[INFO] Apache Falcon Metrics ............................. SUCCESS [0.007s]
[INFO] Apache Falcon Hadoop Dependencies ................. SUCCESS [0.013s]
[INFO] Apache Falcon Test Utility ........................ SUCCESS [0.003s]
[INFO] Apache Falcon Commons ............................. SUCCESS [0.006s]
[INFO] Apache Falcon Oozie EL Extension .................. SUCCESS [0.003s]
[INFO] Apache Falcon Embedded Hadoop - Test Cluster ...... SUCCESS [0.005s]
[INFO] Apache Falcon Messaging ........................... SUCCESS [0.003s]
[INFO] Apache Falcon Oozie Adaptor ....................... SUCCESS [0.008s]
[INFO] Apache Falcon Feed ................................ SUCCESS [0.004s]
[INFO] Apache Falcon Process ............................. SUCCESS [0.005s]
[INFO] Apache Falcon Acquisition ......................... SUCCESS [0.002s]
[INFO] Apache Falcon Replication ......................... SUCCESS [0.004s]
[INFO] Apache Falcon Retention ........................... SUCCESS [0.004s]
[INFO] Apache Falcon Archival ............................ SUCCESS [0.002s]
[INFO] Apache Falcon Rerun ............................... SUCCESS [0.004s]
[INFO] Apache Falcon Prism ............................... SUCCESS [0.018s]
[INFO] Apache Falcon Web Application ..................... SUCCESS [0.006s]
[INFO] Apache Falcon Documentation ....................... SUCCESS [0.002s]
[INFO] ------------------------------------------------------------------------
[INFO] BUILD FAILURE
[INFO] ------------------------------------------------------------------------
[INFO] Total time: 12.763s
[INFO] Finished at: Tue Mar 11 13:09:40 UTC 2014
[INFO] Final Memory: 44M/362M
[INFO] ------------------------------------------------------------------------
[ERROR] Failed to execute goal on project falcon-test-util: Could not resolve dependencies
for project org.apache.falcon:falcon-test-util:jar:0.5-incubating-SNAPSHOT: The following
artifacts could not be resolved: org.apache.falcon:falcon-client:jar:0.5-incubating-SNAPSHOT,
org.apache.falcon:falcon-hadoop-dependencies:jar:0.5-incubating-SNAPSHOT: Failure to find
org.apache.falcon:falcon-client:jar:0.5-incubating-SNAPSHOT in https://repository.apache.org/content/groups/snapshots
was cached in the local repository, resolution will not be reattempted until the update interval
of apache.snapshots.repo has elapsed or updates are forced -> [Help 1]
[ERROR] 
[ERROR] To see the full stack trace of the errors, re-run Maven with the -e switch.
[ERROR] Re-run Maven using the -X switch to enable full debug logging.
[ERROR] 
[ERROR] For more information about the errors and possible solutions, please read the following
articles:
[ERROR] [Help 1] http://cwiki.apache.org/confluence/display/MAVEN/DependencyResolutionException
[ERROR] 
[ERROR] After correcting the problems, you can resume the build with the command
[ERROR]   mvn <goals> -rf :falcon-test-util
Build step 'Execute shell' marked build as failure
Archiving artifacts

Mime
View raw message