falcon-dev mailing list archives

Site index · List index
Message view « Date » · « Thread »
Top « Date » · « Thread »
From Apache Jenkins Server <jenk...@builds.apache.org>
Subject Build failed in Jenkins: Apache-falcon #222
Date Wed, 05 Mar 2014 00:26:25 GMT
See <https://builds.apache.org/job/Apache-falcon/222/changes>

Changes:

[shwethags] FALCON-331 Summary API returning NPE if only start is passed. Contributed by Shwetha
GS

------------------------------------------
[...truncated 1470 lines...]
[INFO] >>> findbugs-maven-plugin:2.5.2:check (findbugs-check) @ falcon-messaging
>>>
[WARNING] Could not transfer metadata asm:asm/maven-metadata.xml from/to local.repository
(file:../../local.repository/trunk): No connector available to access repository local.repository
(file:../../local.repository/trunk) of type legacy using the available factories WagonRepositoryConnectorFactory
[INFO] 
[INFO] --- findbugs-maven-plugin:2.5.2:findbugs (findbugs) @ falcon-messaging ---
[INFO] Fork Value is true
[INFO] Done FindBugs Analysis....
[INFO] 
[INFO] <<< findbugs-maven-plugin:2.5.2:check (findbugs-check) @ falcon-messaging
<<<
[INFO] 
[INFO] --- findbugs-maven-plugin:2.5.2:check (findbugs-check) @ falcon-messaging ---
[INFO] BugInstance size is 0
[INFO] Error size is 0
[INFO] No errors/warnings found
[INFO]                                                                         
[INFO] ------------------------------------------------------------------------
[INFO] Building Apache Falcon Oozie Adaptor 0.5-incubating-SNAPSHOT
[INFO] ------------------------------------------------------------------------
[WARNING] Could not transfer metadata asm:asm/maven-metadata.xml from/to local.repository
(file:../../local.repository/trunk): No connector available to access repository local.repository
(file:../../local.repository/trunk) of type legacy using the available factories WagonRepositoryConnectorFactory
[INFO] 
[INFO] --- maven-clean-plugin:2.5:clean (default-clean) @ falcon-oozie-adaptor ---
[INFO] Deleting <https://builds.apache.org/job/Apache-falcon/ws/oozie/target>
[INFO] 
[INFO] --- maven-enforcer-plugin:1.3.1:enforce (enforce-property) @ falcon-oozie-adaptor ---
[INFO] 
[INFO] --- buildnumber-maven-plugin:1.0:create (default) @ falcon-oozie-adaptor ---
[INFO] Checking for local modifications: skipped.
[INFO] Updating project files from SCM: skipped.
[INFO] Executing: /bin/sh -c cd <https://builds.apache.org/job/Apache-falcon/ws/oozie>
&& git show
[INFO] Working directory: <https://builds.apache.org/job/Apache-falcon/ws/oozie>
[INFO] Storing buildNumber: 464442af25a87f9b40c6b017f75da8e083449ad1 at timestamp: 1393979167534
[INFO] Executing: /bin/sh -c cd <https://builds.apache.org/job/Apache-falcon/ws/oozie>
&& git show
[INFO] Working directory: <https://builds.apache.org/job/Apache-falcon/ws/oozie>
[INFO] Storing buildScmBranch: UNKNOWN
[INFO] 
[INFO] --- maven-jaxb-plugin:1.1.1:generate (1) @ falcon-oozie-adaptor ---
[INFO] <https://builds.apache.org/job/Apache-falcon/ws/oozie/target/generated-sources/xjc/org/apache/falcon/oozie/coordinator>
is not found and thus excluded from the dependency check
[INFO] Compiling <https://builds.apache.org/job/Apache-falcon/ws/oozie/src/main/resources/oozie-coordinator-0.3.xsd>
[INFO] Writing output to <https://builds.apache.org/job/Apache-falcon/ws/oozie/target/generated-sources/xjc>
[INFO] 
[INFO] --- maven-jaxb-plugin:1.1.1:generate (2) @ falcon-oozie-adaptor ---
[INFO] <https://builds.apache.org/job/Apache-falcon/ws/oozie/target/generated-sources/xjc/org/apache/falcon/oozie/workflow>
is not found and thus excluded from the dependency check
[INFO] Compiling <https://builds.apache.org/job/Apache-falcon/ws/oozie/src/main/resources/oozie-workflow-0.3.xsd>
[INFO] Writing output to <https://builds.apache.org/job/Apache-falcon/ws/oozie/target/generated-sources/xjc>
[INFO] 
[INFO] --- maven-jaxb-plugin:1.1.1:generate (3) @ falcon-oozie-adaptor ---
[INFO] <https://builds.apache.org/job/Apache-falcon/ws/oozie/target/generated-sources/xjc/org/apache/falcon/oozie/hive>
is not found and thus excluded from the dependency check
[INFO] Compiling <https://builds.apache.org/job/Apache-falcon/ws/oozie/src/main/resources/hive-action-0.2.xsd>
[INFO] Writing output to <https://builds.apache.org/job/Apache-falcon/ws/oozie/target/generated-sources/xjc>
[INFO] 
[INFO] --- maven-jaxb-plugin:1.1.1:generate (4) @ falcon-oozie-adaptor ---
[INFO] <https://builds.apache.org/job/Apache-falcon/ws/oozie/target/generated-sources/xjc/org/apache/falcon/oozie/bundle>
is not found and thus excluded from the dependency check
[INFO] Compiling <https://builds.apache.org/job/Apache-falcon/ws/oozie/src/main/resources/oozie-bundle-0.1.xsd>
[INFO] Writing output to <https://builds.apache.org/job/Apache-falcon/ws/oozie/target/generated-sources/xjc>
[INFO] 
[INFO] --- build-helper-maven-plugin:1.5:add-source (add-source) @ falcon-oozie-adaptor ---
[INFO] Source directory: <https://builds.apache.org/job/Apache-falcon/ws/oozie/src/versioned-src/v1/java>
added.
[INFO] 
[INFO] --- maven-remote-resources-plugin:1.4:process (default) @ falcon-oozie-adaptor ---
[INFO] 
[INFO] --- maven-resources-plugin:2.6:resources (default-resources) @ falcon-oozie-adaptor
---
[INFO] Using 'UTF-8' encoding to copy filtered resources.
[INFO] Copying 4 resources
[INFO] Copying 0 resource
[INFO] Copying 2 resources to META-INF
[INFO] Copying 3 resources
[INFO] 
[INFO] --- maven-compiler-plugin:2.3.2:compile (default-compile) @ falcon-oozie-adaptor ---
[INFO] Compiling 76 source files to <https://builds.apache.org/job/Apache-falcon/ws/oozie/target/classes>
[INFO] 
[INFO] --- maven-resources-plugin:2.6:testResources (default-testResources) @ falcon-oozie-adaptor
---
[INFO] Using 'UTF-8' encoding to copy filtered resources.
[INFO] Copying 3 resources
[INFO] Copying 3 resources
[INFO] 
[INFO] --- maven-compiler-plugin:2.3.2:testCompile (default-testCompile) @ falcon-oozie-adaptor
---
[INFO] Compiling 4 source files to <https://builds.apache.org/job/Apache-falcon/ws/oozie/target/test-classes>
[INFO] 
[INFO] --- maven-surefire-plugin:2.16:test (default-test) @ falcon-oozie-adaptor ---
[WARNING] The parameter forkMode is deprecated since version 2.14. Use forkCount and reuseForks
instead.
[INFO] Surefire report directory: <https://builds.apache.org/job/Apache-falcon/ws/oozie/target/surefire-reports>

-------------------------------------------------------
 T E S T S
-------------------------------------------------------

-------------------------------------------------------
 T E S T S
-------------------------------------------------------
Running org.apache.falcon.oozie.workflow.FalconPostProcessingTest
Tests run: 1, Failures: 0, Errors: 0, Skipped: 0, Time elapsed: 2.926 sec - in org.apache.falcon.oozie.workflow.FalconPostProcessingTest
Running org.apache.falcon.oozie.workflow.WorkflowUnmarshallingTest
Tests run: 1, Failures: 0, Errors: 0, Skipped: 0, Time elapsed: 0.989 sec - in org.apache.falcon.oozie.workflow.WorkflowUnmarshallingTest
Running org.apache.falcon.oozie.coordinator.CoordinatorUnmarshallingTest
Tests run: 1, Failures: 0, Errors: 0, Skipped: 0, Time elapsed: 0.915 sec - in org.apache.falcon.oozie.coordinator.CoordinatorUnmarshallingTest
Running org.apache.falcon.oozie.bundle.BundleUnmarshallingTest
Tests run: 1, Failures: 0, Errors: 0, Skipped: 0, Time elapsed: 0.836 sec - in org.apache.falcon.oozie.bundle.BundleUnmarshallingTest

Results :

Tests run: 4, Failures: 0, Errors: 0, Skipped: 0

[INFO] 
[INFO] --- maven-site-plugin:3.2:site (default) @ falcon-oozie-adaptor ---
[INFO] maven.site.skip = true: Skipping site generation
[INFO] 
[INFO] --- maven-jar-plugin:2.4:jar (default-jar) @ falcon-oozie-adaptor ---
[INFO] Building jar: <https://builds.apache.org/job/Apache-falcon/ws/oozie/target/falcon-oozie-adaptor-0.5-incubating-SNAPSHOT.jar>
[INFO] 
[INFO] --- maven-site-plugin:3.2:attach-descriptor (attach-descriptor) @ falcon-oozie-adaptor
---
[INFO] 
[INFO] --- maven-failsafe-plugin:2.16:integration-test (integration-test) @ falcon-oozie-adaptor
---
[WARNING] The parameter forkMode is deprecated since version 2.14. Use forkCount and reuseForks
instead.
[INFO] 
[INFO] --- maven-failsafe-plugin:2.16:verify (verify) @ falcon-oozie-adaptor ---
[INFO] Failsafe report directory: <https://builds.apache.org/job/Apache-falcon/ws/oozie/target/failsafe-reports>
[INFO] 
[INFO] --- apache-rat-plugin:0.7:check (rat-check) @ falcon-oozie-adaptor ---
[INFO] Exclude: *.txt
[INFO] Exclude: .git/**
[INFO] Exclude: **/.idea/**
[INFO] Exclude: **/*.twiki
[INFO] Exclude: **/*.iml
[INFO] Exclude: **/target/**
[INFO] Exclude: **/activemq-data/**
[INFO] Exclude: **/build/**
[INFO] Exclude: **/*.patch
[INFO] Exclude: derby.log
[INFO] Exclude: **/logs/**
[INFO] Exclude: **/.classpath
[INFO] Exclude: **/.project
[INFO] Exclude: **/.settings/**
[INFO] Exclude: **/test-output/**
[INFO] Exclude: **/data.txt
[INFO] Exclude: **/maven-eclipse.xml
[INFO] Exclude: **/.externalToolBuilders/**
[INFO] Exclude: html5-ui/**
[INFO] 
[INFO] --- maven-checkstyle-plugin:2.9.1:check (checkstyle-check) @ falcon-oozie-adaptor ---
[INFO] Starting audit...
<https://builds.apache.org/job/Apache-falcon/ws/oozie/src/main/java/org/apache/falcon/workflow/engine/OozieWorkflowEngine.java>:567:108:
'?' should be on a new line.
Audit done.

[INFO] There are 1 checkstyle errors.
[INFO] ------------------------------------------------------------------------
[INFO] Reactor Summary:
[INFO] 
[INFO] Checkstyle ........................................ SUCCESS [1.039s]
[INFO] Apache Falcon ..................................... SUCCESS [5.010s]
[INFO] Build Tools ....................................... SUCCESS [3.894s]
[INFO] Apache Falcon CLI client .......................... SUCCESS [28.874s]
[INFO] Apache Falcon Metrics ............................. SUCCESS [11.244s]
[INFO] Apache Falcon Hadoop Dependencies ................. SUCCESS [12.378s]
[INFO] Apache Falcon Test Utility ........................ SUCCESS [9.783s]
[INFO] Apache Falcon Commons ............................. SUCCESS [1:02.852s]
[INFO] Apache Falcon Oozie EL Extension .................. SUCCESS [15.122s]
[INFO] Apache Falcon Embedded Hadoop - Test Cluster ...... SUCCESS [28.069s]
[INFO] Apache Falcon Messaging ........................... SUCCESS [22.414s]
[INFO] Apache Falcon Oozie Adaptor ....................... FAILURE [12.175s]
[INFO] Apache Falcon Feed ................................ SKIPPED
[INFO] Apache Falcon Process ............................. SKIPPED
[INFO] Apache Falcon Acquisition ......................... SKIPPED
[INFO] Apache Falcon Replication ......................... SKIPPED
[INFO] Apache Falcon Retention ........................... SKIPPED
[INFO] Apache Falcon Archival ............................ SKIPPED
[INFO] Apache Falcon Rerun ............................... SKIPPED
[INFO] Apache Falcon Prism ............................... SKIPPED
[INFO] Apache Falcon Web Application ..................... SKIPPED
[INFO] Apache Falcon Documentation ....................... SKIPPED
[INFO] ------------------------------------------------------------------------
[INFO] BUILD FAILURE
[INFO] ------------------------------------------------------------------------
[INFO] Total time: 3:33.485s
[INFO] Finished at: Wed Mar 05 00:26:19 UTC 2014
[INFO] Final Memory: 139M/472M
[INFO] ------------------------------------------------------------------------
[ERROR] Failed to execute goal org.apache.maven.plugins:maven-checkstyle-plugin:2.9.1:check
(checkstyle-check) on project falcon-oozie-adaptor: You have 1 Checkstyle violation. ->
[Help 1]
[ERROR] 
[ERROR] To see the full stack trace of the errors, re-run Maven with the -e switch.
[ERROR] Re-run Maven using the -X switch to enable full debug logging.
[ERROR] 
[ERROR] For more information about the errors and possible solutions, please read the following
articles:
[ERROR] [Help 1] http://cwiki.apache.org/confluence/display/MAVEN/MojoFailureException
[ERROR] 
[ERROR] After correcting the problems, you can resume the build with the command
[ERROR]   mvn <goals> -rf :falcon-oozie-adaptor
Build step 'Execute shell' marked build as failure
[CHECKSTYLE] Collecting checkstyle analysis files...
[CHECKSTYLE] Finding all files that match the pattern **/target/checkstyle-result.xml
[CHECKSTYLE] Parsing 21 files in <https://builds.apache.org/job/Apache-falcon/ws/>
[CHECKSTYLE] Successfully parsed file <https://builds.apache.org/job/Apache-falcon/ws/acquisition/target/checkstyle-result.xml>
of module  with 0 warnings.
[CHECKSTYLE] Successfully parsed file <https://builds.apache.org/job/Apache-falcon/ws/archival/target/checkstyle-result.xml>
of module  with 0 warnings.
[CHECKSTYLE] Successfully parsed file <https://builds.apache.org/job/Apache-falcon/ws/build-tools/target/checkstyle-result.xml>
of module  with 0 warnings.
[CHECKSTYLE] Successfully parsed file <https://builds.apache.org/job/Apache-falcon/ws/client/target/checkstyle-result.xml>
of module  with 0 warnings.
[CHECKSTYLE] Successfully parsed file <https://builds.apache.org/job/Apache-falcon/ws/common/target/checkstyle-result.xml>
of module  with 0 warnings.
[CHECKSTYLE] Successfully parsed file <https://builds.apache.org/job/Apache-falcon/ws/docs/target/checkstyle-result.xml>
of module  with 0 warnings.
[CHECKSTYLE] Successfully parsed file <https://builds.apache.org/job/Apache-falcon/ws/feed/target/checkstyle-result.xml>
of module  with 0 warnings.
[CHECKSTYLE] Successfully parsed file <https://builds.apache.org/job/Apache-falcon/ws/hadoop-dependencies/target/checkstyle-result.xml>
of module  with 0 warnings.
[CHECKSTYLE] Successfully parsed file <https://builds.apache.org/job/Apache-falcon/ws/hadoop-webapp/target/checkstyle-result.xml>
of module  with 0 warnings.
[CHECKSTYLE] Successfully parsed file <https://builds.apache.org/job/Apache-falcon/ws/messaging/target/checkstyle-result.xml>
of module  with 0 warnings.
[CHECKSTYLE] Successfully parsed file <https://builds.apache.org/job/Apache-falcon/ws/metrics/target/checkstyle-result.xml>
of module  with 0 warnings.
[CHECKSTYLE] Successfully parsed file <https://builds.apache.org/job/Apache-falcon/ws/oozie-el-extensions/target/checkstyle-result.xml>
of module  with 0 warnings.
[CHECKSTYLE] Successfully parsed file <https://builds.apache.org/job/Apache-falcon/ws/oozie/target/checkstyle-result.xml>
of module  with 1 warnings.
[CHECKSTYLE] Successfully parsed file <https://builds.apache.org/job/Apache-falcon/ws/prism/target/checkstyle-result.xml>
of module  with 0 warnings.
[CHECKSTYLE] Successfully parsed file <https://builds.apache.org/job/Apache-falcon/ws/process/target/checkstyle-result.xml>
of module  with 0 warnings.
[CHECKSTYLE] Successfully parsed file <https://builds.apache.org/job/Apache-falcon/ws/replication/target/checkstyle-result.xml>
of module  with 0 warnings.
[CHECKSTYLE] Successfully parsed file <https://builds.apache.org/job/Apache-falcon/ws/rerun/target/checkstyle-result.xml>
of module  with 0 warnings.
[CHECKSTYLE] Successfully parsed file <https://builds.apache.org/job/Apache-falcon/ws/retention/target/checkstyle-result.xml>
of module  with 0 warnings.
[CHECKSTYLE] Successfully parsed file <https://builds.apache.org/job/Apache-falcon/ws/target/checkstyle-result.xml>
of module  with 0 warnings.
[CHECKSTYLE] Successfully parsed file <https://builds.apache.org/job/Apache-falcon/ws/test-util/target/checkstyle-result.xml>
of module  with 0 warnings.
[CHECKSTYLE] Successfully parsed file <https://builds.apache.org/job/Apache-falcon/ws/webapp/target/checkstyle-result.xml>
of module  with 0 warnings.
[CHECKSTYLE] Computing warning deltas based on reference build #221
[FINDBUGS] Collecting findbugs analysis files...
[FINDBUGS] Finding all files that match the pattern **/target/findbugs.xml
[FINDBUGS] Parsing 15 files in <https://builds.apache.org/job/Apache-falcon/ws/>
[FINDBUGS] Successfully parsed file <https://builds.apache.org/job/Apache-falcon/ws/client/target/findbugs.xml>
of module  with 0 warnings.
[FINDBUGS] Successfully parsed file <https://builds.apache.org/job/Apache-falcon/ws/common/target/findbugs.xml>
of module  with 0 warnings.
[FINDBUGS] Successfully parsed file <https://builds.apache.org/job/Apache-falcon/ws/feed/target/findbugs.xml>
of module  with 0 warnings.
[FINDBUGS] Successfully parsed file <https://builds.apache.org/job/Apache-falcon/ws/hadoop-dependencies/target/findbugs.xml>
of module  with 0 warnings.
[FINDBUGS] Successfully parsed file <https://builds.apache.org/job/Apache-falcon/ws/hadoop-webapp/target/findbugs.xml>
of module  with 0 warnings.
[FINDBUGS] Successfully parsed file <https://builds.apache.org/job/Apache-falcon/ws/messaging/target/findbugs.xml>
of module  with 0 warnings.
[FINDBUGS] Successfully parsed file <https://builds.apache.org/job/Apache-falcon/ws/metrics/target/findbugs.xml>
of module  with 0 warnings.
[FINDBUGS] Successfully parsed file <https://builds.apache.org/job/Apache-falcon/ws/oozie-el-extensions/target/findbugs.xml>
of module  with 0 warnings.
[FINDBUGS] Successfully parsed file <https://builds.apache.org/job/Apache-falcon/ws/prism/target/findbugs.xml>
of module  with 0 warnings.
[FINDBUGS] Successfully parsed file <https://builds.apache.org/job/Apache-falcon/ws/process/target/findbugs.xml>
of module  with 0 warnings.
[FINDBUGS] Successfully parsed file <https://builds.apache.org/job/Apache-falcon/ws/replication/target/findbugs.xml>
of module  with 0 warnings.
[FINDBUGS] Successfully parsed file <https://builds.apache.org/job/Apache-falcon/ws/rerun/target/findbugs.xml>
of module  with 0 warnings.
[FINDBUGS] Successfully parsed file <https://builds.apache.org/job/Apache-falcon/ws/retention/target/findbugs.xml>
of module  with 0 warnings.
[FINDBUGS] Successfully parsed file <https://builds.apache.org/job/Apache-falcon/ws/test-util/target/findbugs.xml>
of module  with 0 warnings.
[FINDBUGS] Successfully parsed file <https://builds.apache.org/job/Apache-falcon/ws/webapp/target/findbugs.xml>
of module  with 0 warnings.
[FINDBUGS] Computing warning deltas based on reference build #221
Archiving artifacts
TestNG Reports Processing: START
Looking for TestNG results report in workspace using pattern: **/testng-results.xml
testng-results.xml was last modified before this build started. Ignoring it.
testng-results.xml was last modified before this build started. Ignoring it.
testng-results.xml was last modified before this build started. Ignoring it.
testng-results.xml was last modified before this build started. Ignoring it.
testng-results.xml was last modified before this build started. Ignoring it.
testng-results.xml was last modified before this build started. Ignoring it.
testng-results.xml was last modified before this build started. Ignoring it.
testng-results.xml was last modified before this build started. Ignoring it.
Saving reports...
Processing '/x1/jenkins/jenkins-home/jobs/Apache-falcon/builds/2014-03-05_00-22-38/testng/testng-results-1.xml'
Processing '/x1/jenkins/jenkins-home/jobs/Apache-falcon/builds/2014-03-05_00-22-38/testng/testng-results-2.xml'
Processing '/x1/jenkins/jenkins-home/jobs/Apache-falcon/builds/2014-03-05_00-22-38/testng/testng-results-3.xml'
Processing '/x1/jenkins/jenkins-home/jobs/Apache-falcon/builds/2014-03-05_00-22-38/testng/testng-results-4.xml'
Processing '/x1/jenkins/jenkins-home/jobs/Apache-falcon/builds/2014-03-05_00-22-38/testng/testng-results-5.xml'
Processing '/x1/jenkins/jenkins-home/jobs/Apache-falcon/builds/2014-03-05_00-22-38/testng/testng-results.xml'
TestNG Reports Processing: FINISH

Mime
View raw message