falcon-dev mailing list archives

Site index · List index
Message view « Date » · « Thread »
Top « Date » · « Thread »
From Shwetha GS <shwetha...@inmobi.com>
Subject Re: Build failed in Jenkins: Apache-falcon #227
Date Mon, 10 Mar 2014 06:07:37 GMT
Shaik, can you check this please?

-------------------------------------------------------
 T E S T S
-------------------------------------------------------
Running org.apache.falcon.retention.FeedEvictorTest
Tests run: 8, Failures: 1, Errors: 0, Skipped: 0, Time elapsed: 2.718 sec
<<< FAILURE! - in org.apache.falcon.retention.FeedEvictorTest
testEvictionWithEmptyDirs(org.apache.falcon.retention.FeedEvictorTest)
 Time elapsed: 0.431 sec  <<< FAILURE!
java.lang.AssertionError: expected:<34> but was:<33>
        at org.testng.Assert.fail(Assert.java:89)
        at org.testng.Assert.failNotEquals(Assert.java:489)
        at org.testng.Assert.assertEquals(Assert.java:118)
        at org.testng.Assert.assertEquals(Assert.java:260)
        at org.testng.Assert.assertEquals(Assert.java:270)
        at org.apache.falcon.retention.FeedEvictorTest.
testEvictionWithEmptyDirs(FeedEvictorTest.java:404)


On Mon, Mar 10, 2014 at 6:04 AM, Apache Jenkins Server <
jenkins@builds.apache.org> wrote:

> See <https://builds.apache.org/job/Apache-falcon/227/>
>
> ------------------------------------------
> [...truncated 2046 lines...]
> Running org.apache.falcon.replication.FeedReplicatorTest
> Tests run: 1, Failures: 0, Errors: 0, Skipped: 0, Time elapsed: 0.322 sec
> - in org.apache.falcon.replication.FeedReplicatorTest
> Running org.apache.falcon.replication.FilteredCopyListingTest
> Tests run: 6, Failures: 0, Errors: 0, Skipped: 0, Time elapsed: 1.452 sec
> - in org.apache.falcon.replication.FilteredCopyListingTest
>
> Results :
>
> Tests run: 7, Failures: 0, Errors: 0, Skipped: 0
>
> [INFO]
> [INFO] --- maven-site-plugin:3.2:site (default) @ falcon-replication ---
> [INFO] maven.site.skip = true: Skipping site generation
> [INFO]
> [INFO] --- maven-jar-plugin:2.4:jar (default-jar) @ falcon-replication ---
> [INFO] Building jar: <
> https://builds.apache.org/job/Apache-falcon/ws/replication/target/falcon-replication-0.5-incubating-SNAPSHOT.jar
> >
> [INFO]
> [INFO] --- maven-site-plugin:3.2:attach-descriptor (attach-descriptor) @
> falcon-replication ---
> [INFO]
> [INFO] --- maven-failsafe-plugin:2.16:integration-test (integration-test)
> @ falcon-replication ---
> [WARNING] The parameter forkMode is deprecated since version 2.14. Use
> forkCount and reuseForks instead.
> [INFO]
> [INFO] --- maven-failsafe-plugin:2.16:verify (verify) @ falcon-replication
> ---
> [INFO] Failsafe report directory: <
> https://builds.apache.org/job/Apache-falcon/ws/replication/target/failsafe-reports
> >
> [INFO]
> [INFO] --- apache-rat-plugin:0.7:check (rat-check) @ falcon-replication ---
> [INFO] Exclude: *.txt
> [INFO] Exclude: .git/**
> [INFO] Exclude: **/.idea/**
> [INFO] Exclude: **/*.twiki
> [INFO] Exclude: **/*.iml
> [INFO] Exclude: **/target/**
> [INFO] Exclude: **/activemq-data/**
> [INFO] Exclude: **/build/**
> [INFO] Exclude: **/*.patch
> [INFO] Exclude: derby.log
> [INFO] Exclude: **/logs/**
> [INFO] Exclude: **/.classpath
> [INFO] Exclude: **/.project
> [INFO] Exclude: **/.settings/**
> [INFO] Exclude: **/test-output/**
> [INFO] Exclude: **/data.txt
> [INFO] Exclude: **/maven-eclipse.xml
> [INFO] Exclude: **/.externalToolBuilders/**
> [INFO] Exclude: html5-ui/**
> [INFO]
> [INFO] --- maven-checkstyle-plugin:2.9.1:check (checkstyle-check) @
> falcon-replication ---
> [INFO] Starting audit...
> Audit done.
>
> [INFO]
> [INFO] >>> findbugs-maven-plugin:2.5.2:check (findbugs-check) @
> falcon-replication >>>
> Downloading:
> https://repository.cloudera.com/artifactory/cloudera-repos/asm/asm/maven-metadata.xml
>
> [WARNING] Could not transfer metadata asm:asm/maven-metadata.xml from/to
> cdh.repo (https://repository.cloudera.com/artifactory/cloudera-repos/):
> Error transferring file: Connection timed out
> [WARNING] Could not transfer metadata asm:asm/maven-metadata.xml from/to
> local.repository (file:../../local.repository/trunk): No connector
> available to access repository local.repository
> (file:../../local.repository/trunk) of type legacy using the available
> factories WagonRepositoryConnectorFactory
> [INFO]
> [INFO] --- findbugs-maven-plugin:2.5.2:findbugs (findbugs) @
> falcon-replication ---
> [INFO] Fork Value is true
> [INFO] Done FindBugs Analysis....
> [INFO]
> [INFO] <<< findbugs-maven-plugin:2.5.2:check (findbugs-check) @
> falcon-replication <<<
> [INFO]
> [INFO] --- findbugs-maven-plugin:2.5.2:check (findbugs-check) @
> falcon-replication ---
> [INFO] BugInstance size is 0
> [INFO] Error size is 0
> [INFO] No errors/warnings found
> [INFO]
> [INFO]
> ------------------------------------------------------------------------
> [INFO] Building Apache Falcon Retention 0.5-incubating-SNAPSHOT
> [INFO]
> ------------------------------------------------------------------------
> Downloading:
> https://repository.cloudera.com/artifactory/cloudera-repos/asm/asm/maven-metadata.xml
>
> [WARNING] Could not transfer metadata asm:asm/maven-metadata.xml from/to
> cdh.repo (https://repository.cloudera.com/artifactory/cloudera-repos/):
> Error transferring file: Connection timed out
> [WARNING] Could not transfer metadata asm:asm/maven-metadata.xml from/to
> local.repository (file:../../local.repository/trunk): No connector
> available to access repository local.repository
> (file:../../local.repository/trunk) of type legacy using the available
> factories WagonRepositoryConnectorFactory
> [INFO]
> [INFO] --- maven-clean-plugin:2.5:clean (default-clean) @ falcon-retention
> ---
> [INFO] Deleting <
> https://builds.apache.org/job/Apache-falcon/ws/retention/target>
> [INFO]
> [INFO] --- maven-enforcer-plugin:1.3.1:enforce (enforce-property) @
> falcon-retention ---
> [INFO]
> [INFO] --- buildnumber-maven-plugin:1.0:create (default) @
> falcon-retention ---
> [INFO] Checking for local modifications: skipped.
> [INFO] Updating project files from SCM: skipped.
> [INFO] Executing: /bin/sh -c cd <
> https://builds.apache.org/job/Apache-falcon/ws/retention> && git show
> [INFO] Working directory: <
> https://builds.apache.org/job/Apache-falcon/ws/retention>
> [INFO] Storing buildNumber: 5445e109bc7fbfea9295f3411a994485b65d1477 at
> timestamp: 1394411636455
> [INFO] Executing: /bin/sh -c cd <
> https://builds.apache.org/job/Apache-falcon/ws/retention> && git show
> [INFO] Working directory: <
> https://builds.apache.org/job/Apache-falcon/ws/retention>
> [INFO] Storing buildScmBranch: UNKNOWN
> [INFO]
> [INFO] --- maven-remote-resources-plugin:1.4:process (default) @
> falcon-retention ---
> [INFO]
> [INFO] --- maven-resources-plugin:2.6:resources (default-resources) @
> falcon-retention ---
> [INFO] Using 'UTF-8' encoding to copy filtered resources.
> [INFO] skip non existing resourceDirectory <
> https://builds.apache.org/job/Apache-falcon/ws/retention/src/main/resources
> >
> [INFO] skip non existing resourceDirectory <
> https://builds.apache.org/job/Apache-falcon/ws/retention/src/main/resources
> >
> [INFO] Copying 2 resources to META-INF
> [INFO] Copying 3 resources
> [INFO]
> [INFO] --- maven-compiler-plugin:2.3.2:compile (default-compile) @
> falcon-retention ---
> [INFO] Compiling 1 source file to <
> https://builds.apache.org/job/Apache-falcon/ws/retention/target/classes>
> [INFO]
> [INFO] --- maven-resources-plugin:2.6:testResources
> (default-testResources) @ falcon-retention ---
> [INFO] Using 'UTF-8' encoding to copy filtered resources.
> [INFO] skip non existing resourceDirectory <
> https://builds.apache.org/job/Apache-falcon/ws/retention/src/test/resources
> >
> [INFO] Copying 3 resources
> [INFO]
> [INFO] --- maven-compiler-plugin:2.3.2:testCompile (default-testCompile) @
> falcon-retention ---
> [INFO] Compiling 1 source file to <
> https://builds.apache.org/job/Apache-falcon/ws/retention/target/test-classes
> >
> [INFO]
> [INFO] --- maven-surefire-plugin:2.16:test (default-test) @
> falcon-retention ---
> [WARNING] The parameter forkMode is deprecated since version 2.14. Use
> forkCount and reuseForks instead.
> [INFO] Surefire report directory: <
> https://builds.apache.org/job/Apache-falcon/ws/retention/target/surefire-reports
> >
>
> -------------------------------------------------------
>  T E S T S
> -------------------------------------------------------
>
> -------------------------------------------------------
>  T E S T S
> -------------------------------------------------------
> Running org.apache.falcon.retention.FeedEvictorTest
> Tests run: 8, Failures: 1, Errors: 0, Skipped: 0, Time elapsed: 2.718 sec
> <<< FAILURE! - in org.apache.falcon.retention.FeedEvictorTest
> testEvictionWithEmptyDirs(org.apache.falcon.retention.FeedEvictorTest)
>  Time elapsed: 0.431 sec  <<< FAILURE!
> java.lang.AssertionError: expected:<34> but was:<33>
>         at org.testng.Assert.fail(Assert.java:89)
>         at org.testng.Assert.failNotEquals(Assert.java:489)
>         at org.testng.Assert.assertEquals(Assert.java:118)
>         at org.testng.Assert.assertEquals(Assert.java:260)
>         at org.testng.Assert.assertEquals(Assert.java:270)
>         at
> org.apache.falcon.retention.FeedEvictorTest.testEvictionWithEmptyDirs(FeedEvictorTest.java:404)
>
>
> Results :
>
> Failed tests:
>   FeedEvictorTest.testEvictionWithEmptyDirs:404 expected:<34> but was:<33>
>
> Tests run: 8, Failures: 1, Errors: 0, Skipped: 0
>
> [INFO]
> ------------------------------------------------------------------------
> [INFO] Reactor Summary:
> [INFO]
> [INFO] Checkstyle ........................................ SUCCESS [1.051s]
> [INFO] Apache Falcon ..................................... SUCCESS [5.128s]
> [INFO] Build Tools ....................................... SUCCESS [3.791s]
> [INFO] Apache Falcon CLI client .......................... SUCCESS
> [28.674s]
> [INFO] Apache Falcon Metrics ............................. SUCCESS
> [11.163s]
> [INFO] Apache Falcon Hadoop Dependencies ................. SUCCESS
> [11.715s]
> [INFO] Apache Falcon Test Utility ........................ SUCCESS [9.915s]
> [INFO] Apache Falcon Commons ............................. SUCCESS
> [2:11.497s]
> [INFO] Apache Falcon Oozie EL Extension .................. SUCCESS
> [14.530s]
> [INFO] Apache Falcon Embedded Hadoop - Test Cluster ...... SUCCESS
> [1:50.189s]
> [INFO] Apache Falcon Messaging ........................... SUCCESS
> [1:03.127s]
> [INFO] Apache Falcon Oozie Adaptor ....................... SUCCESS
> [1:11.824s]
> [INFO] Apache Falcon Feed ................................ SUCCESS
> [1:02.830s]
> [INFO] Apache Falcon Process ............................. SUCCESS
> [1:03.997s]
> [INFO] Apache Falcon Acquisition ......................... SUCCESS [0.564s]
> [INFO] Apache Falcon Replication ......................... SUCCESS
> [58.355s]
> [INFO] Apache Falcon Retention ........................... FAILURE
> [26.115s]
> [INFO] Apache Falcon Archival ............................ SKIPPED
> [INFO] Apache Falcon Rerun ............................... SKIPPED
> [INFO] Apache Falcon Prism ............................... SKIPPED
> [INFO] Apache Falcon Web Application ..................... SKIPPED
> [INFO] Apache Falcon Documentation ....................... SKIPPED
> [INFO]
> ------------------------------------------------------------------------
> [INFO] BUILD FAILURE
> [INFO]
> ------------------------------------------------------------------------
> [INFO] Total time: 11:15.098s
> [INFO] Finished at: Mon Mar 10 00:34:01 UTC 2014
> [INFO] Final Memory: 226M/475M
> [INFO]
> ------------------------------------------------------------------------
> [ERROR] Failed to execute goal
> org.apache.maven.plugins:maven-surefire-plugin:2.16:test (default-test) on
> project falcon-retention: There are test failures.
> [ERROR]
> [ERROR] Please refer to <
> https://builds.apache.org/job/Apache-falcon/ws/retention/target/surefire-reports>
> for the individual test results.
> [ERROR] -> [Help 1]
> [ERROR]
> [ERROR] To see the full stack trace of the errors, re-run Maven with the
> -e switch.
> [ERROR] Re-run Maven using the -X switch to enable full debug logging.
> [ERROR]
> [ERROR] For more information about the errors and possible solutions,
> please read the following articles:
> [ERROR] [Help 1]
> http://cwiki.apache.org/confluence/display/MAVEN/MojoFailureException
> [ERROR]
> [ERROR] After correcting the problems, you can resume the build with the
> command
> [ERROR]   mvn <goals> -rf :falcon-retention
> Build step 'Execute shell' marked build as failure
> [CHECKSTYLE] Collecting checkstyle analysis files...
> [CHECKSTYLE] Finding all files that match the pattern
> **/target/checkstyle-result.xml
> [CHECKSTYLE] Parsing 20 files in <
> https://builds.apache.org/job/Apache-falcon/ws/>
> [CHECKSTYLE] Successfully parsed file <
> https://builds.apache.org/job/Apache-falcon/ws/acquisition/target/checkstyle-result.xml>
> of module  with 0 warnings.
> [CHECKSTYLE] Successfully parsed file <
> https://builds.apache.org/job/Apache-falcon/ws/archival/target/checkstyle-result.xml>
> of module  with 0 warnings.
> [CHECKSTYLE] Successfully parsed file <
> https://builds.apache.org/job/Apache-falcon/ws/build-tools/target/checkstyle-result.xml>
> of module  with 0 warnings.
> [CHECKSTYLE] Successfully parsed file <
> https://builds.apache.org/job/Apache-falcon/ws/client/target/checkstyle-result.xml>
> of module  with 0 warnings.
> [CHECKSTYLE] Successfully parsed file <
> https://builds.apache.org/job/Apache-falcon/ws/common/target/checkstyle-result.xml>
> of module  with 0 warnings.
> [CHECKSTYLE] Successfully parsed file <
> https://builds.apache.org/job/Apache-falcon/ws/docs/target/checkstyle-result.xml>
> of module  with 0 warnings.
> [CHECKSTYLE] Successfully parsed file <
> https://builds.apache.org/job/Apache-falcon/ws/feed/target/checkstyle-result.xml>
> of module  with 0 warnings.
> [CHECKSTYLE] Successfully parsed file <
> https://builds.apache.org/job/Apache-falcon/ws/hadoop-dependencies/target/checkstyle-result.xml>
> of module  with 0 warnings.
> [CHECKSTYLE] Successfully parsed file <
> https://builds.apache.org/job/Apache-falcon/ws/hadoop-webapp/target/checkstyle-result.xml>
> of module  with 0 warnings.
> [CHECKSTYLE] Successfully parsed file <
> https://builds.apache.org/job/Apache-falcon/ws/messaging/target/checkstyle-result.xml>
> of module  with 0 warnings.
> [CHECKSTYLE] Successfully parsed file <
> https://builds.apache.org/job/Apache-falcon/ws/metrics/target/checkstyle-result.xml>
> of module  with 0 warnings.
> [CHECKSTYLE] Successfully parsed file <
> https://builds.apache.org/job/Apache-falcon/ws/oozie-el-extensions/target/checkstyle-result.xml>
> of module  with 0 warnings.
> [CHECKSTYLE] Successfully parsed file <
> https://builds.apache.org/job/Apache-falcon/ws/oozie/target/checkstyle-result.xml>
> of module  with 0 warnings.
> [CHECKSTYLE] Successfully parsed file <
> https://builds.apache.org/job/Apache-falcon/ws/prism/target/checkstyle-result.xml>
> of module  with 0 warnings.
> [CHECKSTYLE] Successfully parsed file <
> https://builds.apache.org/job/Apache-falcon/ws/process/target/checkstyle-result.xml>
> of module  with 0 warnings.
> [CHECKSTYLE] Successfully parsed file <
> https://builds.apache.org/job/Apache-falcon/ws/replication/target/checkstyle-result.xml>
> of module  with 0 warnings.
> [CHECKSTYLE] Successfully parsed file <
> https://builds.apache.org/job/Apache-falcon/ws/rerun/target/checkstyle-result.xml>
> of module  with 0 warnings.
> [CHECKSTYLE] Successfully parsed file <
> https://builds.apache.org/job/Apache-falcon/ws/target/checkstyle-result.xml>
> of module  with 0 warnings.
> [CHECKSTYLE] Successfully parsed file <
> https://builds.apache.org/job/Apache-falcon/ws/test-util/target/checkstyle-result.xml>
> of module  with 0 warnings.
> [CHECKSTYLE] Successfully parsed file <
> https://builds.apache.org/job/Apache-falcon/ws/webapp/target/checkstyle-result.xml>
> of module  with 0 warnings.
> [CHECKSTYLE] Computing warning deltas based on reference build #226
> [FINDBUGS] Collecting findbugs analysis files...
> [FINDBUGS] Finding all files that match the pattern **/target/findbugs.xml
> [FINDBUGS] Parsing 15 files in <
> https://builds.apache.org/job/Apache-falcon/ws/>
> [FINDBUGS] Successfully parsed file <
> https://builds.apache.org/job/Apache-falcon/ws/client/target/findbugs.xml>
> of module  with 0 warnings.
> [FINDBUGS] Successfully parsed file <
> https://builds.apache.org/job/Apache-falcon/ws/common/target/findbugs.xml>
> of module  with 0 warnings.
> [FINDBUGS] Successfully parsed file <
> https://builds.apache.org/job/Apache-falcon/ws/feed/target/findbugs.xml>
> of module  with 0 warnings.
> [FINDBUGS] Successfully parsed file <
> https://builds.apache.org/job/Apache-falcon/ws/hadoop-dependencies/target/findbugs.xml>
> of module  with 0 warnings.
> [FINDBUGS] Successfully parsed file <
> https://builds.apache.org/job/Apache-falcon/ws/hadoop-webapp/target/findbugs.xml>
> of module  with 0 warnings.
> [FINDBUGS] Successfully parsed file <
> https://builds.apache.org/job/Apache-falcon/ws/messaging/target/findbugs.xml>
> of module  with 0 warnings.
> [FINDBUGS] Successfully parsed file <
> https://builds.apache.org/job/Apache-falcon/ws/metrics/target/findbugs.xml>
> of module  with 0 warnings.
> [FINDBUGS] Successfully parsed file <
> https://builds.apache.org/job/Apache-falcon/ws/oozie-el-extensions/target/findbugs.xml>
> of module  with 0 warnings.
> [FINDBUGS] Successfully parsed file <
> https://builds.apache.org/job/Apache-falcon/ws/oozie/target/findbugs.xml>
> of module  with 0 warnings.
> [FINDBUGS] Successfully parsed file <
> https://builds.apache.org/job/Apache-falcon/ws/prism/target/findbugs.xml>
> of module  with 0 warnings.
> [FINDBUGS] Successfully parsed file <
> https://builds.apache.org/job/Apache-falcon/ws/process/target/findbugs.xml>
> of module  with 0 warnings.
> [FINDBUGS] Successfully parsed file <
> https://builds.apache.org/job/Apache-falcon/ws/replication/target/findbugs.xml>
> of module  with 0 warnings.
> [FINDBUGS] Successfully parsed file <
> https://builds.apache.org/job/Apache-falcon/ws/rerun/target/findbugs.xml>
> of module  with 0 warnings.
> [FINDBUGS] Successfully parsed file <
> https://builds.apache.org/job/Apache-falcon/ws/test-util/target/findbugs.xml>
> of module  with 0 warnings.
> [FINDBUGS] Successfully parsed file <
> https://builds.apache.org/job/Apache-falcon/ws/webapp/target/findbugs.xml>
> of module  with 0 warnings.
> [FINDBUGS] Computing warning deltas based on reference build #226
> Archiving artifacts
> TestNG Reports Processing: START
> Looking for TestNG results report in workspace using pattern:
> **/testng-results.xml
> testng-results.xml was last modified before this build started. Ignoring
> it.
> testng-results.xml was last modified before this build started. Ignoring
> it.
> testng-results.xml was last modified before this build started. Ignoring
> it.
> testng-results.xml was last modified before this build started. Ignoring
> it.
> Saving reports...
> Processing
> '/x1/jenkins/jenkins-home/jobs/Apache-falcon/builds/2014-03-10_00-22-38/testng/testng-results-1.xml'
> Processing
> '/x1/jenkins/jenkins-home/jobs/Apache-falcon/builds/2014-03-10_00-22-38/testng/testng-results-2.xml'
> Processing
> '/x1/jenkins/jenkins-home/jobs/Apache-falcon/builds/2014-03-10_00-22-38/testng/testng-results-3.xml'
> Processing
> '/x1/jenkins/jenkins-home/jobs/Apache-falcon/builds/2014-03-10_00-22-38/testng/testng-results-4.xml'
> Processing
> '/x1/jenkins/jenkins-home/jobs/Apache-falcon/builds/2014-03-10_00-22-38/testng/testng-results-5.xml'
> Processing
> '/x1/jenkins/jenkins-home/jobs/Apache-falcon/builds/2014-03-10_00-22-38/testng/testng-results-6.xml'
> Processing
> '/x1/jenkins/jenkins-home/jobs/Apache-falcon/builds/2014-03-10_00-22-38/testng/testng-results-7.xml'
> Processing
> '/x1/jenkins/jenkins-home/jobs/Apache-falcon/builds/2014-03-10_00-22-38/testng/testng-results-8.xml'
> Processing
> '/x1/jenkins/jenkins-home/jobs/Apache-falcon/builds/2014-03-10_00-22-38/testng/testng-results-9.xml'
> Processing
> '/x1/jenkins/jenkins-home/jobs/Apache-falcon/builds/2014-03-10_00-22-38/testng/testng-results.xml'
> Failed Tests/Configs found. Marking build as UNSTABLE.
> TestNG Reports Processing: FINISH
>

-- 
_____________________________________________________________
The information contained in this communication is intended solely for the 
use of the individual or entity to whom it is addressed and others 
authorized to receive it. It may contain confidential or legally privileged 
information. If you are not the intended recipient you are hereby notified 
that any disclosure, copying, distribution or taking any action in reliance 
on the contents of this information is strictly prohibited and may be 
unlawful. If you have received this communication in error, please notify 
us immediately by responding to this email and then delete it from your 
system. The firm is neither liable for the proper and complete transmission 
of the information contained in this communication nor for any delay in its 
receipt.

Mime
  • Unnamed multipart/alternative (inline, None, 0 bytes)
View raw message