falcon-dev mailing list archives

Site index · List index
Message view « Date » · « Thread »
Top « Date » · « Thread »
From Apache Jenkins Server <jenk...@builds.apache.org>
Subject Build failed in Jenkins: Apache-falcon #368
Date Sat, 09 Aug 2014 02:35:58 GMT
See <https://builds.apache.org/job/Apache-falcon/368/changes>

Changes:

[venkatesh] FALCON-453 - possible LICENSE/NOTICE issues. Contributed by Chris Douglas

------------------------------------------
[...truncated 8934 lines...]
[INFO] Copying openjpa-persistence-jdbc-2.2.2.jar to <https://builds.apache.org/job/Apache-falcon/ws/webapp/target/dependency/openjpa-persistence-jdbc-2.2.2.jar>
[INFO] Copying commons-logging-api-1.1.jar to <https://builds.apache.org/job/Apache-falcon/ws/webapp/target/dependency/commons-logging-api-1.1.jar>
[INFO] Copying geronimo-jaspic_1.0_spec-1.0.jar to <https://builds.apache.org/job/Apache-falcon/ws/webapp/target/dependency/geronimo-jaspic_1.0_spec-1.0.jar>
[INFO] Copying geronimo-jpa_2.0_spec-1.1.jar to <https://builds.apache.org/job/Apache-falcon/ws/webapp/target/dependency/geronimo-jpa_2.0_spec-1.1.jar>
[INFO] Copying commons-collections-3.2.1.jar to <https://builds.apache.org/job/Apache-falcon/ws/webapp/target/dependency/commons-collections-3.2.1.jar>
[INFO] Copying falcon-prism-0.5-incubating-classes.jar to <https://builds.apache.org/job/Apache-falcon/ws/webapp/target/dependency/falcon-prism-0.5-incubating-classes.jar>
[INFO] Copying json-20090211.jar to <https://builds.apache.org/job/Apache-falcon/ws/webapp/target/dependency/json-20090211.jar>
[INFO] Copying jersey-client-1.9.jar to <https://builds.apache.org/job/Apache-falcon/ws/webapp/target/dependency/jersey-client-1.9.jar>
[INFO] Copying jpam-1.1.jar to <https://builds.apache.org/job/Apache-falcon/ws/webapp/target/dependency/jpam-1.1.jar>
[INFO] Copying jms-1.1.jar to <https://builds.apache.org/job/Apache-falcon/ws/webapp/target/dependency/jms-1.1.jar>
[INFO] Copying metrics-ganglia-3.0.0-BETA3.jar to <https://builds.apache.org/job/Apache-falcon/ws/webapp/target/dependency/metrics-ganglia-3.0.0-BETA3.jar>
[INFO] Copying json-simple-1.1.1.jar to <https://builds.apache.org/job/Apache-falcon/ws/webapp/target/dependency/json-simple-1.1.1.jar>
[INFO] Copying derby-10.6.1.0.jar to <https://builds.apache.org/job/Apache-falcon/ws/webapp/target/dependency/derby-10.6.1.0.jar>
[INFO] Copying falcon-oozie-el-extension-0.5-incubating.jar to <https://builds.apache.org/job/Apache-falcon/ws/webapp/target/dependency/falcon-oozie-el-extension-0.5-incubating.jar>
[INFO] Copying falcon-common-0.5-incubating.jar to <https://builds.apache.org/job/Apache-falcon/ws/webapp/target/dependency/falcon-common-0.5-incubating.jar>
[INFO] Copying commons-configuration-1.6.jar to <https://builds.apache.org/job/Apache-falcon/ws/webapp/target/dependency/commons-configuration-1.6.jar>
[INFO] Copying hive-ant-0.13.0.jar to <https://builds.apache.org/job/Apache-falcon/ws/webapp/target/dependency/hive-ant-0.13.0.jar>
[INFO] Copying slf4j-log4j12-1.6.1.jar to <https://builds.apache.org/job/Apache-falcon/ws/webapp/target/dependency/slf4j-log4j12-1.6.1.jar>
[INFO] Copying ant-launcher-1.9.1.jar to <https://builds.apache.org/job/Apache-falcon/ws/webapp/target/dependency/ant-launcher-1.9.1.jar>
[INFO] Copying high-scale-lib-1.1.4.jar to <https://builds.apache.org/job/Apache-falcon/ws/webapp/target/dependency/high-scale-lib-1.1.4.jar>
[INFO] Copying activemq-core-5.4.3.jar to <https://builds.apache.org/job/Apache-falcon/ws/webapp/target/dependency/activemq-core-5.4.3.jar>
[INFO] Copying commons-math-2.1.jar to <https://builds.apache.org/job/Apache-falcon/ws/webapp/target/dependency/commons-math-2.1.jar>
[INFO] Copying spring-core-3.0.3.RELEASE.jar to <https://builds.apache.org/job/Apache-falcon/ws/webapp/target/dependency/spring-core-3.0.3.RELEASE.jar>
[INFO] Copying commons-lang3-3.1.jar to <https://builds.apache.org/job/Apache-falcon/ws/webapp/target/dependency/commons-lang3-3.1.jar>
[INFO] Copying libthrift-0.9.0.jar to <https://builds.apache.org/job/Apache-falcon/ws/webapp/target/dependency/libthrift-0.9.0.jar>
[INFO] Copying hive-cli-0.13.0.jar to <https://builds.apache.org/job/Apache-falcon/ws/webapp/target/dependency/hive-cli-0.13.0.jar>
[INFO] Copying kryo-2.21-shaded.jar to <https://builds.apache.org/job/Apache-falcon/ws/webapp/target/dependency/kryo-2.21-shaded.jar>
[INFO] Copying oozie-client-4.0.1-falcon.jar to <https://builds.apache.org/job/Apache-falcon/ws/webapp/target/dependency/oozie-client-4.0.1-falcon.jar>
[INFO] Copying mockito-all-1.8.5.jar to <https://builds.apache.org/job/Apache-falcon/ws/webapp/target/dependency/mockito-all-1.8.5.jar>
[INFO] Copying geronimo-spec-jta-1.0.1B-rc4.jar to <https://builds.apache.org/job/Apache-falcon/ws/webapp/target/dependency/geronimo-spec-jta-1.0.1B-rc4.jar>
[INFO] Copying libfb303-0.9.0.jar to <https://builds.apache.org/job/Apache-falcon/ws/webapp/target/dependency/libfb303-0.9.0.jar>
[INFO] Copying jetty-6.1.26.jar to <https://builds.apache.org/job/Apache-falcon/ws/webapp/target/dependency/jetty-6.1.26.jar>
[INFO] Copying jersey-server-1.9.jar to <https://builds.apache.org/job/Apache-falcon/ws/webapp/target/dependency/jersey-server-1.9.jar>
[INFO] 
[INFO] --- maven-antrun-plugin:1.6:run (default) @ falcon-webapp ---
[INFO] Executing tasks

main:
     [copy] Copying 1 file to <https://builds.apache.org/job/Apache-falcon/ws/webapp/target/webapps>
[INFO] Executed tasks
[INFO] 
[INFO] >>> maven-jetty-plugin:6.1.26:run (start-jetty) @ falcon-webapp >>>
[INFO] 
[INFO] --- maven-enforcer-plugin:1.3.1:enforce (enforce-property) @ falcon-webapp ---
[INFO] 
[INFO] --- buildnumber-maven-plugin:1.0:create (default) @ falcon-webapp ---
[INFO] Checking for local modifications: skipped.
[INFO] Updating project files from SCM: skipped.
[INFO] Executing: /bin/sh -c cd <https://builds.apache.org/job/Apache-falcon/ws/webapp>
&& git show
[INFO] Working directory: <https://builds.apache.org/job/Apache-falcon/ws/webapp>
[INFO] Storing buildNumber: 4b6abff01955a903f2647dc541c542716d13acf4 at timestamp: 1407551604024
[INFO] Executing: /bin/sh -c cd <https://builds.apache.org/job/Apache-falcon/ws/webapp>
&& git show
[INFO] Working directory: <https://builds.apache.org/job/Apache-falcon/ws/webapp>
[INFO] Storing buildScmBranch: UNKNOWN
[INFO] 
[INFO] --- maven-resources-plugin:2.6:copy-resources (copy-resources) @ falcon-webapp ---
[INFO] Using 'UTF-8' encoding to copy filtered resources.
[INFO] Copying 3 resources
[INFO] 
[INFO] --- maven-dependency-plugin:2.8:unpack (unpack) @ falcon-webapp ---
[INFO] Configured Artifact: org.apache.oozie:oozie-client:?:jar
[INFO] oozie-client-4.0.1-falcon.jar already unpacked.
[INFO] 
[INFO] --- maven-remote-resources-plugin:1.4:process (default) @ falcon-webapp ---
[INFO] 
[INFO] --- maven-resources-plugin:2.6:resources (default-resources) @ falcon-webapp ---
[INFO] Using 'UTF-8' encoding to copy filtered resources.
[INFO] Copying 2 resources
[INFO] Copying 1 resource
[INFO] Copying 1 resource
[INFO] Copying 2 resources to META-INF
[INFO] Copying 3 resources
[INFO] Copying 3 resources
[INFO] 
[INFO] --- maven-compiler-plugin:2.3.2:compile (default-compile) @ falcon-webapp ---
[INFO] Nothing to compile - all classes are up to date
[INFO] 
[INFO] --- maven-resources-plugin:2.6:testResources (default-testResources) @ falcon-webapp
---
[INFO] Using 'UTF-8' encoding to copy filtered resources.
[INFO] Copying 26 resources
[INFO] Copying 3 resources
[INFO] Copying 3 resources
[INFO] 
[INFO] --- maven-compiler-plugin:2.3.2:testCompile (default-testCompile) @ falcon-webapp ---
[INFO] Nothing to compile - all classes are up to date
[INFO] 
[INFO] <<< maven-jetty-plugin:6.1.26:run (start-jetty) @ falcon-webapp <<<
[INFO] 
[INFO] --- maven-jetty-plugin:6.1.26:run (start-jetty) @ falcon-webapp ---
[INFO] Configuring Jetty for project: Apache Falcon Web Application
[INFO] Webapp source directory = <https://builds.apache.org/job/Apache-falcon/ws/webapp/src/main/webapp>
[INFO] Reload Mechanic: automatic
[INFO] Classes = <https://builds.apache.org/job/Apache-falcon/ws/webapp/target/classes>
[INFO] Logging to org.slf4j.impl.SimpleLogger(org.mortbay.log) via org.mortbay.log.Slf4jLog
[INFO] Context path = /falcon-webapp
[INFO] Tmp directory =  determined at runtime
[INFO] Web defaults = org/mortbay/jetty/webapp/webdefault.xml
[INFO] Web overrides =  none
[INFO] Adding overlay: jar:<https://builds.apache.org/job/Apache-falcon/ws/hadoop-webapp/target/falcon-hadoop-webapp-0.5-incubating.war!/>
[INFO] web.xml file = <https://builds.apache.org/job/Apache-falcon/ws/webapp/src/main/webapp/WEB-INF/web.xml>
[INFO] Webapp directory = <https://builds.apache.org/job/Apache-falcon/ws/webapp/src/main/webapp>
[INFO] Starting jetty 6.1.26 ...
[INFO] jetty-6.1.26
[INFO] No Transaction manager found - if your webapp requires one, please configure one.
SLF4J: Class path contains multiple SLF4J bindings.
SLF4J: Found binding in [jar:<https://builds.apache.org/job/Apache-falcon/ws/webapp/target/work/lib/Jetty-5240544366226750535.jar!/org/slf4j/impl/StaticLoggerBinder.class]>
SLF4J: Found binding in [jar:file:/home/jenkins/.m2/repository/org/slf4j/slf4j-log4j12/1.6.1/slf4j-log4j12-1.6.1.jar!/org/slf4j/impl/StaticLoggerBinder.class]
SLF4J: See http://www.slf4j.org/codes.html#multiple_bindings for an explanation.
Aug 9, 2014 2:33:31 AM com.sun.jersey.api.core.PackagesResourceConfig init
INFO: Scanning for root resource and provider classes in the packages:
  org.apache.falcon.resource.admin
  org.apache.falcon.resource.proxy
  org.apache.falcon.resource.provider
  org.apache.falcon.resource.metadata
Aug 9, 2014 2:33:31 AM com.sun.jersey.api.core.ScanningResourceConfig logClasses
INFO: Root resource classes found:
  class org.apache.falcon.resource.metadata.LineageMetadataResource
  class org.apache.falcon.resource.admin.AdminResource
  class org.apache.falcon.resource.proxy.InstanceManagerProxy
  class org.apache.falcon.resource.proxy.SchedulableEntityManagerProxy
Aug 9, 2014 2:33:31 AM com.sun.jersey.api.core.ScanningResourceConfig logClasses
INFO: Provider classes found:
  class org.apache.falcon.resource.provider.JAXBContextResolver
Aug 9, 2014 2:33:31 AM com.sun.jersey.server.impl.application.WebApplicationImpl _initiate
INFO: Initiating Jersey application, version 'Jersey: 1.9 09/02/2011 11:17 AM'
[INFO] Extract <https://builds.apache.org/job/Apache-falcon/ws/webapp/target/webapps/oozie.war>
to /tmp/Jetty_0_0_0_0_41443_oozie.war__oozie__.lf8rot/webapp
log4j:WARN No appenders could be found for logger (oozieops).
log4j:WARN Please initialize the log4j system properly.
log4j:WARN See http://logging.apache.org/log4j/1.2/faq.html#noconfig for more info.
SLF4J: Class path contains multiple SLF4J bindings.
SLF4J: Found binding in [jar:file:/tmp/Jetty_0_0_0_0_41443_oozie.war__oozie__.lf8rot/webapp/WEB-INF/lib/slf4j-log4j12-1.6.6.jar!/org/slf4j/impl/StaticLoggerBinder.class]
SLF4J: Found binding in [jar:file:/tmp/Jetty_0_0_0_0_41443_oozie.war__oozie__.lf8rot/webapp/WEB-INF/lib/slf4j-simple-1.6.6.jar!/org/slf4j/impl/StaticLoggerBinder.class]
SLF4J: Found binding in [jar:file:/tmp/Jetty_0_0_0_0_41443_oozie.war__oozie__.lf8rot/webapp/WEB-INF/lib/slf4j-log4j12-1.6.1.jar!/org/slf4j/impl/StaticLoggerBinder.class]
SLF4J: See http://www.slf4j.org/codes.html#multiple_bindings for an explanation.
[WARNING] PWC6183: Invalid PUBLIC ID: null
[INFO] Extract <https://builds.apache.org/job/Apache-falcon/ws/webapp/target/webapps/hadoop.war>
to /tmp/Jetty_0_0_0_0_41443_hadoop.war__hadoop__.nyu8ob/webapp
Starting hive metastore on port 49083
[INFO] Started SslSocketConnector@0.0.0.0:41443
[WARNING] failed SelectChannelConnector@0.0.0.0:41000: java.net.BindException: Address already
in use
[WARNING] failed Server@740f6ba5: java.net.BindException: Address already in use
[INFO] ------------------------------------------------------------------------
[INFO] Reactor Summary:
[INFO] 
[INFO] Checkstyle ........................................ SUCCESS [  1.398 s]
[INFO] Apache Falcon ..................................... SUCCESS [  5.680 s]
[INFO] Build Tools ....................................... SUCCESS [  4.998 s]
[INFO] Apache Falcon CLI client .......................... SUCCESS [ 33.087 s]
[INFO] Apache Falcon Metrics ............................. SUCCESS [ 13.754 s]
[INFO] Apache Falcon Hadoop Dependencies ................. SUCCESS [ 14.921 s]
[INFO] Apache Falcon Test Utility ........................ SUCCESS [ 13.820 s]
[INFO] Apache Falcon Commons ............................. SUCCESS [01:27 min]
[INFO] Apache Falcon Oozie EL Extension .................. SUCCESS [ 17.611 s]
[INFO] Apache Falcon Embedded Hadoop - Test Cluster ...... SUCCESS [ 31.468 s]
[INFO] Apache Falcon Messaging ........................... SUCCESS [ 26.680 s]
[INFO] Apache Falcon Oozie Adaptor ....................... SUCCESS [ 35.960 s]
[INFO] Apache Falcon Feed ................................ SUCCESS [ 27.641 s]
[INFO] Apache Falcon Process ............................. SUCCESS [ 29.925 s]
[INFO] Apache Falcon Acquisition ......................... SUCCESS [  0.697 s]
[INFO] Apache Falcon Replication ......................... SUCCESS [ 20.973 s]
[INFO] Apache Falcon Retention ........................... SUCCESS [ 23.400 s]
[INFO] Apache Falcon Archival ............................ SUCCESS [  0.711 s]
[INFO] Apache Falcon Rerun ............................... SUCCESS [ 32.584 s]
[INFO] Apache Falcon Prism ............................... SUCCESS [ 56.734 s]
[INFO] Apache Falcon Web Application ..................... FAILURE [ 34.507 s]
[INFO] Apache Falcon Documentation ....................... SKIPPED
[INFO] ------------------------------------------------------------------------
[INFO] BUILD FAILURE
[INFO] ------------------------------------------------------------------------
[INFO] Total time: 08:34 min
[INFO] Finished at: 2014-08-09T02:33:44+00:00
[INFO] Final Memory: 406M/707M
[INFO] ------------------------------------------------------------------------
[ERROR] Failed to execute goal org.mortbay.jetty:maven-jetty-plugin:6.1.26:run (start-jetty)
on project falcon-webapp: Failure: Address already in use -> [Help 1]
[ERROR] 
[ERROR] To see the full stack trace of the errors, re-run Maven with the -e switch.
[ERROR] Re-run Maven using the -X switch to enable full debug logging.
[ERROR] 
[ERROR] For more information about the errors and possible solutions, please read the following
articles:
[ERROR] [Help 1] http://cwiki.apache.org/confluence/display/MAVEN/MojoExecutionException
[ERROR] 
[ERROR] After correcting the problems, you can resume the build with the command
[ERROR]   mvn <goals> -rf :falcon-webapp
[INFO] Shutdown hook executing
[INFO] Stopped SelectChannelConnector@0.0.0.0:41000
[INFO] Stopped SslSocketConnector@0.0.0.0:41443
Exception in thread "Thread-620" java.lang.RuntimeException: java.lang.IllegalStateException:
Shutdown in progress
	at org.apache.falcon.listener.HadoopStartupListener$1.run(HadoopStartupListener.java:85)
	at java.lang.Thread.run(Thread.java:662)
Caused by: java.lang.IllegalStateException: Shutdown in progress
	at java.lang.ApplicationShutdownHooks.add(ApplicationShutdownHooks.java:39)
	at java.lang.Runtime.addShutdownHook(Runtime.java:192)
	at org.apache.hadoop.hive.metastore.HiveMetaStore.main(HiveMetaStore.java:5073)
	at org.apache.falcon.listener.HadoopStartupListener$1.run(HadoopStartupListener.java:83)
	... 1 more
[INFO] Shutdown hook complete
Build step 'Execute shell' marked build as failure
[CHECKSTYLE] Collecting checkstyle analysis files...
[CHECKSTYLE] Finding all files that match the pattern **/target/checkstyle-result.xml
[CHECKSTYLE] Parsing 19 files in <https://builds.apache.org/job/Apache-falcon/ws/>
[CHECKSTYLE] Successfully parsed file <https://builds.apache.org/job/Apache-falcon/ws/acquisition/target/checkstyle-result.xml>
of module  with 0 warnings.
[CHECKSTYLE] Successfully parsed file <https://builds.apache.org/job/Apache-falcon/ws/archival/target/checkstyle-result.xml>
of module  with 0 warnings.
[CHECKSTYLE] Successfully parsed file <https://builds.apache.org/job/Apache-falcon/ws/build-tools/target/checkstyle-result.xml>
of module  with 0 warnings.
[CHECKSTYLE] Successfully parsed file <https://builds.apache.org/job/Apache-falcon/ws/client/target/checkstyle-result.xml>
of module  with 0 warnings.
[CHECKSTYLE] Successfully parsed file <https://builds.apache.org/job/Apache-falcon/ws/common/target/checkstyle-result.xml>
of module  with 0 warnings.
[CHECKSTYLE] Successfully parsed file <https://builds.apache.org/job/Apache-falcon/ws/feed/target/checkstyle-result.xml>
of module  with 0 warnings.
[CHECKSTYLE] Successfully parsed file <https://builds.apache.org/job/Apache-falcon/ws/hadoop-dependencies/target/checkstyle-result.xml>
of module  with 0 warnings.
[CHECKSTYLE] Successfully parsed file <https://builds.apache.org/job/Apache-falcon/ws/hadoop-webapp/target/checkstyle-result.xml>
of module  with 0 warnings.
[CHECKSTYLE] Successfully parsed file <https://builds.apache.org/job/Apache-falcon/ws/messaging/target/checkstyle-result.xml>
of module  with 0 warnings.
[CHECKSTYLE] Successfully parsed file <https://builds.apache.org/job/Apache-falcon/ws/metrics/target/checkstyle-result.xml>
of module  with 0 warnings.
[CHECKSTYLE] Successfully parsed file <https://builds.apache.org/job/Apache-falcon/ws/oozie-el-extensions/target/checkstyle-result.xml>
of module  with 0 warnings.
[CHECKSTYLE] Successfully parsed file <https://builds.apache.org/job/Apache-falcon/ws/oozie/target/checkstyle-result.xml>
of module  with 0 warnings.
[CHECKSTYLE] Successfully parsed file <https://builds.apache.org/job/Apache-falcon/ws/prism/target/checkstyle-result.xml>
of module  with 0 warnings.
[CHECKSTYLE] Successfully parsed file <https://builds.apache.org/job/Apache-falcon/ws/process/target/checkstyle-result.xml>
of module  with 0 warnings.
[CHECKSTYLE] Successfully parsed file <https://builds.apache.org/job/Apache-falcon/ws/replication/target/checkstyle-result.xml>
of module  with 0 warnings.
[CHECKSTYLE] Successfully parsed file <https://builds.apache.org/job/Apache-falcon/ws/rerun/target/checkstyle-result.xml>
of module  with 0 warnings.
[CHECKSTYLE] Successfully parsed file <https://builds.apache.org/job/Apache-falcon/ws/retention/target/checkstyle-result.xml>
of module  with 0 warnings.
[CHECKSTYLE] Successfully parsed file <https://builds.apache.org/job/Apache-falcon/ws/target/checkstyle-result.xml>
of module  with 0 warnings.
[CHECKSTYLE] Successfully parsed file <https://builds.apache.org/job/Apache-falcon/ws/test-util/target/checkstyle-result.xml>
of module  with 0 warnings.
[CHECKSTYLE] Computing warning deltas based on reference build #334
[FINDBUGS] Collecting findbugs analysis files...
[FINDBUGS] Finding all files that match the pattern **/target/findbugs.xml
[FINDBUGS] Parsing 15 files in <https://builds.apache.org/job/Apache-falcon/ws/>
[FINDBUGS] Successfully parsed file <https://builds.apache.org/job/Apache-falcon/ws/client/target/findbugs.xml>
of module  with 0 warnings.
[FINDBUGS] Successfully parsed file <https://builds.apache.org/job/Apache-falcon/ws/common/target/findbugs.xml>
of module  with 0 warnings.
[FINDBUGS] Successfully parsed file <https://builds.apache.org/job/Apache-falcon/ws/feed/target/findbugs.xml>
of module  with 0 warnings.
[FINDBUGS] Successfully parsed file <https://builds.apache.org/job/Apache-falcon/ws/hadoop-dependencies/target/findbugs.xml>
of module  with 0 warnings.
[FINDBUGS] Successfully parsed file <https://builds.apache.org/job/Apache-falcon/ws/hadoop-webapp/target/findbugs.xml>
of module  with 0 warnings.
[FINDBUGS] Successfully parsed file <https://builds.apache.org/job/Apache-falcon/ws/messaging/target/findbugs.xml>
of module  with 0 warnings.
[FINDBUGS] Successfully parsed file <https://builds.apache.org/job/Apache-falcon/ws/metrics/target/findbugs.xml>
of module  with 0 warnings.
[FINDBUGS] Successfully parsed file <https://builds.apache.org/job/Apache-falcon/ws/oozie-el-extensions/target/findbugs.xml>
of module  with 0 warnings.
[FINDBUGS] Successfully parsed file <https://builds.apache.org/job/Apache-falcon/ws/oozie/target/findbugs.xml>
of module  with 0 warnings.
[FINDBUGS] Successfully parsed file <https://builds.apache.org/job/Apache-falcon/ws/prism/target/findbugs.xml>
of module  with 0 warnings.
[FINDBUGS] Successfully parsed file <https://builds.apache.org/job/Apache-falcon/ws/process/target/findbugs.xml>
of module  with 0 warnings.
[FINDBUGS] Successfully parsed file <https://builds.apache.org/job/Apache-falcon/ws/replication/target/findbugs.xml>
of module  with 0 warnings.
[FINDBUGS] Successfully parsed file <https://builds.apache.org/job/Apache-falcon/ws/rerun/target/findbugs.xml>
of module  with 0 warnings.
[FINDBUGS] Successfully parsed file <https://builds.apache.org/job/Apache-falcon/ws/retention/target/findbugs.xml>
of module  with 0 warnings.
[FINDBUGS] Successfully parsed file <https://builds.apache.org/job/Apache-falcon/ws/test-util/target/findbugs.xml>
of module  with 0 warnings.
[FINDBUGS] Computing warning deltas based on reference build #334
Archiving artifacts
Sending artifact delta relative to Apache-falcon #334
Archived 17 artifacts
Archive block size is 32768
Received 0 blocks and 364121 bytes
Compression is 0.0%
Took 0.2 sec
Recording test results
TestNG Reports Processing: START
Looking for TestNG results report in workspace using pattern: **/target/testng-results.xml
Did not find any matching files.

Mime
View raw message