falcon-dev mailing list archives

Site index · List index
Message view « Date » · « Thread »
Top « Date » · « Thread »
From Apache Jenkins Server <jenk...@builds.apache.org>
Subject Build failed in Jenkins: Apache-falcon #367
Date Sat, 09 Aug 2014 01:46:34 GMT
See <https://builds.apache.org/job/Apache-falcon/367/changes>

Changes:

[samarth.gupta] FALCON 575 add test cases for dry run feature in falcon-regression and minor
fix

[samarth.gupta] additional patch for falcon 564 fix pom files to make falcon-regression a
module and minor update

[shwetha.gs] FALCON-566 update throwing null job id exception. Contributed by Shwetha GS

[shwetha.gs] FALCON-514 Falcon CLI giving error when using -file option with -rerun in instance
management. Contributed by pavan kumar kolamuri

[suhas.v] FALCON-571 user libs not getting loaded during process execution. Contributed by
Shwetha GS.

[venkatesh] FALCON-279 Add ACL for Cluster Entity. Contributed by Venkatesh Seetharam

[venkatesh] FALCON-462 Add ACL for process entity. Contributed by Venkatesh Seetharam

[venkatesh] FALCON-463 Validate Feed ACL only if authorization is enabled. Contributed by
Venkatesh Seetharam

[venkatesh] FALCON-464 Enforce Authorization for REST API. Contributed by Venkatesh Seetharam

[venkatesh] FALCON-468 Add User Documentation for authorization feature. Contributed by Venkatesh
Seetharam

[venkatesh] FALCON-557 Add super-user who is authorized for all. Contributed by Venkatesh
Seetharam

[venkatesh] FALCON-400 Add Authorization for Entities. Contributed by Venkatesh Seetharam

[venkatesh] FALCON-466 REST APIs must add the entity owner as an implicit filter. Contributed
by Balu Vellanki

[venkatesh] FALCON-484 - Refactor workflow related code into context, listener and Notification.
Contributed by Venkatesh Seetharam

[venkatesh] FALCON-485 - Simplify JMS Message Sender/Consumer and use Workflow Context. Contributed
by Venkatesh Seetharam

[venkatesh] FALCON-486 - Introduce Workflow Context in Post Processing. Contributed by Venkatesh
Seetharam

[venkatesh] FALCON-487 -Introduce Workflow Context in Rerun framework. Contributed by Venkatesh
Seetharam

[venkatesh] FALCON-488 - Introduce Workflow Context in Lineage Service. Contributed by Venkatesh
Seetharam

[venkatesh] FALCON-492 - Refactor workflow listener implementation init config driven. Contributed
by Venkatesh Seetharam

[venkatesh] FALCON-327 - Simplify message passing framework. Contributed by Venkatesh Seetharam

[venkatesh] FALCON-453 - possible LICENSE/NOTICE issues. Contributed by Chris Douglas

------------------------------------------
[...truncated 2571 lines...]
[INFO] Copying avro-ipc-1.7.1.jar to <https://builds.apache.org/job/Apache-falcon/ws/webapp/target/dependency/avro-ipc-1.7.1.jar>
[INFO] Copying jsp-api-2.1-6.1.14.jar to <https://builds.apache.org/job/Apache-falcon/ws/webapp/target/dependency/jsp-api-2.1-6.1.14.jar>
[INFO] Copying hive-metastore-0.11.0.jar to <https://builds.apache.org/job/Apache-falcon/ws/webapp/target/dependency/hive-metastore-0.11.0.jar>
[INFO] Copying jets3t-0.6.1.jar to <https://builds.apache.org/job/Apache-falcon/ws/webapp/target/dependency/jets3t-0.6.1.jar>
[INFO] Copying oncrpc-1.0.7.jar to <https://builds.apache.org/job/Apache-falcon/ws/webapp/target/dependency/oncrpc-1.0.7.jar>
[INFO] Copying openjpa-persistence-jdbc-2.2.2.jar to <https://builds.apache.org/job/Apache-falcon/ws/webapp/target/dependency/openjpa-persistence-jdbc-2.2.2.jar>
[INFO] Copying commons-logging-api-1.1.jar to <https://builds.apache.org/job/Apache-falcon/ws/webapp/target/dependency/commons-logging-api-1.1.jar>
[INFO] Copying zookeeper-3.4.3.jar to <https://builds.apache.org/job/Apache-falcon/ws/webapp/target/dependency/zookeeper-3.4.3.jar>
[INFO] Copying geronimo-jpa_2.0_spec-1.1.jar to <https://builds.apache.org/job/Apache-falcon/ws/webapp/target/dependency/geronimo-jpa_2.0_spec-1.1.jar>
[INFO] Copying falcon-client-0.6-incubating-SNAPSHOT.jar to <https://builds.apache.org/job/Apache-falcon/ws/webapp/target/dependency/falcon-client-0.6-incubating-SNAPSHOT.jar>
[INFO] Copying commons-collections-3.2.1.jar to <https://builds.apache.org/job/Apache-falcon/ws/webapp/target/dependency/commons-collections-3.2.1.jar>
[INFO] Copying json-20090211.jar to <https://builds.apache.org/job/Apache-falcon/ws/webapp/target/dependency/json-20090211.jar>
[INFO] Copying jersey-client-1.9.jar to <https://builds.apache.org/job/Apache-falcon/ws/webapp/target/dependency/jersey-client-1.9.jar>
[INFO] Copying jms-1.1.jar to <https://builds.apache.org/job/Apache-falcon/ws/webapp/target/dependency/jms-1.1.jar>
[INFO] Copying metrics-ganglia-3.0.0-BETA3.jar to <https://builds.apache.org/job/Apache-falcon/ws/webapp/target/dependency/metrics-ganglia-3.0.0-BETA3.jar>
[INFO] Copying json-simple-1.1.1.jar to <https://builds.apache.org/job/Apache-falcon/ws/webapp/target/dependency/json-simple-1.1.1.jar>
[INFO] Copying derby-10.6.1.0.jar to <https://builds.apache.org/job/Apache-falcon/ws/webapp/target/dependency/derby-10.6.1.0.jar>
[INFO] Copying slf4j-log4j12-1.7.5.jar to <https://builds.apache.org/job/Apache-falcon/ws/webapp/target/dependency/slf4j-log4j12-1.7.5.jar>
[INFO] Copying commons-configuration-1.6.jar to <https://builds.apache.org/job/Apache-falcon/ws/webapp/target/dependency/commons-configuration-1.6.jar>
[INFO] Copying JavaEWAH-0.3.2.jar to <https://builds.apache.org/job/Apache-falcon/ws/webapp/target/dependency/JavaEWAH-0.3.2.jar>
[INFO] Copying high-scale-lib-1.1.4.jar to <https://builds.apache.org/job/Apache-falcon/ws/webapp/target/dependency/high-scale-lib-1.1.4.jar>
[INFO] Copying hive-exec-0.11.0.jar to <https://builds.apache.org/job/Apache-falcon/ws/webapp/target/dependency/hive-exec-0.11.0.jar>
[INFO] Copying activemq-core-5.4.3.jar to <https://builds.apache.org/job/Apache-falcon/ws/webapp/target/dependency/activemq-core-5.4.3.jar>
[INFO] Copying commons-math-2.1.jar to <https://builds.apache.org/job/Apache-falcon/ws/webapp/target/dependency/commons-math-2.1.jar>
[INFO] Copying spring-core-3.0.3.RELEASE.jar to <https://builds.apache.org/job/Apache-falcon/ws/webapp/target/dependency/spring-core-3.0.3.RELEASE.jar>
[INFO] Copying libthrift-0.9.0.jar to <https://builds.apache.org/job/Apache-falcon/ws/webapp/target/dependency/libthrift-0.9.0.jar>
[INFO] Copying falcon-retention-0.6-incubating-SNAPSHOT.jar to <https://builds.apache.org/job/Apache-falcon/ws/webapp/target/dependency/falcon-retention-0.6-incubating-SNAPSHOT.jar>
[INFO] Copying kryo-2.21-shaded.jar to <https://builds.apache.org/job/Apache-falcon/ws/webapp/target/dependency/kryo-2.21-shaded.jar>
[INFO] Copying oozie-client-4.0.1-falcon.jar to <https://builds.apache.org/job/Apache-falcon/ws/webapp/target/dependency/oozie-client-4.0.1-falcon.jar>
[INFO] Copying mockito-all-1.8.5.jar to <https://builds.apache.org/job/Apache-falcon/ws/webapp/target/dependency/mockito-all-1.8.5.jar>
[INFO] Copying geronimo-spec-jta-1.0.1B-rc4.jar to <https://builds.apache.org/job/Apache-falcon/ws/webapp/target/dependency/geronimo-spec-jta-1.0.1B-rc4.jar>
[INFO] Copying libfb303-0.9.0.jar to <https://builds.apache.org/job/Apache-falcon/ws/webapp/target/dependency/libfb303-0.9.0.jar>
[INFO] Copying jetty-6.1.26.jar to <https://builds.apache.org/job/Apache-falcon/ws/webapp/target/dependency/jetty-6.1.26.jar>
[INFO] Copying jersey-server-1.9.jar to <https://builds.apache.org/job/Apache-falcon/ws/webapp/target/dependency/jersey-server-1.9.jar>
[INFO] Copying velocity-1.7.jar to <https://builds.apache.org/job/Apache-falcon/ws/webapp/target/dependency/velocity-1.7.jar>
[INFO] Copying hive-common-0.11.0.jar to <https://builds.apache.org/job/Apache-falcon/ws/webapp/target/dependency/hive-common-0.11.0.jar>
[INFO] 
[INFO] --- maven-antrun-plugin:1.6:run (default) @ falcon-webapp ---
[INFO] Executing tasks

main:
     [copy] Copying 1 file to <https://builds.apache.org/job/Apache-falcon/ws/webapp/target/webapps>
[INFO] Executed tasks
[INFO] 
[INFO] >>> maven-jetty-plugin:6.1.26:run (start-jetty) @ falcon-webapp >>>
[WARNING] Failure to transfer asm:asm/maven-metadata.xml from file:../../local.repository/trunk
was cached in the local repository, resolution will not be reattempted until the update interval
of local.repository has elapsed or updates are forced. Original error: Could not transfer
metadata asm:asm/maven-metadata.xml from/to local.repository (file:../../local.repository/trunk):
No connector available to access repository local.repository (file:../../local.repository/trunk)
of type legacy using the available factories WagonRepositoryConnectorFactory
[INFO] 
[INFO] --- maven-enforcer-plugin:1.3.1:enforce (enforce-property) @ falcon-webapp ---
[INFO] 
[INFO] --- buildnumber-maven-plugin:1.0:create (default) @ falcon-webapp ---
[INFO] Checking for local modifications: skipped.
[INFO] Updating project files from SCM: skipped.
[INFO] Executing: /bin/sh -c cd <https://builds.apache.org/job/Apache-falcon/ws/webapp>
&& git show
[INFO] Working directory: <https://builds.apache.org/job/Apache-falcon/ws/webapp>
[INFO] Storing buildNumber: 7ecea3ed725cff17f22bd6208d2c6851c393afaf at timestamp: 1407548613238
[INFO] Executing: /bin/sh -c cd <https://builds.apache.org/job/Apache-falcon/ws/webapp>
&& git show
[INFO] Working directory: <https://builds.apache.org/job/Apache-falcon/ws/webapp>
[INFO] Storing buildScmBranch: UNKNOWN
[INFO] 
[INFO] --- maven-resources-plugin:2.6:copy-resources (copy-resources) @ falcon-webapp ---
[INFO] Using 'UTF-8' encoding to copy filtered resources.
[INFO] Copying 3 resources
[INFO] 
[INFO] --- maven-dependency-plugin:2.8:unpack (unpack) @ falcon-webapp ---
[INFO] Configured Artifact: org.apache.oozie:oozie-client:?:jar
[INFO] oozie-client-4.0.1-falcon.jar already unpacked.
[INFO] 
[INFO] --- maven-remote-resources-plugin:1.4:process (default) @ falcon-webapp ---
[INFO] 
[INFO] --- maven-resources-plugin:2.6:resources (default-resources) @ falcon-webapp ---
[INFO] Using 'UTF-8' encoding to copy filtered resources.
[INFO] Copying 2 resources
[INFO] Copying 1 resource
[INFO] Copying 1 resource
[INFO] Copying 2 resources to META-INF
[INFO] Copying 3 resources
[INFO] Copying 3 resources
[INFO] 
[INFO] --- maven-compiler-plugin:2.3.2:compile (default-compile) @ falcon-webapp ---
[INFO] Nothing to compile - all classes are up to date
[INFO] 
[INFO] --- maven-resources-plugin:2.6:testResources (default-testResources) @ falcon-webapp
---
[INFO] Using 'UTF-8' encoding to copy filtered resources.
[INFO] Copying 26 resources
[INFO] Copying 3 resources
[INFO] Copying 3 resources
[INFO] 
[INFO] --- maven-compiler-plugin:2.3.2:testCompile (default-testCompile) @ falcon-webapp ---
[INFO] Nothing to compile - all classes are up to date
[INFO] 
[INFO] <<< maven-jetty-plugin:6.1.26:run (start-jetty) @ falcon-webapp <<<
[INFO] 
[INFO] --- maven-jetty-plugin:6.1.26:run (start-jetty) @ falcon-webapp ---
[INFO] Configuring Jetty for project: Apache Falcon Web Application
[INFO] Webapp source directory = <https://builds.apache.org/job/Apache-falcon/ws/webapp/src/main/webapp>
[INFO] Reload Mechanic: automatic
[INFO] Classes = <https://builds.apache.org/job/Apache-falcon/ws/webapp/target/classes>
[INFO] Logging to org.slf4j.impl.SimpleLogger(org.mortbay.log) via org.mortbay.log.Slf4jLog
[INFO] Context path = /falcon-webapp
[INFO] Tmp directory =  determined at runtime
[INFO] Web defaults = org/mortbay/jetty/webapp/webdefault.xml
[INFO] Web overrides =  none
[INFO] Adding overlay: jar:<https://builds.apache.org/job/Apache-falcon/ws/hadoop-webapp/target/falcon-hadoop-webapp-0.6-incubating-SNAPSHOT.war!/>
[INFO] web.xml file = <https://builds.apache.org/job/Apache-falcon/ws/webapp/src/main/webapp/WEB-INF/web.xml>
[INFO] Webapp directory = <https://builds.apache.org/job/Apache-falcon/ws/webapp/src/main/webapp>
[INFO] Starting jetty 6.1.26 ...
[INFO] jetty-6.1.26
SLF4J: Class path contains multiple SLF4J bindings.
SLF4J: Found binding in [jar:<https://builds.apache.org/job/Apache-falcon/ws/webapp/target/work/lib/Jetty-2632090280345832240.jar!/org/slf4j/impl/StaticLoggerBinder.class]>
SLF4J: Found binding in [jar:file:/home/jenkins/.m2/repository/org/slf4j/slf4j-log4j12/1.7.5/slf4j-log4j12-1.7.5.jar!/org/slf4j/impl/StaticLoggerBinder.class]
SLF4J: See http://www.slf4j.org/codes.html#multiple_bindings for an explanation.
SLF4J: Actual binding is of type [org.slf4j.impl.Log4jLoggerFactory]
[INFO] No Transaction manager found - if your webapp requires one, please configure one.
Aug 9, 2014 1:43:39 AM com.sun.jersey.api.core.PackagesResourceConfig init
INFO: Scanning for root resource and provider classes in the packages:
  org.apache.falcon.resource.admin
  org.apache.falcon.resource.proxy
  org.apache.falcon.resource.provider
  org.apache.falcon.resource.metadata
Aug 9, 2014 1:43:39 AM com.sun.jersey.api.core.ScanningResourceConfig logClasses
INFO: Root resource classes found:
  class org.apache.falcon.resource.metadata.LineageMetadataResource
  class org.apache.falcon.resource.proxy.SchedulableEntityManagerProxy
  class org.apache.falcon.resource.admin.AdminResource
  class org.apache.falcon.resource.proxy.InstanceManagerProxy
Aug 9, 2014 1:43:39 AM com.sun.jersey.api.core.ScanningResourceConfig logClasses
INFO: Provider classes found:
  class org.apache.falcon.resource.provider.JAXBContextResolver
Aug 9, 2014 1:43:39 AM com.sun.jersey.server.impl.application.WebApplicationImpl _initiate
INFO: Initiating Jersey application, version 'Jersey: 1.9 09/02/2011 11:17 AM'
[INFO] Extract <https://builds.apache.org/job/Apache-falcon/ws/webapp/target/webapps/oozie.war>
to /tmp/Jetty_0_0_0_0_41443_oozie.war__oozie__.lf8rot/webapp
log4j:WARN No appenders could be found for logger (oozieops).
log4j:WARN Please initialize the log4j system properly.
log4j:WARN See http://logging.apache.org/log4j/1.2/faq.html#noconfig for more info.
SLF4J: Class path contains multiple SLF4J bindings.
SLF4J: Found binding in [jar:file:/tmp/Jetty_0_0_0_0_41443_oozie.war__oozie__.lf8rot/webapp/WEB-INF/lib/slf4j-log4j12-1.7.5.jar!/org/slf4j/impl/StaticLoggerBinder.class]
SLF4J: Found binding in [jar:file:/tmp/Jetty_0_0_0_0_41443_oozie.war__oozie__.lf8rot/webapp/WEB-INF/lib/slf4j-log4j12-1.6.6.jar!/org/slf4j/impl/StaticLoggerBinder.class]
SLF4J: Found binding in [jar:file:/tmp/Jetty_0_0_0_0_41443_oozie.war__oozie__.lf8rot/webapp/WEB-INF/lib/slf4j-simple-1.6.6.jar!/org/slf4j/impl/StaticLoggerBinder.class]
SLF4J: See http://www.slf4j.org/codes.html#multiple_bindings for an explanation.
SLF4J: Actual binding is of type [org.slf4j.impl.Log4jLoggerFactory]
[WARNING] PWC6183: Invalid PUBLIC ID: null
[INFO] Extract <https://builds.apache.org/job/Apache-falcon/ws/webapp/target/webapps/hadoop.war>
to /tmp/Jetty_0_0_0_0_41443_hadoop.war__hadoop__.nyu8ob/webapp
[INFO] Started SslSocketConnector@0.0.0.0:41443
[WARNING] failed SelectChannelConnector@0.0.0.0:41000: java.net.BindException: Address already
in use
[WARNING] failed Server@2bcd7bea: java.net.BindException: Address already in use
[INFO] ------------------------------------------------------------------------
[INFO] Reactor Summary:
[INFO] 
[INFO] Checkstyle ........................................ SUCCESS [  1.467 s]
[INFO] Apache Falcon ..................................... SUCCESS [ 10.662 s]
[INFO] Build Tools ....................................... SUCCESS [  5.498 s]
[INFO] Apache Falcon CLI client .......................... SUCCESS [ 33.070 s]
[INFO] Apache Falcon Metrics ............................. SUCCESS [ 13.412 s]
[INFO] Apache Falcon Hadoop Dependencies ................. SUCCESS [ 13.978 s]
[INFO] Apache Falcon Test Utility ........................ SUCCESS [ 12.648 s]
[INFO] Apache Falcon Commons ............................. SUCCESS [01:33 min]
[INFO] Apache Falcon Oozie EL Extension .................. SUCCESS [ 18.516 s]
[INFO] Apache Falcon Embedded Hadoop - Test Cluster ...... SUCCESS [ 29.482 s]
[INFO] Apache Falcon Messaging ........................... SUCCESS [ 27.055 s]
[INFO] Apache Falcon Oozie Adaptor ....................... SUCCESS [ 53.205 s]
[INFO] Apache Falcon Acquisition ......................... SUCCESS [  0.593 s]
[INFO] Apache Falcon Replication ......................... SUCCESS [ 22.492 s]
[INFO] Apache Falcon Retention ........................... SUCCESS [ 22.540 s]
[INFO] Apache Falcon Archival ............................ SUCCESS [  0.639 s]
[INFO] Apache Falcon Rerun ............................... SUCCESS [ 29.912 s]
[INFO] Apache Falcon Prism ............................... SUCCESS [ 55.621 s]
[INFO] Apache Falcon Web Application ..................... FAILURE [ 28.729 s]
[INFO] Apache Falcon Documentation ....................... SKIPPED
[INFO] ------------------------------------------------------------------------
[INFO] BUILD FAILURE
[INFO] ------------------------------------------------------------------------
[INFO] Total time: 07:53 min
[INFO] Finished at: 2014-08-09T01:43:51+00:00
[INFO] Final Memory: 310M/730M
[INFO] ------------------------------------------------------------------------
[ERROR] Failed to execute goal org.mortbay.jetty:maven-jetty-plugin:6.1.26:run (start-jetty)
on project falcon-webapp: Failure: Address already in use -> [Help 1]
[ERROR] 
[ERROR] To see the full stack trace of the errors, re-run Maven with the -e switch.
[ERROR] Re-run Maven using the -X switch to enable full debug logging.
[ERROR] 
[ERROR] For more information about the errors and possible solutions, please read the following
articles:
[ERROR] [Help 1] http://cwiki.apache.org/confluence/display/MAVEN/MojoExecutionException
[ERROR] 
[ERROR] After correcting the problems, you can resume the build with the command
[ERROR]   mvn <goals> -rf :falcon-webapp
[INFO] Shutdown hook executing
[INFO] Stopped SelectChannelConnector@0.0.0.0:41000
[INFO] Stopped SslSocketConnector@0.0.0.0:41443
Starting hive metastore on port 49083
Exception in thread "Thread-580" java.lang.RuntimeException: java.lang.IllegalStateException:
Shutdown in progress
	at org.apache.falcon.listener.HadoopStartupListener$1.run(HadoopStartupListener.java:86)
	at java.lang.Thread.run(Thread.java:662)
Caused by: java.lang.IllegalStateException: Shutdown in progress
	at java.lang.ApplicationShutdownHooks.add(ApplicationShutdownHooks.java:39)
	at java.lang.Runtime.addShutdownHook(Runtime.java:192)
	at org.apache.hadoop.hive.metastore.HiveMetaStore.main(HiveMetaStore.java:4228)
	at org.apache.falcon.listener.HadoopStartupListener$1.run(HadoopStartupListener.java:84)
	... 1 more
[INFO] Shutdown hook complete
Build step 'Execute shell' marked build as failure
[CHECKSTYLE] Collecting checkstyle analysis files...
[CHECKSTYLE] Finding all files that match the pattern **/target/checkstyle-result.xml
[CHECKSTYLE] Parsing 17 files in <https://builds.apache.org/job/Apache-falcon/ws/>
[CHECKSTYLE] Successfully parsed file <https://builds.apache.org/job/Apache-falcon/ws/acquisition/target/checkstyle-result.xml>
of module  with 0 warnings.
[CHECKSTYLE] Successfully parsed file <https://builds.apache.org/job/Apache-falcon/ws/archival/target/checkstyle-result.xml>
of module  with 0 warnings.
[CHECKSTYLE] Successfully parsed file <https://builds.apache.org/job/Apache-falcon/ws/build-tools/target/checkstyle-result.xml>
of module  with 0 warnings.
[CHECKSTYLE] Successfully parsed file <https://builds.apache.org/job/Apache-falcon/ws/client/target/checkstyle-result.xml>
of module  with 0 warnings.
[CHECKSTYLE] Successfully parsed file <https://builds.apache.org/job/Apache-falcon/ws/common/target/checkstyle-result.xml>
of module  with 0 warnings.
[CHECKSTYLE] Successfully parsed file <https://builds.apache.org/job/Apache-falcon/ws/hadoop-dependencies/target/checkstyle-result.xml>
of module  with 0 warnings.
[CHECKSTYLE] Successfully parsed file <https://builds.apache.org/job/Apache-falcon/ws/hadoop-webapp/target/checkstyle-result.xml>
of module  with 0 warnings.
[CHECKSTYLE] Successfully parsed file <https://builds.apache.org/job/Apache-falcon/ws/messaging/target/checkstyle-result.xml>
of module  with 0 warnings.
[CHECKSTYLE] Successfully parsed file <https://builds.apache.org/job/Apache-falcon/ws/metrics/target/checkstyle-result.xml>
of module  with 0 warnings.
[CHECKSTYLE] Successfully parsed file <https://builds.apache.org/job/Apache-falcon/ws/oozie-el-extensions/target/checkstyle-result.xml>
of module  with 0 warnings.
[CHECKSTYLE] Successfully parsed file <https://builds.apache.org/job/Apache-falcon/ws/oozie/target/checkstyle-result.xml>
of module  with 0 warnings.
[CHECKSTYLE] Successfully parsed file <https://builds.apache.org/job/Apache-falcon/ws/prism/target/checkstyle-result.xml>
of module  with 0 warnings.
[CHECKSTYLE] Successfully parsed file <https://builds.apache.org/job/Apache-falcon/ws/replication/target/checkstyle-result.xml>
of module  with 0 warnings.
[CHECKSTYLE] Successfully parsed file <https://builds.apache.org/job/Apache-falcon/ws/rerun/target/checkstyle-result.xml>
of module  with 0 warnings.
[CHECKSTYLE] Successfully parsed file <https://builds.apache.org/job/Apache-falcon/ws/retention/target/checkstyle-result.xml>
of module  with 0 warnings.
[CHECKSTYLE] Successfully parsed file <https://builds.apache.org/job/Apache-falcon/ws/target/checkstyle-result.xml>
of module  with 0 warnings.
[CHECKSTYLE] Successfully parsed file <https://builds.apache.org/job/Apache-falcon/ws/test-util/target/checkstyle-result.xml>
of module  with 0 warnings.
[CHECKSTYLE] Computing warning deltas based on reference build #334
[FINDBUGS] Collecting findbugs analysis files...
[FINDBUGS] Finding all files that match the pattern **/target/findbugs.xml
[FINDBUGS] Parsing 13 files in <https://builds.apache.org/job/Apache-falcon/ws/>
[FINDBUGS] Successfully parsed file <https://builds.apache.org/job/Apache-falcon/ws/client/target/findbugs.xml>
of module  with 0 warnings.
[FINDBUGS] Successfully parsed file <https://builds.apache.org/job/Apache-falcon/ws/common/target/findbugs.xml>
of module  with 0 warnings.
[FINDBUGS] Successfully parsed file <https://builds.apache.org/job/Apache-falcon/ws/hadoop-dependencies/target/findbugs.xml>
of module  with 0 warnings.
[FINDBUGS] Successfully parsed file <https://builds.apache.org/job/Apache-falcon/ws/hadoop-webapp/target/findbugs.xml>
of module  with 0 warnings.
[FINDBUGS] Successfully parsed file <https://builds.apache.org/job/Apache-falcon/ws/messaging/target/findbugs.xml>
of module  with 0 warnings.
[FINDBUGS] Successfully parsed file <https://builds.apache.org/job/Apache-falcon/ws/metrics/target/findbugs.xml>
of module  with 0 warnings.
[FINDBUGS] Successfully parsed file <https://builds.apache.org/job/Apache-falcon/ws/oozie-el-extensions/target/findbugs.xml>
of module  with 0 warnings.
[FINDBUGS] Successfully parsed file <https://builds.apache.org/job/Apache-falcon/ws/oozie/target/findbugs.xml>
of module  with 0 warnings.
[FINDBUGS] Successfully parsed file <https://builds.apache.org/job/Apache-falcon/ws/prism/target/findbugs.xml>
of module  with 0 warnings.
[FINDBUGS] Successfully parsed file <https://builds.apache.org/job/Apache-falcon/ws/replication/target/findbugs.xml>
of module  with 0 warnings.
[FINDBUGS] Successfully parsed file <https://builds.apache.org/job/Apache-falcon/ws/rerun/target/findbugs.xml>
of module  with 0 warnings.
[FINDBUGS] Successfully parsed file <https://builds.apache.org/job/Apache-falcon/ws/retention/target/findbugs.xml>
of module  with 0 warnings.
[FINDBUGS] Successfully parsed file <https://builds.apache.org/job/Apache-falcon/ws/test-util/target/findbugs.xml>
of module  with 0 warnings.
[FINDBUGS] Computing warning deltas based on reference build #334
Archiving artifacts
Sending artifact delta relative to Apache-falcon #334
Archived 10 artifacts
Archive block size is 32768
Received 0 blocks and 439675 bytes
Compression is 0.0%
Took 2.2 sec
Recording test results
TestNG Reports Processing: START
Looking for TestNG results report in workspace using pattern: **/target/testng-results.xml
Did not find any matching files.

Mime
View raw message