falcon-dev mailing list archives

Site index · List index
Message view « Date » · « Thread »
Top « Date » · « Thread »
From Apache Jenkins Server <jenk...@builds.apache.org>
Subject Build failed in Jenkins: Apache-falcon #957
Date Mon, 28 Mar 2016 08:21:29 GMT
See <https://builds.apache.org/job/Apache-falcon/957/changes>

Changes:

[pallavi.rao] FALCON-1864 Retry event does not get removed from delay queue

[pallavi.rao] FALCON-1874 Import and Export fails with HDFS as src/dest

------------------------------------------
[...truncated 2734 lines...]
[INFO] --- maven-failsafe-plugin:2.16:integration-test (integration-test) @ falcon-test-tools
---
[INFO] No tests to run.
[INFO] 
[INFO] --- maven-failsafe-plugin:2.16:verify (verify) @ falcon-test-tools ---
[INFO] No tests to run.
[INFO] 
[INFO] --- apache-rat-plugin:0.7:check (rat-check) @ falcon-test-tools ---
[INFO] Exclude: *.txt
[INFO] Exclude: **/*.txt
[INFO] Exclude: *.md
[INFO] Exclude: **/*.md
[INFO] Exclude: .git/**
[INFO] Exclude: **/.idea/**
[INFO] Exclude: **/*.twiki
[INFO] Exclude: **/*.iml
[INFO] Exclude: **/target/**
[INFO] Exclude: **/activemq-data/**
[INFO] Exclude: **/build/**
[INFO] Exclude: **/*.patch
[INFO] Exclude: derby.log
[INFO] Exclude: **/logs/**
[INFO] Exclude: **/.classpath
[INFO] Exclude: **/.project
[INFO] Exclude: **/.settings/**
[INFO] Exclude: **/test-output/**
[INFO] Exclude: **/data.txt
[INFO] Exclude: **/maven-eclipse.xml
[INFO] Exclude: **/.externalToolBuilders/**
[INFO] Exclude: html5-ui/**
[INFO] Exclude: **/metastore_db/**
[INFO] Exclude: **/db1.log
[INFO] Exclude: **/db1.properties
[INFO] Exclude: **/db1.script
[INFO] Exclude: **/credential_provider.jceks
[INFO] 
[INFO] --- maven-checkstyle-plugin:2.9.1:check (checkstyle-check) @ falcon-test-tools ---
[INFO] Starting audit...
Audit done.

[INFO] 
[INFO] >>> findbugs-maven-plugin:3.0.3:check (findbugs-check) @ falcon-test-tools
>>>
[INFO] 
[INFO] --- findbugs-maven-plugin:3.0.3:findbugs (findbugs) @ falcon-test-tools ---
[INFO] 
[INFO] <<< findbugs-maven-plugin:3.0.3:check (findbugs-check) @ falcon-test-tools
<<<
[INFO] 
[INFO] --- findbugs-maven-plugin:3.0.3:check (findbugs-check) @ falcon-test-tools ---
[INFO]                                                                         
[INFO] ------------------------------------------------------------------------
[INFO] Building Apache Falcon Messaging 0.10-SNAPSHOT
[INFO] ------------------------------------------------------------------------
[INFO] 
[INFO] --- maven-clean-plugin:2.5:clean (default-clean) @ falcon-messaging ---
[INFO] Deleting <https://builds.apache.org/job/Apache-falcon/ws/messaging/target>
[INFO] 
[INFO] --- maven-enforcer-plugin:1.3.1:enforce (enforce-property) @ falcon-messaging ---
[INFO] 
[INFO] --- buildnumber-maven-plugin:1.0:create (default) @ falcon-messaging ---
[INFO] Checking for local modifications: skipped.
[INFO] Updating project files from SCM: skipped.
[INFO] Executing: /bin/sh -c cd <https://builds.apache.org/job/Apache-falcon/ws/messaging>
&& git show
[INFO] Working directory: <https://builds.apache.org/job/Apache-falcon/ws/messaging>
[INFO] Storing buildNumber: 10f3843addd509e3f77bad9737ee2ddb33681a94 at timestamp: 1459153222722
[INFO] Executing: /bin/sh -c cd <https://builds.apache.org/job/Apache-falcon/ws/messaging>
&& git show
[INFO] Working directory: <https://builds.apache.org/job/Apache-falcon/ws/messaging>
[INFO] Storing buildScmBranch: UNKNOWN
[INFO] 
[INFO] --- maven-remote-resources-plugin:1.5:process (default) @ falcon-messaging ---
[INFO] 
[INFO] --- maven-resources-plugin:2.7:resources (default-resources) @ falcon-messaging ---
[INFO] Using 'UTF-8' encoding to copy filtered resources.
[INFO] Copying 1 resource
[INFO] Copying 1 resource
[INFO] skip non existing resourceDirectory <https://builds.apache.org/job/Apache-falcon/ws/messaging/src/test/resources>
[INFO] Copying 2 resources to META-INF
[INFO] Copying 3 resources
[INFO] 
[INFO] --- maven-compiler-plugin:2.3.2:compile (default-compile) @ falcon-messaging ---
[INFO] Compiling 3 source files to <https://builds.apache.org/job/Apache-falcon/ws/messaging/target/classes>
[INFO] 
[INFO] --- maven-resources-plugin:2.7:testResources (default-testResources) @ falcon-messaging
---
[INFO] Using 'UTF-8' encoding to copy filtered resources.
[INFO] skip non existing resourceDirectory <https://builds.apache.org/job/Apache-falcon/ws/messaging/src/test/resources>
[INFO] Copying 3 resources
[INFO] 
[INFO] --- maven-compiler-plugin:2.3.2:testCompile (default-testCompile) @ falcon-messaging
---
[INFO] Compiling 4 source files to <https://builds.apache.org/job/Apache-falcon/ws/messaging/target/test-classes>
[INFO] 
[INFO] --- maven-surefire-plugin:2.16:test (default-test) @ falcon-messaging ---
[WARNING] The parameter forkMode is deprecated since version 2.14. Use forkCount and reuseForks
instead.
[INFO] Surefire report directory: <https://builds.apache.org/job/Apache-falcon/ws/messaging/target/surefire-reports>

-------------------------------------------------------
 T E S T S
-------------------------------------------------------

-------------------------------------------------------
 T E S T S
-------------------------------------------------------
Running org.apache.falcon.messaging.JMSMessageProducerTest
Tests run: 4, Failures: 0, Errors: 0, Skipped: 0, Time elapsed: 7.348 sec - in org.apache.falcon.messaging.JMSMessageProducerTest
Running org.apache.falcon.messaging.JMSMessageConsumerTest
Tests run: 3, Failures: 1, Errors: 0, Skipped: 0, Time elapsed: 11.469 sec <<< FAILURE!
- in org.apache.falcon.messaging.JMSMessageConsumerTest
testJMSMessagesForOozieCoord(org.apache.falcon.messaging.JMSMessageConsumerTest)  Time elapsed:
0.275 sec  <<< FAILURE!
org.mockito.exceptions.verification.WantedButNotInvoked: 
Wanted but not invoked:
workflowJobEndNotificationService.notifyFailure(
    <any>
);
-> at org.apache.falcon.messaging.JMSMessageConsumerTest.testJMSMessagesForOozieCoord(JMSMessageConsumerTest.java:282)

However, there were other interactions with this mock:
-> at org.apache.falcon.messaging.JMSMessageConsumer.invokeListener(JMSMessageConsumer.java:209)

	at org.apache.falcon.messaging.JMSMessageConsumerTest.testJMSMessagesForOozieCoord(JMSMessageConsumerTest.java:282)

Running org.apache.falcon.messaging.FeedProducerTest
Tests run: 2, Failures: 0, Errors: 0, Skipped: 0, Time elapsed: 9.074 sec - in org.apache.falcon.messaging.FeedProducerTest
Running org.apache.falcon.messaging.ProcessProducerTest
Tests run: 1, Failures: 0, Errors: 0, Skipped: 0, Time elapsed: 8.109 sec - in org.apache.falcon.messaging.ProcessProducerTest

Results :

Failed tests: 
  JMSMessageConsumerTest.testJMSMessagesForOozieCoord:282 
Wanted but not invoked:
workflowJobEndNotificationService.notifyFailure(
    <any>
);
-> at org.apache.falcon.messaging.JMSMessageConsumerTest.testJMSMessagesForOozieCoord(JMSMessageConsumerTest.java:282)

However, there were other interactions with this mock:
-> at org.apache.falcon.messaging.JMSMessageConsumer.invokeListener(JMSMessageConsumer.java:209)


Tests run: 10, Failures: 1, Errors: 0, Skipped: 0

[INFO] ------------------------------------------------------------------------
[INFO] Reactor Summary:
[INFO] 
[INFO] Apache Falcon ..................................... SUCCESS [ 26.768 s]
[INFO] Apache Falcon UI .................................. SUCCESS [ 28.581 s]
[INFO] Build Tools ....................................... SUCCESS [ 11.773 s]
[INFO] Apache Falcon Java client ......................... SUCCESS [01:16 min]
[INFO] Apache Falcon CLI client .......................... SUCCESS [ 24.522 s]
[INFO] Apache Falcon Metrics ............................. SUCCESS [ 31.411 s]
[INFO] Apache Falcon Hadoop Dependencies ................. SUCCESS [ 25.537 s]
[INFO] Apache Falcon Test Utility ........................ SUCCESS [ 23.189 s]
[INFO] Apache Falcon Commons ............................. SUCCESS [05:54 min]
[INFO] Apache Falcon Oozie EL Extension .................. SUCCESS [ 31.766 s]
[INFO] Apache Falcon Embedded Hadoop - Test Cluster ...... SUCCESS [01:02 min]
[INFO] Apache Falcon Sharelib Hive - Test Cluster ........ SUCCESS [  2.486 s]
[INFO] Apache Falcon Sharelib Pig - Test Cluster ......... SUCCESS [  1.189 s]
[INFO] Apache Falcon Sharelib Hcatalog - Test Cluster .... SUCCESS [  1.684 s]
[INFO] Apache Falcon Sharelib Oozie - Test Cluster ....... SUCCESS [  1.022 s]
[INFO] Apache Falcon Test Tools - Test Cluster ........... SUCCESS [  1.397 s]
[INFO] Apache Falcon Messaging ........................... FAILURE [ 45.984 s]
[INFO] Apache Falcon LIfecycle Module .................... SKIPPED
[INFO] Apache Falcon Oozie Adaptor ....................... SKIPPED
[INFO] Apache Falcon Scheduler ........................... SKIPPED
[INFO] Apache Falcon Acquisition ......................... SKIPPED
[INFO] Apache Falcon Distcp Replication .................. SKIPPED
[INFO] Apache Falcon Retention ........................... SKIPPED
[INFO] Apache Falcon Archival ............................ SKIPPED
[INFO] Apache Falcon Rerun ............................... SKIPPED
[INFO] Apache Falcon Prism ............................... SKIPPED
[INFO] falcon-unit ....................................... SKIPPED
[INFO] Apache Falcon Web Application ..................... SKIPPED
[INFO] Apache Falcon Documentation ....................... SKIPPED
[INFO] Apache Falcon Distro .............................. SKIPPED
[INFO] ------------------------------------------------------------------------
[INFO] BUILD FAILURE
[INFO] ------------------------------------------------------------------------
[INFO] Total time: 12:32 min
[INFO] Finished at: 2016-03-28T08:21:08+00:00
[INFO] Final Memory: 317M/1456M
[INFO] ------------------------------------------------------------------------
[ERROR] Failed to execute goal org.apache.maven.plugins:maven-surefire-plugin:2.16:test (default-test)
on project falcon-messaging: There are test failures.
[ERROR] 
[ERROR] Please refer to <https://builds.apache.org/job/Apache-falcon/ws/messaging/target/surefire-reports>
for the individual test results.
[ERROR] -> [Help 1]
[ERROR] 
[ERROR] To see the full stack trace of the errors, re-run Maven with the -e switch.
[ERROR] Re-run Maven using the -X switch to enable full debug logging.
[ERROR] 
[ERROR] For more information about the errors and possible solutions, please read the following
articles:
[ERROR] [Help 1] http://cwiki.apache.org/confluence/display/MAVEN/MojoFailureException
[ERROR] 
[ERROR] After correcting the problems, you can resume the build with the command
[ERROR]   mvn <goals> -rf :falcon-messaging
Build step 'Execute shell' marked build as failure
[CHECKSTYLE] Collecting checkstyle analysis files...
[CHECKSTYLE] Finding all files that match the pattern **/target/checkstyle-result.xml
[CHECKSTYLE] Parsing 28 files in <https://builds.apache.org/job/Apache-falcon/ws/>
[CHECKSTYLE] Successfully parsed file <https://builds.apache.org/job/Apache-falcon/ws/acquisition/target/checkstyle-result.xml>
with 0 unique warnings and 0 duplicates.
[CHECKSTYLE] Successfully parsed file <https://builds.apache.org/job/Apache-falcon/ws/archival/target/checkstyle-result.xml>
with 0 unique warnings and 0 duplicates.
[CHECKSTYLE] Successfully parsed file <https://builds.apache.org/job/Apache-falcon/ws/build-tools/target/checkstyle-result.xml>
with 0 unique warnings and 0 duplicates.
[CHECKSTYLE] Successfully parsed file <https://builds.apache.org/job/Apache-falcon/ws/cli/target/checkstyle-result.xml>
with 0 unique warnings and 0 duplicates.
[CHECKSTYLE] Successfully parsed file <https://builds.apache.org/job/Apache-falcon/ws/client/target/checkstyle-result.xml>
with 0 unique warnings and 0 duplicates.
[CHECKSTYLE] Successfully parsed file <https://builds.apache.org/job/Apache-falcon/ws/common/target/checkstyle-result.xml>
with 0 unique warnings and 0 duplicates.
[CHECKSTYLE] Successfully parsed file <https://builds.apache.org/job/Apache-falcon/ws/docs/target/checkstyle-result.xml>
with 0 unique warnings and 0 duplicates.
[CHECKSTYLE] Successfully parsed file <https://builds.apache.org/job/Apache-falcon/ws/falcon-ui/target/checkstyle-result.xml>
with 0 unique warnings and 0 duplicates.
[CHECKSTYLE] Successfully parsed file <https://builds.apache.org/job/Apache-falcon/ws/hadoop-dependencies/target/checkstyle-result.xml>
with 0 unique warnings and 0 duplicates.
[CHECKSTYLE] Successfully parsed file <https://builds.apache.org/job/Apache-falcon/ws/lifecycle/target/checkstyle-result.xml>
with 0 unique warnings and 0 duplicates.
[CHECKSTYLE] Successfully parsed file <https://builds.apache.org/job/Apache-falcon/ws/metrics/target/checkstyle-result.xml>
with 0 unique warnings and 0 duplicates.
[CHECKSTYLE] Successfully parsed file <https://builds.apache.org/job/Apache-falcon/ws/oozie-el-extensions/target/checkstyle-result.xml>
with 0 unique warnings and 0 duplicates.
[CHECKSTYLE] Successfully parsed file <https://builds.apache.org/job/Apache-falcon/ws/oozie/target/checkstyle-result.xml>
with 0 unique warnings and 0 duplicates.
[CHECKSTYLE] Successfully parsed file <https://builds.apache.org/job/Apache-falcon/ws/prism/target/checkstyle-result.xml>
with 0 unique warnings and 0 duplicates.
[CHECKSTYLE] Successfully parsed file <https://builds.apache.org/job/Apache-falcon/ws/replication/target/checkstyle-result.xml>
with 0 unique warnings and 0 duplicates.
[CHECKSTYLE] Successfully parsed file <https://builds.apache.org/job/Apache-falcon/ws/rerun/target/checkstyle-result.xml>
with 0 unique warnings and 0 duplicates.
[CHECKSTYLE] Successfully parsed file <https://builds.apache.org/job/Apache-falcon/ws/retention/target/checkstyle-result.xml>
with 0 unique warnings and 0 duplicates.
[CHECKSTYLE] Successfully parsed file <https://builds.apache.org/job/Apache-falcon/ws/scheduler/target/checkstyle-result.xml>
with 0 unique warnings and 0 duplicates.
[CHECKSTYLE] Successfully parsed file <https://builds.apache.org/job/Apache-falcon/ws/target/checkstyle-result.xml>
with 0 unique warnings and 0 duplicates.
[CHECKSTYLE] Successfully parsed file <https://builds.apache.org/job/Apache-falcon/ws/test-tools/hadoop-webapp/target/checkstyle-result.xml>
with 0 unique warnings and 0 duplicates.
[CHECKSTYLE] Successfully parsed file <https://builds.apache.org/job/Apache-falcon/ws/test-tools/hcatalog-sharelib/target/checkstyle-result.xml>
with 0 unique warnings and 0 duplicates.
[CHECKSTYLE] Successfully parsed file <https://builds.apache.org/job/Apache-falcon/ws/test-tools/hive-sharelib/target/checkstyle-result.xml>
with 0 unique warnings and 0 duplicates.
[CHECKSTYLE] Successfully parsed file <https://builds.apache.org/job/Apache-falcon/ws/test-tools/oozie-sharelib/target/checkstyle-result.xml>
with 0 unique warnings and 0 duplicates.
[CHECKSTYLE] Successfully parsed file <https://builds.apache.org/job/Apache-falcon/ws/test-tools/pig-sharelib/target/checkstyle-result.xml>
with 0 unique warnings and 0 duplicates.
[CHECKSTYLE] Successfully parsed file <https://builds.apache.org/job/Apache-falcon/ws/test-tools/target/checkstyle-result.xml>
with 0 unique warnings and 0 duplicates.
[CHECKSTYLE] Successfully parsed file <https://builds.apache.org/job/Apache-falcon/ws/test-util/target/checkstyle-result.xml>
with 0 unique warnings and 0 duplicates.
[CHECKSTYLE] Successfully parsed file <https://builds.apache.org/job/Apache-falcon/ws/unit/target/checkstyle-result.xml>
with 0 unique warnings and 0 duplicates.
[CHECKSTYLE] Successfully parsed file <https://builds.apache.org/job/Apache-falcon/ws/webapp/target/checkstyle-result.xml>
with 0 unique warnings and 0 duplicates.
[CHECKSTYLE] Computing warning deltas based on reference build #954
[FINDBUGS] Collecting findbugs analysis files...
[FINDBUGS] Finding all files that match the pattern **/target/findbugs.xml
[FINDBUGS] Parsing 17 files in <https://builds.apache.org/job/Apache-falcon/ws/>
[FINDBUGS] Successfully parsed file <https://builds.apache.org/job/Apache-falcon/ws/cli/target/findbugs.xml>
with 0 unique warnings and 0 duplicates.
[FINDBUGS] Successfully parsed file <https://builds.apache.org/job/Apache-falcon/ws/client/target/findbugs.xml>
with 0 unique warnings and 0 duplicates.
[FINDBUGS] Successfully parsed file <https://builds.apache.org/job/Apache-falcon/ws/common/target/findbugs.xml>
with 0 unique warnings and 0 duplicates.
[FINDBUGS] Successfully parsed file <https://builds.apache.org/job/Apache-falcon/ws/hadoop-dependencies/target/findbugs.xml>
with 0 unique warnings and 0 duplicates.
[FINDBUGS] Successfully parsed file <https://builds.apache.org/job/Apache-falcon/ws/lifecycle/target/findbugs.xml>
with 0 unique warnings and 0 duplicates.
[FINDBUGS] Successfully parsed file <https://builds.apache.org/job/Apache-falcon/ws/metrics/target/findbugs.xml>
with 0 unique warnings and 0 duplicates.
[FINDBUGS] Successfully parsed file <https://builds.apache.org/job/Apache-falcon/ws/oozie-el-extensions/target/findbugs.xml>
with 0 unique warnings and 0 duplicates.
[FINDBUGS] Successfully parsed file <https://builds.apache.org/job/Apache-falcon/ws/oozie/target/findbugs.xml>
with 0 unique warnings and 0 duplicates.
[FINDBUGS] Successfully parsed file <https://builds.apache.org/job/Apache-falcon/ws/prism/target/findbugs.xml>
with 0 unique warnings and 0 duplicates.
[FINDBUGS] Successfully parsed file <https://builds.apache.org/job/Apache-falcon/ws/replication/target/findbugs.xml>
with 0 unique warnings and 0 duplicates.
[FINDBUGS] Successfully parsed file <https://builds.apache.org/job/Apache-falcon/ws/rerun/target/findbugs.xml>
with 0 unique warnings and 0 duplicates.
[FINDBUGS] Successfully parsed file <https://builds.apache.org/job/Apache-falcon/ws/retention/target/findbugs.xml>
with 0 unique warnings and 0 duplicates.
[FINDBUGS] Successfully parsed file <https://builds.apache.org/job/Apache-falcon/ws/scheduler/target/findbugs.xml>
with 0 unique warnings and 0 duplicates.
[FINDBUGS] Successfully parsed file <https://builds.apache.org/job/Apache-falcon/ws/test-tools/hadoop-webapp/target/findbugs.xml>
with 0 unique warnings and 0 duplicates.
[FINDBUGS] Successfully parsed file <https://builds.apache.org/job/Apache-falcon/ws/test-util/target/findbugs.xml>
with 0 unique warnings and 0 duplicates.
[FINDBUGS] Successfully parsed file <https://builds.apache.org/job/Apache-falcon/ws/unit/target/findbugs.xml>
with 0 unique warnings and 0 duplicates.
[FINDBUGS] Successfully parsed file <https://builds.apache.org/job/Apache-falcon/ws/webapp/target/findbugs.xml>
with 0 unique warnings and 0 duplicates.
[FINDBUGS] Computing warning deltas based on reference build #954
Archiving artifacts
Recording test results
TestNG Reports Processing: START
Looking for TestNG results report in workspace using pattern: **/target/testng-results.xml
Did not find any matching files.

Mime
View raw message