falcon-dev mailing list archives

Site index · List index
Message view « Date » · « Thread »
Top « Date » · « Thread »
From Apache Jenkins Server <jenk...@builds.apache.org>
Subject Build failed in Jenkins: Apache-falcon #1147
Date Mon, 08 Jan 2018 07:32:39 GMT
See <https://builds.apache.org/job/Apache-falcon/1147/display/redirect?page=changes>

Changes:

[pallavi.rao] FALCON-2319 Falcon Build failure fix for enunciate

------------------------------------------
[...truncated 401.14 KB...]
	at com.webcohesion.enunciate.io.InvokeEnunciateModule.onNext(InvokeEnunciateModule.java:25)
	at rx.internal.operators.OperatorDoOnEach$1.onNext(OperatorDoOnEach.java:80)
	at rx.internal.producers.SingleProducer.request(SingleProducer.java:65)
	at rx.Subscriber.setProducer(Subscriber.java:209)
	at rx.Subscriber.setProducer(Subscriber.java:205)
	at rx.internal.operators.OperatorSingle$ParentSubscriber.onCompleted(OperatorSingle.java:111)
	at rx.internal.operators.OperatorTakeLastOne$ParentSubscriber.emit(OperatorTakeLastOne.java:175)
	at rx.internal.operators.OperatorTakeLastOne$ParentSubscriber.onCompleted(OperatorTakeLastOne.java:141)
	at rx.internal.operators.OperatorMerge$MergeSubscriber.emitLoop(OperatorMerge.java:648)
	at rx.internal.operators.OperatorMerge$MergeSubscriber.emit(OperatorMerge.java:560)
	at rx.internal.operators.OperatorMerge$MergeSubscriber.onCompleted(OperatorMerge.java:281)
	at rx.internal.operators.OnSubscribeFromArray$FromArrayProducer.fastPath(OnSubscribeFromArray.java:82)
	at rx.internal.operators.OnSubscribeFromArray$FromArrayProducer.request(OnSubscribeFromArray.java:58)
	at rx.Subscriber.setProducer(Subscriber.java:211)
	at rx.internal.operators.OnSubscribeFromArray.call(OnSubscribeFromArray.java:32)
	at rx.internal.operators.OnSubscribeFromArray.call(OnSubscribeFromArray.java:24)
	at rx.internal.operators.OnSubscribeLift.call(OnSubscribeLift.java:50)
	at rx.internal.operators.OnSubscribeLift.call(OnSubscribeLift.java:30)
	at rx.internal.operators.OnSubscribeLift.call(OnSubscribeLift.java:50)
	at rx.internal.operators.OnSubscribeLift.call(OnSubscribeLift.java:30)
	at rx.internal.operators.OnSubscribeLift.call(OnSubscribeLift.java:50)
	at rx.internal.operators.OnSubscribeLift.call(OnSubscribeLift.java:30)
	at rx.internal.operators.OnSubscribeLift.call(OnSubscribeLift.java:50)
	at rx.internal.operators.OnSubscribeLift.call(OnSubscribeLift.java:30)
	at rx.Observable.unsafeSubscribe(Observable.java:8460)
	at rx.internal.operators.CachedObservable$CacheState.connect(CachedObservable.java:183)
	at rx.internal.operators.CachedObservable$CachedSubscribe.call(CachedObservable.java:248)
	at rx.internal.operators.CachedObservable$CachedSubscribe.call(CachedObservable.java:230)
	at rx.Observable.unsafeSubscribe(Observable.java:8460)
	at rx.internal.operators.OperatorMerge$MergeSubscriber.onNext(OperatorMerge.java:248)
	at rx.internal.operators.OperatorMerge$MergeSubscriber.onNext(OperatorMerge.java:145)
	at rx.internal.operators.OnSubscribeFromIterable$IterableProducer.fastpath(OnSubscribeFromIterable.java:172)
	at rx.internal.operators.OnSubscribeFromIterable$IterableProducer.request(OnSubscribeFromIterable.java:85)
	at rx.Subscriber.setProducer(Subscriber.java:211)
	at rx.internal.operators.OnSubscribeFromIterable.call(OnSubscribeFromIterable.java:62)
	at rx.internal.operators.OnSubscribeFromIterable.call(OnSubscribeFromIterable.java:33)
	at rx.internal.operators.OnSubscribeLift.call(OnSubscribeLift.java:50)
	at rx.internal.operators.OnSubscribeLift.call(OnSubscribeLift.java:30)
	at rx.internal.operators.OnSubscribeLift.call(OnSubscribeLift.java:50)
	at rx.internal.operators.OnSubscribeLift.call(OnSubscribeLift.java:30)
	at rx.internal.operators.OnSubscribeLift.call(OnSubscribeLift.java:50)
	at rx.internal.operators.OnSubscribeLift.call(OnSubscribeLift.java:30)
	at rx.Observable.subscribe(Observable.java:8553)
	at rx.Observable.subscribe(Observable.java:8520)
	at rx.observables.BlockingObservable.blockForSingle(BlockingObservable.java:433)
	at rx.observables.BlockingObservable.single(BlockingObservable.java:332)
	at com.webcohesion.enunciate.EnunciateAnnotationProcessor.process(EnunciateAnnotationProcessor.java:107)
	at com.sun.tools.javac.processing.JavacProcessingEnvironment.callProcessor(JavacProcessingEnvironment.java:793)
	at com.sun.tools.javac.processing.JavacProcessingEnvironment.discoverAndRunProcs(JavacProcessingEnvironment.java:722)
	at com.sun.tools.javac.processing.JavacProcessingEnvironment.access$1700(JavacProcessingEnvironment.java:97)
	at com.sun.tools.javac.processing.JavacProcessingEnvironment$Round.run(JavacProcessingEnvironment.java:1029)
	at com.sun.tools.javac.processing.JavacProcessingEnvironment.doProcessing(JavacProcessingEnvironment.java:1163)
	at com.sun.tools.javac.main.JavaCompiler.processAnnotations(JavaCompiler.java:1106)
	at com.sun.tools.javac.main.JavaCompiler.compile(JavaCompiler.java:824)
	at com.sun.tools.javac.main.Main.compile(Main.java:417)
	at com.sun.tools.javac.api.JavacTaskImpl.call(JavacTaskImpl.java:132)
	at com.webcohesion.enunciate.Enunciate.run(Enunciate.java:673)
	at com.webcohesion.enunciate.mojo.ConfigMojo.execute(ConfigMojo.java:401)
	at com.webcohesion.enunciate.mojo.DocsBaseMojo.execute(DocsBaseMojo.java:96)
	at org.apache.maven.plugin.DefaultBuildPluginManager.executeMojo(DefaultBuildPluginManager.java:134)
	at org.apache.maven.lifecycle.internal.MojoExecutor.execute(MojoExecutor.java:208)
	at org.apache.maven.lifecycle.internal.MojoExecutor.execute(MojoExecutor.java:154)
	at org.apache.maven.lifecycle.internal.MojoExecutor.execute(MojoExecutor.java:146)
	at org.apache.maven.lifecycle.internal.LifecycleModuleBuilder.buildProject(LifecycleModuleBuilder.java:117)
	at org.apache.maven.lifecycle.internal.LifecycleModuleBuilder.buildProject(LifecycleModuleBuilder.java:81)
	at org.apache.maven.lifecycle.internal.builder.singlethreaded.SingleThreadedBuilder.build(SingleThreadedBuilder.java:51)
	at org.apache.maven.lifecycle.internal.LifecycleStarter.execute(LifecycleStarter.java:128)
	at org.apache.maven.DefaultMaven.doExecute(DefaultMaven.java:309)
	at org.apache.maven.DefaultMaven.doExecute(DefaultMaven.java:194)
	at org.apache.maven.DefaultMaven.execute(DefaultMaven.java:107)
	at org.apache.maven.cli.MavenCli.execute(MavenCli.java:955)
	at org.apache.maven.cli.MavenCli.doMain(MavenCli.java:290)
	at org.apache.maven.cli.MavenCli.main(MavenCli.java:194)
	at sun.reflect.NativeMethodAccessorImpl.invoke0(Native Method)
	at sun.reflect.NativeMethodAccessorImpl.invoke(NativeMethodAccessorImpl.java:57)
	at sun.reflect.DelegatingMethodAccessorImpl.invoke(DelegatingMethodAccessorImpl.java:43)
	at java.lang.reflect.Method.invoke(Method.java:601)
	at org.codehaus.plexus.classworlds.launcher.Launcher.launchEnhanced(Launcher.java:289)
	at org.codehaus.plexus.classworlds.launcher.Launcher.launch(Launcher.java:229)
	at org.codehaus.plexus.classworlds.launcher.Launcher.mainWithExitCode(Launcher.java:415)
	at org.codehaus.plexus.classworlds.launcher.Launcher.main(Launcher.java:356)
Caused by: java.lang.reflect.InvocationTargetException
	at sun.reflect.NativeMethodAccessorImpl.invoke0(Native Method)
	at sun.reflect.NativeMethodAccessorImpl.invoke(NativeMethodAccessorImpl.java:57)
	at sun.reflect.DelegatingMethodAccessorImpl.invoke(DelegatingMethodAccessorImpl.java:43)
	at java.lang.reflect.Method.invoke(Method.java:601)
	at freemarker.ext.beans.BeansWrapper.invokeMethod(BeansWrapper.java:1458)
	at freemarker.ext.beans.BeanModel.invokeThroughDescriptor(BeanModel.java:255)
	at freemarker.ext.beans.BeanModel.get(BeanModel.java:159)
	... 174 more
Caused by: java.lang.UnsupportedClassVersionError: javax/annotation/security/RolesAllowed
: Unsupported major.minor version 52.0
	at java.lang.ClassLoader.defineClass1(Native Method)
	at java.lang.ClassLoader.defineClass(ClassLoader.java:791)
	at java.security.SecureClassLoader.defineClass(SecureClassLoader.java:142)
	at java.net.URLClassLoader.defineClass(URLClassLoader.java:449)
	at java.net.URLClassLoader.access$100(URLClassLoader.java:71)
	at java.net.URLClassLoader$1.run(URLClassLoader.java:361)
	at java.net.URLClassLoader$1.run(URLClassLoader.java:355)
	at java.security.AccessController.doPrivileged(Native Method)
	at java.net.URLClassLoader.findClass(URLClassLoader.java:354)
	at org.codehaus.plexus.classworlds.realm.ClassRealm.loadClassFromSelf(ClassRealm.java:401)
	at org.codehaus.plexus.classworlds.strategy.SelfFirstStrategy.loadClass(SelfFirstStrategy.java:42)
	at org.codehaus.plexus.classworlds.realm.ClassRealm.unsynchronizedLoadClass(ClassRealm.java:271)
	at org.codehaus.plexus.classworlds.realm.ClassRealm.loadClass(ClassRealm.java:247)
	at org.codehaus.plexus.classworlds.realm.ClassRealm.loadClass(ClassRealm.java:239)
	at com.webcohesion.enunciate.modules.jaxrs.model.ResourceMethod.getSecurityRoles(ResourceMethod.java:895)
	at com.webcohesion.enunciate.modules.jaxrs.api.impl.MethodImpl.getSecurityRoles(MethodImpl.java:165)
	... 181 more

[INFO] ------------------------------------------------------------------------
[INFO] Reactor Summary:
[INFO] 
[INFO] Apache Falcon ...................................... SUCCESS [ 12.252 s]
[INFO] Apache Falcon UI ................................... SUCCESS [ 11.001 s]
[INFO] Build Tools ........................................ SUCCESS [  4.318 s]
[INFO] Apache Falcon Java common types .................... SUCCESS [ 27.164 s]
[INFO] Apache Falcon Metrics .............................. SUCCESS [ 14.269 s]
[INFO] Apache Falcon Hadoop Dependencies .................. SUCCESS [ 11.188 s]
[INFO] Apache Falcon Test Utility ......................... SUCCESS [ 10.943 s]
[INFO] Apache Falcon Commons .............................. SUCCESS [02:51 min]
[INFO] Apache Falcon extensions ........................... SUCCESS [ 45.719 s]
[INFO] Apache Falcon Java client .......................... SUCCESS [ 18.863 s]
[INFO] Apache Falcon Shell ................................ SUCCESS [ 14.522 s]
[INFO] Apache Falcon CLI client ........................... SUCCESS [ 17.118 s]
[INFO] Apache Falcon Titan 1.0 support .................... SUCCESS [  5.603 s]
[INFO] Apache Falcon Oozie EL Extension ................... SUCCESS [ 14.757 s]
[INFO] Apache Falcon Embedded Hadoop - Test Cluster ....... SUCCESS [ 29.496 s]
[INFO] Apache Falcon Sharelib Hive - Test Cluster ......... SUCCESS [  1.543 s]
[INFO] Apache Falcon Sharelib Pig - Test Cluster .......... SUCCESS [  0.624 s]
[INFO] Apache Falcon Sharelib Hcatalog - Test Cluster ..... SUCCESS [  0.940 s]
[INFO] Apache Falcon Sharelib Oozie - Test Cluster ........ SUCCESS [  0.477 s]
[INFO] Apache Falcon Test Tools - Test Cluster ............ SUCCESS [  0.430 s]
[INFO] Apache Falcon Messaging ............................ SUCCESS [ 29.996 s]
[INFO] Apache Falcon LIfecycle Module ..................... SUCCESS [ 23.030 s]
[INFO] Apache Falcon Oozie Adaptor ........................ SUCCESS [01:18 min]
[INFO] Apache Falcon Scheduler ............................ SUCCESS [01:28 min]
[INFO] Apache Falcon Acquisition .......................... SUCCESS [  0.901 s]
[INFO] Apache Falcon Distcp Replication ................... SUCCESS [ 17.511 s]
[INFO] Apache Falcon Retention ............................ SUCCESS [ 14.674 s]
[INFO] Apache Falcon Archival ............................. SUCCESS [  1.060 s]
[INFO] Apache Falcon Rerun ................................ SUCCESS [ 25.690 s]
[INFO] Apache Falcon Prism ................................ FAILURE [ 32.377 s]
[INFO] Apache Falcon Unit ................................. SKIPPED
[INFO] Apache Falcon Examples ............................. SKIPPED
[INFO] Apache Falcon Web Application ...................... SKIPPED
[INFO] Apache Falcon Documentation ........................ SKIPPED
[INFO] Apache Falcon Distro ............................... SKIPPED
[INFO] ------------------------------------------------------------------------
[INFO] BUILD FAILURE
[INFO] ------------------------------------------------------------------------
[INFO] Total time: 12:05 min
[INFO] Finished at: 2018-01-08T07:30:50Z
[INFO] Final Memory: 930M/2263M
[INFO] ------------------------------------------------------------------------
[WARNING] The requested profile "hadoop-2" could not be activated because it does not exist.
[ERROR] Failed to execute goal com.webcohesion.enunciate:enunciate-maven-plugin:2.6.0:docs
(default) on project falcon-prism: freemarker.core._TemplateModelException: An error has occurred
when reading existing sub-variable "securityRoles"; see cause exception! The type of the containing
value was: extended_hash+string (com.webcohesion.enunciate.modules.jaxrs.api.impl.MethodImpl
wrapped into f.e.b.StringModel)
[ERROR] 
[ERROR] ----
[ERROR] FTL stack trace ("~" means nesting-related):
[ERROR] 	- Failed at: #assign securityRoles = method.securi...  [in template "jar:file:/home/jenkins/.m2/repository/com/webcohesion/enunciate/enunciate-docs/2.6.0/enunciate-docs-2.6.0.jar!/com/webcohesion/enunciate/modules/docs/docs.fmt"
in macro "processResourceGroup" at line 550, column 11]
[ERROR] 	~ Reached through: #nested  [in template "jar:file:/home/jenkins/.m2/repository/com/webcohesion/enunciate/enunciate-docs/2.6.0/enunciate-docs-2.6.0.jar!/com/webcohesion/enunciate/modules/docs/docs.fmt"
in macro "boilerplate" at line 141, column 9]
[ERROR] 	~ Reached through: @boilerplate title=(title + ": " + re...  [in template "jar:file:/home/jenkins/.m2/repository/com/webcohesion/enunciate/enunciate-docs/2.6.0/enunciate-docs-2.6.0.jar!/com/webcohesion/enunciate/modules/docs/docs.fmt"
in macro "processResourceGroup" at line 512, column 5]
[ERROR] 	- Reached through: @file name=(resourceGroup.slug + ".ht...  [in template "jar:file:/home/jenkins/.m2/repository/com/webcohesion/enunciate/enunciate-docs/2.6.0/enunciate-docs-2.6.0.jar!/com/webcohesion/enunciate/modules/docs/docs.fmt"
in macro "processResourceGroup" at line 511, column 3]
[ERROR] 	- Reached through: @processResourceGroup resourceGroup=r...  [in template "jar:file:/home/jenkins/.m2/repository/com/webcohesion/enunciate/enunciate-docs/2.6.0/enunciate-docs-2.6.0.jar!/com/webcohesion/enunciate/modules/docs/docs.fmt"
at line 235, column 11]
[ERROR] 	~ Reached through: #nested  [in template "jar:file:/home/jenkins/.m2/repository/com/webcohesion/enunciate/enunciate-docs/2.6.0/enunciate-docs-2.6.0.jar!/com/webcohesion/enunciate/modules/docs/docs.fmt"
in macro "boilerplate" at line 141, column 9]
[ERROR] 	~ Reached through: @boilerplate pagenav=pagenav  [in template "jar:file:/home/jenkins/.m2/repository/com/webcohesion/enunciate/enunciate-docs/2.6.0/enunciate-docs-2.6.0.jar!/com/webcohesion/enunciate/modules/docs/docs.fmt"
at line 192, column 3]
[ERROR] 	- Reached through: @file name=indexPageName  [in template "jar:file:/home/jenkins/.m2/repository/com/webcohesion/enunciate/enunciate-docs/2.6.0/enunciate-docs-2.6.0.jar!/com/webcohesion/enunciate/modules/docs/docs.fmt"
at line 181, column 1]
[ERROR] ----: InvocationTargetException: javax/annotation/security/RolesAllowed : Unsupported
major.minor version 52.0: OnError while emitting onNext value: com.webcohesion.enunciate.EnunciateContext.class
[ERROR] -> [Help 1]
[ERROR] 
[ERROR] To see the full stack trace of the errors, re-run Maven with the -e switch.
[ERROR] Re-run Maven using the -X switch to enable full debug logging.
[ERROR] 
[ERROR] For more information about the errors and possible solutions, please read the following
articles:
[ERROR] [Help 1] http://cwiki.apache.org/confluence/display/MAVEN/MojoExecutionException
[ERROR] 
[ERROR] After correcting the problems, you can resume the build with the command
[ERROR]   mvn <goals> -rf :falcon-prism
Build step 'Execute shell' marked build as failure
[CHECKSTYLE] Collecting checkstyle analysis files...
[CHECKSTYLE] Searching for all files in <https://builds.apache.org/job/Apache-falcon/ws/>
that match the pattern **/target/checkstyle-result.xml
[CHECKSTYLE] Parsing 33 files in <https://builds.apache.org/job/Apache-falcon/ws/>
[CHECKSTYLE] Successfully parsed file <https://builds.apache.org/job/Apache-falcon/ws/acquisition/target/checkstyle-result.xml>
with 0 unique warnings and 0 duplicates.
[CHECKSTYLE] Successfully parsed file <https://builds.apache.org/job/Apache-falcon/ws/archival/target/checkstyle-result.xml>
with 0 unique warnings and 0 duplicates.
[CHECKSTYLE] Successfully parsed file <https://builds.apache.org/job/Apache-falcon/ws/build-tools/target/checkstyle-result.xml>
with 0 unique warnings and 0 duplicates.
[CHECKSTYLE] Successfully parsed file <https://builds.apache.org/job/Apache-falcon/ws/cli/target/checkstyle-result.xml>
with 0 unique warnings and 0 duplicates.
[CHECKSTYLE] Successfully parsed file <https://builds.apache.org/job/Apache-falcon/ws/client/target/checkstyle-result.xml>
with 0 unique warnings and 0 duplicates.
[CHECKSTYLE] Successfully parsed file <https://builds.apache.org/job/Apache-falcon/ws/common-types/target/checkstyle-result.xml>
with 0 unique warnings and 0 duplicates.
[CHECKSTYLE] Successfully parsed file <https://builds.apache.org/job/Apache-falcon/ws/common/target/checkstyle-result.xml>
with 0 unique warnings and 0 duplicates.
[CHECKSTYLE] Successfully parsed file <https://builds.apache.org/job/Apache-falcon/ws/distro/target/checkstyle-result.xml>
with 0 unique warnings and 0 duplicates.
[CHECKSTYLE] Successfully parsed file <https://builds.apache.org/job/Apache-falcon/ws/docs/target/checkstyle-result.xml>
with 0 unique warnings and 0 duplicates.
[CHECKSTYLE] Successfully parsed file <https://builds.apache.org/job/Apache-falcon/ws/examples/target/checkstyle-result.xml>
with 0 unique warnings and 0 duplicates.
[CHECKSTYLE] Successfully parsed file <https://builds.apache.org/job/Apache-falcon/ws/extensions/target/checkstyle-result.xml>
with 0 unique warnings and 0 duplicates.
[CHECKSTYLE] Successfully parsed file <https://builds.apache.org/job/Apache-falcon/ws/falcon-ui/target/checkstyle-result.xml>
with 0 unique warnings and 0 duplicates.
[CHECKSTYLE] Successfully parsed file <https://builds.apache.org/job/Apache-falcon/ws/hadoop-dependencies/target/checkstyle-result.xml>
with 0 unique warnings and 0 duplicates.
[CHECKSTYLE] Successfully parsed file <https://builds.apache.org/job/Apache-falcon/ws/lifecycle/target/checkstyle-result.xml>
with 0 unique warnings and 0 duplicates.
[CHECKSTYLE] Successfully parsed file <https://builds.apache.org/job/Apache-falcon/ws/messaging/target/checkstyle-result.xml>
with 0 unique warnings and 0 duplicates.
[CHECKSTYLE] Successfully parsed file <https://builds.apache.org/job/Apache-falcon/ws/metrics/target/checkstyle-result.xml>
with 0 unique warnings and 0 duplicates.
[CHECKSTYLE] Successfully parsed file <https://builds.apache.org/job/Apache-falcon/ws/oozie-el-extensions/target/checkstyle-result.xml>
with 0 unique warnings and 0 duplicates.
[CHECKSTYLE] Successfully parsed file <https://builds.apache.org/job/Apache-falcon/ws/oozie/target/checkstyle-result.xml>
with 0 unique warnings and 0 duplicates.
[CHECKSTYLE] Successfully parsed file <https://builds.apache.org/job/Apache-falcon/ws/replication/target/checkstyle-result.xml>
with 0 unique warnings and 0 duplicates.
[CHECKSTYLE] Successfully parsed file <https://builds.apache.org/job/Apache-falcon/ws/rerun/target/checkstyle-result.xml>
with 0 unique warnings and 0 duplicates.
[CHECKSTYLE] Successfully parsed file <https://builds.apache.org/job/Apache-falcon/ws/retention/target/checkstyle-result.xml>
with 0 unique warnings and 0 duplicates.
[CHECKSTYLE] Successfully parsed file <https://builds.apache.org/job/Apache-falcon/ws/scheduler/target/checkstyle-result.xml>
with 0 unique warnings and 0 duplicates.
[CHECKSTYLE] Successfully parsed file <https://builds.apache.org/job/Apache-falcon/ws/shell/target/checkstyle-result.xml>
with 0 unique warnings and 0 duplicates.
[CHECKSTYLE] Successfully parsed file <https://builds.apache.org/job/Apache-falcon/ws/target/checkstyle-result.xml>
with 0 unique warnings and 0 duplicates.
[CHECKSTYLE] Successfully parsed file <https://builds.apache.org/job/Apache-falcon/ws/test-tools/hadoop-webapp/target/checkstyle-result.xml>
with 0 unique warnings and 0 duplicates.
[CHECKSTYLE] Successfully parsed file <https://builds.apache.org/job/Apache-falcon/ws/test-tools/hcatalog-sharelib/target/checkstyle-result.xml>
with 0 unique warnings and 0 duplicates.
[CHECKSTYLE] Successfully parsed file <https://builds.apache.org/job/Apache-falcon/ws/test-tools/hive-sharelib/target/checkstyle-result.xml>
with 0 unique warnings and 0 duplicates.
[CHECKSTYLE] Successfully parsed file <https://builds.apache.org/job/Apache-falcon/ws/test-tools/oozie-sharelib/target/checkstyle-result.xml>
with 0 unique warnings and 0 duplicates.
[CHECKSTYLE] Successfully parsed file <https://builds.apache.org/job/Apache-falcon/ws/test-tools/pig-sharelib/target/checkstyle-result.xml>
with 0 unique warnings and 0 duplicates.
[CHECKSTYLE] Successfully parsed file <https://builds.apache.org/job/Apache-falcon/ws/test-tools/target/checkstyle-result.xml>
with 0 unique warnings and 0 duplicates.
[CHECKSTYLE] Successfully parsed file <https://builds.apache.org/job/Apache-falcon/ws/test-util/target/checkstyle-result.xml>
with 0 unique warnings and 0 duplicates.
[CHECKSTYLE] Successfully parsed file <https://builds.apache.org/job/Apache-falcon/ws/unit/target/checkstyle-result.xml>
with 0 unique warnings and 0 duplicates.
[CHECKSTYLE] Successfully parsed file <https://builds.apache.org/job/Apache-falcon/ws/webapp/target/checkstyle-result.xml>
with 0 unique warnings and 0 duplicates.
Skipping warnings blame since Git is the only supported SCM up to now.%n
[CHECKSTYLE] Computing warning deltas based on reference build #1144
[FINDBUGS] Collecting findbugs analysis files...
[FINDBUGS] Searching for all files in <https://builds.apache.org/job/Apache-falcon/ws/>
that match the pattern **/target/findbugs.xml
[FINDBUGS] Parsing 21 files in <https://builds.apache.org/job/Apache-falcon/ws/>
[FINDBUGS] Successfully parsed file <https://builds.apache.org/job/Apache-falcon/ws/cli/target/findbugs.xml>
with 0 unique warnings and 0 duplicates.
[FINDBUGS] Successfully parsed file <https://builds.apache.org/job/Apache-falcon/ws/client/target/findbugs.xml>
with 0 unique warnings and 0 duplicates.
[FINDBUGS] Successfully parsed file <https://builds.apache.org/job/Apache-falcon/ws/common-types/target/findbugs.xml>
with 0 unique warnings and 0 duplicates.
[FINDBUGS] Successfully parsed file <https://builds.apache.org/job/Apache-falcon/ws/common/target/findbugs.xml>
with 0 unique warnings and 0 duplicates.
[FINDBUGS] Successfully parsed file <https://builds.apache.org/job/Apache-falcon/ws/examples/target/findbugs.xml>
with 0 unique warnings and 0 duplicates.
[FINDBUGS] Successfully parsed file <https://builds.apache.org/job/Apache-falcon/ws/extensions/target/findbugs.xml>
with 0 unique warnings and 0 duplicates.
[FINDBUGS] Successfully parsed file <https://builds.apache.org/job/Apache-falcon/ws/hadoop-dependencies/target/findbugs.xml>
with 0 unique warnings and 0 duplicates.
[FINDBUGS] Successfully parsed file <https://builds.apache.org/job/Apache-falcon/ws/lifecycle/target/findbugs.xml>
with 0 unique warnings and 0 duplicates.
[FINDBUGS] Successfully parsed file <https://builds.apache.org/job/Apache-falcon/ws/messaging/target/findbugs.xml>
with 0 unique warnings and 0 duplicates.
[FINDBUGS] Successfully parsed file <https://builds.apache.org/job/Apache-falcon/ws/metrics/target/findbugs.xml>
with 0 unique warnings and 0 duplicates.
[FINDBUGS] Successfully parsed file <https://builds.apache.org/job/Apache-falcon/ws/oozie-el-extensions/target/findbugs.xml>
with 0 unique warnings and 0 duplicates.
[FINDBUGS] Successfully parsed file <https://builds.apache.org/job/Apache-falcon/ws/oozie/target/findbugs.xml>
with 0 unique warnings and 0 duplicates.
[FINDBUGS] Successfully parsed file <https://builds.apache.org/job/Apache-falcon/ws/replication/target/findbugs.xml>
with 0 unique warnings and 0 duplicates.
[FINDBUGS] Successfully parsed file <https://builds.apache.org/job/Apache-falcon/ws/rerun/target/findbugs.xml>
with 0 unique warnings and 0 duplicates.
[FINDBUGS] Successfully parsed file <https://builds.apache.org/job/Apache-falcon/ws/retention/target/findbugs.xml>
with 0 unique warnings and 0 duplicates.
[FINDBUGS] Successfully parsed file <https://builds.apache.org/job/Apache-falcon/ws/scheduler/target/findbugs.xml>
with 0 unique warnings and 0 duplicates.
[FINDBUGS] Successfully parsed file <https://builds.apache.org/job/Apache-falcon/ws/shell/target/findbugs.xml>
with 0 unique warnings and 0 duplicates.
[FINDBUGS] Successfully parsed file <https://builds.apache.org/job/Apache-falcon/ws/test-tools/hadoop-webapp/target/findbugs.xml>
with 0 unique warnings and 0 duplicates.
[FINDBUGS] Successfully parsed file <https://builds.apache.org/job/Apache-falcon/ws/test-util/target/findbugs.xml>
with 0 unique warnings and 0 duplicates.
[FINDBUGS] Successfully parsed file <https://builds.apache.org/job/Apache-falcon/ws/unit/target/findbugs.xml>
with 0 unique warnings and 0 duplicates.
[FINDBUGS] Successfully parsed file <https://builds.apache.org/job/Apache-falcon/ws/webapp/target/findbugs.xml>
with 0 unique warnings and 0 duplicates.
Skipping warnings blame since Git is the only supported SCM up to now.%n
[FINDBUGS] Computing warning deltas based on reference build #1144
Archiving artifacts
[Fast Archiver] Compressed 11.94 MB of artifacts by 75.9% relative to #1144
Recording test results
TestNG Reports Processing: START
Looking for TestNG results report in workspace using pattern: **/target/testng-results.xml
Did not find any matching files.

Mime
View raw message