falcon-dev mailing list archives

Site index · List index
Message view « Date » · « Thread »
Top « Date » · « Thread »
From Apache Jenkins Server <jenk...@builds.apache.org>
Subject Build failed in Jenkins: Apache-falcon #1146
Date Fri, 05 Jan 2018 08:00:38 GMT
See <https://builds.apache.org/job/Apache-falcon/1146/display/redirect>

------------------------------------------
[...truncated 331.99 KB...]
	at freemarker.core.Environment.visit(Environment.java:312)
	at freemarker.core.MixedContent.accept(MixedContent.java:62)
	at freemarker.core.Environment.visitByHiddingParent(Environment.java:333)
	at freemarker.core.IteratorBlock$Context.runLoop(IteratorBlock.java:159)
	at freemarker.core.Environment.visitIteratorBlock(Environment.java:559)
	at freemarker.core.IteratorBlock.accept(IteratorBlock.java:67)
	at freemarker.core.Environment.visit(Environment.java:312)
	at freemarker.core.MixedContent.accept(MixedContent.java:62)
	at freemarker.core.Environment.visitByHiddingParent(Environment.java:333)
	at freemarker.core.IteratorBlock$Context.runLoop(IteratorBlock.java:159)
	at freemarker.core.Environment.visitIteratorBlock(Environment.java:559)
	at freemarker.core.IteratorBlock.accept(IteratorBlock.java:67)
	at freemarker.core.Environment.visit(Environment.java:312)
	at freemarker.core.MixedContent.accept(MixedContent.java:62)
	at freemarker.core.Environment.visitByHiddingParent(Environment.java:333)
	at freemarker.core.ConditionalBlock.accept(ConditionalBlock.java:48)
	at freemarker.core.Environment.visit(Environment.java:312)
	at freemarker.core.MixedContent.accept(MixedContent.java:62)
	at freemarker.core.Environment.visit(Environment.java:312)
	at freemarker.core.Environment.invokeNestedContent(Environment.java:535)
	at freemarker.core.BodyInstruction.accept(BodyInstruction.java:56)
	at freemarker.core.Environment.visit(Environment.java:312)
	at freemarker.core.MixedContent.accept(MixedContent.java:62)
	at freemarker.core.Environment.visit(Environment.java:312)
	at freemarker.core.Macro$Context.runMacro(Macro.java:178)
	at freemarker.core.Environment.invoke(Environment.java:700)
	at freemarker.core.UnifiedCall.accept(UnifiedCall.java:84)
	at freemarker.core.Environment.visit(Environment.java:312)
	at freemarker.core.MixedContent.accept(MixedContent.java:62)
	at freemarker.core.Environment.visit(Environment.java:312)
	at freemarker.core.Environment$NestedElementTemplateDirectiveBody.render(Environment.java:2255)
	at com.webcohesion.enunciate.util.freemarker.FileDirective.execute(FileDirective.java:59)
	at freemarker.core.Environment.visit(Environment.java:377)
	at freemarker.core.UnifiedCall.accept(UnifiedCall.java:104)
	at freemarker.core.Environment.visit(Environment.java:312)
	at freemarker.core.MixedContent.accept(MixedContent.java:62)
	at freemarker.core.Environment.visit(Environment.java:312)
	at freemarker.core.Environment.process(Environment.java:290)
	at freemarker.template.Template.process(Template.java:312)
	at com.webcohesion.enunciate.modules.docs.DocsModule.processTemplate(DocsModule.java:351)
	at com.webcohesion.enunciate.modules.docs.DocsModule.call(DocsModule.java:303)
	at com.webcohesion.enunciate.io.InvokeEnunciateModule.onNext(InvokeEnunciateModule.java:31)
	at com.webcohesion.enunciate.io.InvokeEnunciateModule.onNext(InvokeEnunciateModule.java:10)
	at rx.internal.operators.OperatorDoOnEach$1.onNext(OperatorDoOnEach.java:79)
	at rx.internal.operators.OperatorSingle$ParentSubscriber.onCompleted(OperatorSingle.java:109)
	at rx.internal.operators.NotificationLite.accept(NotificationLite.java:140)
	at rx.internal.operators.TakeLastQueueProducer.emit(TakeLastQueueProducer.java:100)
	at rx.internal.operators.TakeLastQueueProducer.startEmitting(TakeLastQueueProducer.java:45)
	at rx.internal.operators.OperatorTakeLast$1.onCompleted(OperatorTakeLast.java:59)
	at rx.internal.operators.OperatorMerge$MergeSubscriber.drainAndComplete(OperatorMerge.java:521)
	at rx.internal.operators.OperatorMerge$MergeSubscriber.completeInner(OperatorMerge.java:486)
	at rx.internal.operators.OperatorMerge$InnerSubscriber.emit(OperatorMerge.java:658)
	at rx.internal.operators.OperatorMerge$InnerSubscriber.onCompleted(OperatorMerge.java:600)
	at rx.subjects.SubjectSubscriptionManager$SubjectObserver.onCompleted(SubjectSubscriptionManager.java:232)
	at rx.subjects.ReplaySubject.onCompleted(ReplaySubject.java:404)
	at rx.Observable$35.onCompleted(Observable.java:7458)
	at rx.observers.SafeSubscriber.onCompleted(SafeSubscriber.java:81)
	at rx.internal.operators.OperatorDoOnEach$1.onCompleted(OperatorDoOnEach.java:53)
	at rx.internal.operators.OperatorSingle$ParentSubscriber.onCompleted(OperatorSingle.java:110)
	at rx.internal.operators.NotificationLite.accept(NotificationLite.java:140)
	at rx.internal.operators.TakeLastQueueProducer.emit(TakeLastQueueProducer.java:100)
	at rx.internal.operators.TakeLastQueueProducer.startEmitting(TakeLastQueueProducer.java:45)
	at rx.internal.operators.OperatorTakeLast$1.onCompleted(OperatorTakeLast.java:59)
	at rx.internal.operators.OperatorMerge$MergeSubscriber.drainAndComplete(OperatorMerge.java:521)
	at rx.internal.operators.OperatorMerge$MergeSubscriber.completeInner(OperatorMerge.java:486)
	at rx.internal.operators.OperatorMerge$InnerSubscriber.emit(OperatorMerge.java:658)
	at rx.internal.operators.OperatorMerge$InnerSubscriber.onCompleted(OperatorMerge.java:600)
	at rx.internal.operators.OperatorMerge$MergeSubscriber.drainAndComplete(OperatorMerge.java:521)
	at rx.internal.operators.OperatorMerge$MergeSubscriber.completeInner(OperatorMerge.java:486)
	at rx.internal.operators.OperatorMerge$InnerSubscriber.emit(OperatorMerge.java:673)
	at rx.internal.operators.OperatorMerge$InnerSubscriber.onCompleted(OperatorMerge.java:600)
	at rx.internal.operators.OperatorMerge$MergeSubscriber.drainAndComplete(OperatorMerge.java:521)
	at rx.internal.operators.OperatorMerge$MergeSubscriber.completeInner(OperatorMerge.java:486)
	at rx.internal.operators.OperatorMerge$InnerSubscriber.emit(OperatorMerge.java:673)
	at rx.internal.operators.OperatorMerge$InnerSubscriber.onCompleted(OperatorMerge.java:600)
	at rx.internal.operators.OperatorMerge$MergeSubscriber.drainAndComplete(OperatorMerge.java:521)
	at rx.internal.operators.OperatorMerge$MergeSubscriber.completeInner(OperatorMerge.java:486)
	at rx.internal.operators.OperatorMerge$InnerSubscriber.emit(OperatorMerge.java:673)
	at rx.internal.operators.OperatorMerge$InnerSubscriber.onCompleted(OperatorMerge.java:600)
	at rx.internal.operators.OperatorMerge$MergeSubscriber.drainAndComplete(OperatorMerge.java:521)
	at rx.internal.operators.OperatorMerge$MergeSubscriber.completeInner(OperatorMerge.java:486)
	at rx.internal.operators.OperatorMerge$InnerSubscriber.emit(OperatorMerge.java:673)
	at rx.internal.operators.OperatorMerge$InnerSubscriber.onCompleted(OperatorMerge.java:600)
	at rx.internal.util.ScalarSynchronousObservable$ScalarSynchronousAction.call(ScalarSynchronousObservable.java:117)
	at rx.schedulers.ExecutorScheduler$ExecutorAction.run(ExecutorScheduler.java:173)
	at rx.schedulers.ExecutorScheduler$ExecutorSchedulerWorker.run(ExecutorScheduler.java:99)
	at java.util.concurrent.ThreadPoolExecutor.runWorker(ThreadPoolExecutor.java:1110)
	at java.util.concurrent.ThreadPoolExecutor$Worker.run(ThreadPoolExecutor.java:603)
	at java.lang.Thread.run(Thread.java:722)
Caused by: java.lang.reflect.InvocationTargetException
	at sun.reflect.NativeMethodAccessorImpl.invoke0(Native Method)
	at sun.reflect.NativeMethodAccessorImpl.invoke(NativeMethodAccessorImpl.java:57)
	at sun.reflect.DelegatingMethodAccessorImpl.invoke(DelegatingMethodAccessorImpl.java:43)
	at java.lang.reflect.Method.invoke(Method.java:601)
	at freemarker.ext.beans.BeansWrapper.invokeMethod(BeansWrapper.java:1458)
	at freemarker.ext.beans.BeanModel.invokeThroughDescriptor(BeanModel.java:255)
	at freemarker.ext.beans.BeanModel.get(BeanModel.java:159)
	... 128 more
Caused by: java.lang.NoClassDefFoundError: javax/annotation/security/RolesAllowed
	at com.webcohesion.enunciate.modules.jaxrs.model.ResourceMethod.getSecurityRoles(ResourceMethod.java:720)
	at com.webcohesion.enunciate.modules.jaxrs.api.impl.MethodImpl.getSecurityRoles(MethodImpl.java:133)
	... 135 more
Caused by: java.lang.ClassNotFoundException: javax.annotation.security.RolesAllowed
	at org.codehaus.plexus.classworlds.strategy.SelfFirstStrategy.loadClass(SelfFirstStrategy.java:50)
	at org.codehaus.plexus.classworlds.realm.ClassRealm.unsynchronizedLoadClass(ClassRealm.java:271)
	at org.codehaus.plexus.classworlds.realm.ClassRealm.loadClass(ClassRealm.java:247)
	at org.codehaus.plexus.classworlds.realm.ClassRealm.loadClass(ClassRealm.java:239)
	... 137 more

[INFO] ------------------------------------------------------------------------
[INFO] Reactor Summary:
[INFO] 
[INFO] Apache Falcon ...................................... SUCCESS [  7.552 s]
[INFO] Apache Falcon UI ................................... SUCCESS [ 11.247 s]
[INFO] Build Tools ........................................ SUCCESS [  4.241 s]
[INFO] Apache Falcon Java common types .................... SUCCESS [ 25.695 s]
[INFO] Apache Falcon Metrics .............................. SUCCESS [ 14.258 s]
[INFO] Apache Falcon Hadoop Dependencies .................. SUCCESS [ 11.210 s]
[INFO] Apache Falcon Test Utility ......................... SUCCESS [ 11.366 s]
[INFO] Apache Falcon Commons .............................. SUCCESS [02:45 min]
[INFO] Apache Falcon extensions ........................... SUCCESS [ 44.282 s]
[INFO] Apache Falcon Java client .......................... SUCCESS [ 19.202 s]
[INFO] Apache Falcon Shell ................................ SUCCESS [ 13.754 s]
[INFO] Apache Falcon CLI client ........................... SUCCESS [ 15.510 s]
[INFO] Apache Falcon Titan 1.0 support .................... SUCCESS [  5.347 s]
[INFO] Apache Falcon Oozie EL Extension ................... SUCCESS [ 13.928 s]
[INFO] Apache Falcon Embedded Hadoop - Test Cluster ....... SUCCESS [ 30.218 s]
[INFO] Apache Falcon Sharelib Hive - Test Cluster ......... SUCCESS [  1.687 s]
[INFO] Apache Falcon Sharelib Pig - Test Cluster .......... SUCCESS [  0.618 s]
[INFO] Apache Falcon Sharelib Hcatalog - Test Cluster ..... SUCCESS [  0.853 s]
[INFO] Apache Falcon Sharelib Oozie - Test Cluster ........ SUCCESS [  0.502 s]
[INFO] Apache Falcon Test Tools - Test Cluster ............ SUCCESS [  0.432 s]
[INFO] Apache Falcon Messaging ............................ SUCCESS [ 34.130 s]
[INFO] Apache Falcon LIfecycle Module ..................... SUCCESS [ 17.410 s]
[INFO] Apache Falcon Oozie Adaptor ........................ SUCCESS [01:11 min]
[INFO] Apache Falcon Scheduler ............................ SUCCESS [01:21 min]
[INFO] Apache Falcon Acquisition .......................... SUCCESS [  0.968 s]
[INFO] Apache Falcon Distcp Replication ................... SUCCESS [ 18.468 s]
[INFO] Apache Falcon Retention ............................ SUCCESS [ 14.803 s]
[INFO] Apache Falcon Archival ............................. SUCCESS [  0.943 s]
[INFO] Apache Falcon Rerun ................................ SUCCESS [ 25.609 s]
[INFO] Apache Falcon Prism ................................ FAILURE [ 16.216 s]
[INFO] Apache Falcon Unit ................................. SKIPPED
[INFO] Apache Falcon Examples ............................. SKIPPED
[INFO] Apache Falcon Web Application ...................... SKIPPED
[INFO] Apache Falcon Documentation ........................ SKIPPED
[INFO] Apache Falcon Distro ............................... SKIPPED
[INFO] ------------------------------------------------------------------------
[INFO] BUILD FAILURE
[INFO] ------------------------------------------------------------------------
[INFO] Total time: 11:20 min
[INFO] Finished at: 2018-01-05T08:00:19Z
[INFO] Final Memory: 915M/1959M
[INFO] ------------------------------------------------------------------------
[WARNING] The requested profile "hadoop-2" could not be activated because it does not exist.
[ERROR] Failed to execute goal com.webcohesion.enunciate:enunciate-maven-plugin:2.1.1:docs
(default) on project falcon-prism: Execution default of goal com.webcohesion.enunciate:enunciate-maven-plugin:2.1.1:docs
failed: com.webcohesion.enunciate.EnunciateException: freemarker.core._TemplateModelException:
An error has occurred when reading existing sub-variable "securityRoles"; see cause exception!
The type of the containing value was: extended_hash+string (com.webcohesion.enunciate.modules.jaxrs.api.impl.MethodImpl
wrapped into f.e.b.StringModel)
[ERROR] 
[ERROR] ----
[ERROR] FTL stack trace ("~" means nesting-related):
[ERROR] 	- Failed at: #assign securityRoles = method.securi...  [in template "jar:file:/home/jenkins/.m2/repository/com/webcohesion/enunciate/enunciate-docs/2.1.1/enunciate-docs-2.1.1.jar!/com/webcohesion/enunciate/modules/docs/docs.fmt"
in macro "processResourceGroup" at line 510, column 11]
[ERROR] 	~ Reached through: #nested  [in template "jar:file:/home/jenkins/.m2/repository/com/webcohesion/enunciate/enunciate-docs/2.1.1/enunciate-docs-2.1.1.jar!/com/webcohesion/enunciate/modules/docs/docs.fmt"
in macro "boilerplate" at line 119, column 9]
[ERROR] 	~ Reached through: @boilerplate title=(title + ": " + re...  [in template "jar:file:/home/jenkins/.m2/repository/com/webcohesion/enunciate/enunciate-docs/2.1.1/enunciate-docs-2.1.1.jar!/com/webcohesion/enunciate/modules/docs/docs.fmt"
in macro "processResourceGroup" at line 472, column 5]
[ERROR] 	- Reached through: @file name=(resourceGroup.slug + ".ht...  [in template "jar:file:/home/jenkins/.m2/repository/com/webcohesion/enunciate/enunciate-docs/2.1.1/enunciate-docs-2.1.1.jar!/com/webcohesion/enunciate/modules/docs/docs.fmt"
in macro "processResourceGroup" at line 471, column 3]
[ERROR] 	- Reached through: @processResourceGroup resourceGroup=r...  [in template "jar:file:/home/jenkins/.m2/repository/com/webcohesion/enunciate/enunciate-docs/2.1.1/enunciate-docs-2.1.1.jar!/com/webcohesion/enunciate/modules/docs/docs.fmt"
at line 215, column 11]
[ERROR] 	~ Reached through: #nested  [in template "jar:file:/home/jenkins/.m2/repository/com/webcohesion/enunciate/enunciate-docs/2.1.1/enunciate-docs-2.1.1.jar!/com/webcohesion/enunciate/modules/docs/docs.fmt"
in macro "boilerplate" at line 119, column 9]
[ERROR] 	~ Reached through: @boilerplate pagenav=pagenav  [in template "jar:file:/home/jenkins/.m2/repository/com/webcohesion/enunciate/enunciate-docs/2.1.1/enunciate-docs-2.1.1.jar!/com/webcohesion/enunciate/modules/docs/docs.fmt"
at line 170, column 3]
[ERROR] 	- Reached through: @file name=indexPageName  [in template "jar:file:/home/jenkins/.m2/repository/com/webcohesion/enunciate/enunciate-docs/2.1.1/enunciate-docs-2.1.1.jar!/com/webcohesion/enunciate/modules/docs/docs.fmt"
at line 159, column 1]
[ERROR] ----: InvocationTargetException: javax/annotation/security/RolesAllowed: javax.annotation.security.RolesAllowed
[ERROR] -> [Help 1]
[ERROR] 
[ERROR] To see the full stack trace of the errors, re-run Maven with the -e switch.
[ERROR] Re-run Maven using the -X switch to enable full debug logging.
[ERROR] 
[ERROR] For more information about the errors and possible solutions, please read the following
articles:
[ERROR] [Help 1] http://cwiki.apache.org/confluence/display/MAVEN/PluginExecutionException
[ERROR] 
[ERROR] After correcting the problems, you can resume the build with the command
[ERROR]   mvn <goals> -rf :falcon-prism
Build step 'Execute shell' marked build as failure
[CHECKSTYLE] Collecting checkstyle analysis files...
[CHECKSTYLE] Searching for all files in <https://builds.apache.org/job/Apache-falcon/ws/>
that match the pattern **/target/checkstyle-result.xml
[CHECKSTYLE] Parsing 33 files in <https://builds.apache.org/job/Apache-falcon/ws/>
[CHECKSTYLE] Successfully parsed file <https://builds.apache.org/job/Apache-falcon/ws/acquisition/target/checkstyle-result.xml>
with 0 unique warnings and 0 duplicates.
[CHECKSTYLE] Successfully parsed file <https://builds.apache.org/job/Apache-falcon/ws/archival/target/checkstyle-result.xml>
with 0 unique warnings and 0 duplicates.
[CHECKSTYLE] Successfully parsed file <https://builds.apache.org/job/Apache-falcon/ws/build-tools/target/checkstyle-result.xml>
with 0 unique warnings and 0 duplicates.
[CHECKSTYLE] Successfully parsed file <https://builds.apache.org/job/Apache-falcon/ws/cli/target/checkstyle-result.xml>
with 0 unique warnings and 0 duplicates.
[CHECKSTYLE] Successfully parsed file <https://builds.apache.org/job/Apache-falcon/ws/client/target/checkstyle-result.xml>
with 0 unique warnings and 0 duplicates.
[CHECKSTYLE] Successfully parsed file <https://builds.apache.org/job/Apache-falcon/ws/common-types/target/checkstyle-result.xml>
with 0 unique warnings and 0 duplicates.
[CHECKSTYLE] Successfully parsed file <https://builds.apache.org/job/Apache-falcon/ws/common/target/checkstyle-result.xml>
with 0 unique warnings and 0 duplicates.
[CHECKSTYLE] Successfully parsed file <https://builds.apache.org/job/Apache-falcon/ws/distro/target/checkstyle-result.xml>
with 0 unique warnings and 0 duplicates.
[CHECKSTYLE] Successfully parsed file <https://builds.apache.org/job/Apache-falcon/ws/docs/target/checkstyle-result.xml>
with 0 unique warnings and 0 duplicates.
[CHECKSTYLE] Successfully parsed file <https://builds.apache.org/job/Apache-falcon/ws/examples/target/checkstyle-result.xml>
with 0 unique warnings and 0 duplicates.
[CHECKSTYLE] Successfully parsed file <https://builds.apache.org/job/Apache-falcon/ws/extensions/target/checkstyle-result.xml>
with 0 unique warnings and 0 duplicates.
[CHECKSTYLE] Successfully parsed file <https://builds.apache.org/job/Apache-falcon/ws/falcon-ui/target/checkstyle-result.xml>
with 0 unique warnings and 0 duplicates.
[CHECKSTYLE] Successfully parsed file <https://builds.apache.org/job/Apache-falcon/ws/hadoop-dependencies/target/checkstyle-result.xml>
with 0 unique warnings and 0 duplicates.
[CHECKSTYLE] Successfully parsed file <https://builds.apache.org/job/Apache-falcon/ws/lifecycle/target/checkstyle-result.xml>
with 0 unique warnings and 0 duplicates.
[CHECKSTYLE] Successfully parsed file <https://builds.apache.org/job/Apache-falcon/ws/messaging/target/checkstyle-result.xml>
with 0 unique warnings and 0 duplicates.
[CHECKSTYLE] Successfully parsed file <https://builds.apache.org/job/Apache-falcon/ws/metrics/target/checkstyle-result.xml>
with 0 unique warnings and 0 duplicates.
[CHECKSTYLE] Successfully parsed file <https://builds.apache.org/job/Apache-falcon/ws/oozie-el-extensions/target/checkstyle-result.xml>
with 0 unique warnings and 0 duplicates.
[CHECKSTYLE] Successfully parsed file <https://builds.apache.org/job/Apache-falcon/ws/oozie/target/checkstyle-result.xml>
with 0 unique warnings and 0 duplicates.
[CHECKSTYLE] Successfully parsed file <https://builds.apache.org/job/Apache-falcon/ws/replication/target/checkstyle-result.xml>
with 0 unique warnings and 0 duplicates.
[CHECKSTYLE] Successfully parsed file <https://builds.apache.org/job/Apache-falcon/ws/rerun/target/checkstyle-result.xml>
with 0 unique warnings and 0 duplicates.
[CHECKSTYLE] Successfully parsed file <https://builds.apache.org/job/Apache-falcon/ws/retention/target/checkstyle-result.xml>
with 0 unique warnings and 0 duplicates.
[CHECKSTYLE] Successfully parsed file <https://builds.apache.org/job/Apache-falcon/ws/scheduler/target/checkstyle-result.xml>
with 0 unique warnings and 0 duplicates.
[CHECKSTYLE] Successfully parsed file <https://builds.apache.org/job/Apache-falcon/ws/shell/target/checkstyle-result.xml>
with 0 unique warnings and 0 duplicates.
[CHECKSTYLE] Successfully parsed file <https://builds.apache.org/job/Apache-falcon/ws/target/checkstyle-result.xml>
with 0 unique warnings and 0 duplicates.
[CHECKSTYLE] Successfully parsed file <https://builds.apache.org/job/Apache-falcon/ws/test-tools/hadoop-webapp/target/checkstyle-result.xml>
with 0 unique warnings and 0 duplicates.
[CHECKSTYLE] Successfully parsed file <https://builds.apache.org/job/Apache-falcon/ws/test-tools/hcatalog-sharelib/target/checkstyle-result.xml>
with 0 unique warnings and 0 duplicates.
[CHECKSTYLE] Successfully parsed file <https://builds.apache.org/job/Apache-falcon/ws/test-tools/hive-sharelib/target/checkstyle-result.xml>
with 0 unique warnings and 0 duplicates.
[CHECKSTYLE] Successfully parsed file <https://builds.apache.org/job/Apache-falcon/ws/test-tools/oozie-sharelib/target/checkstyle-result.xml>
with 0 unique warnings and 0 duplicates.
[CHECKSTYLE] Successfully parsed file <https://builds.apache.org/job/Apache-falcon/ws/test-tools/pig-sharelib/target/checkstyle-result.xml>
with 0 unique warnings and 0 duplicates.
[CHECKSTYLE] Successfully parsed file <https://builds.apache.org/job/Apache-falcon/ws/test-tools/target/checkstyle-result.xml>
with 0 unique warnings and 0 duplicates.
[CHECKSTYLE] Successfully parsed file <https://builds.apache.org/job/Apache-falcon/ws/test-util/target/checkstyle-result.xml>
with 0 unique warnings and 0 duplicates.
[CHECKSTYLE] Successfully parsed file <https://builds.apache.org/job/Apache-falcon/ws/unit/target/checkstyle-result.xml>
with 0 unique warnings and 0 duplicates.
[CHECKSTYLE] Successfully parsed file <https://builds.apache.org/job/Apache-falcon/ws/webapp/target/checkstyle-result.xml>
with 0 unique warnings and 0 duplicates.
Skipping warnings blame since Git is the only supported SCM up to now.%n
[CHECKSTYLE] Computing warning deltas based on reference build #1144
[FINDBUGS] Collecting findbugs analysis files...
[FINDBUGS] Searching for all files in <https://builds.apache.org/job/Apache-falcon/ws/>
that match the pattern **/target/findbugs.xml
[FINDBUGS] Parsing 21 files in <https://builds.apache.org/job/Apache-falcon/ws/>
[FINDBUGS] Successfully parsed file <https://builds.apache.org/job/Apache-falcon/ws/cli/target/findbugs.xml>
with 0 unique warnings and 0 duplicates.
[FINDBUGS] Successfully parsed file <https://builds.apache.org/job/Apache-falcon/ws/client/target/findbugs.xml>
with 0 unique warnings and 0 duplicates.
[FINDBUGS] Successfully parsed file <https://builds.apache.org/job/Apache-falcon/ws/common-types/target/findbugs.xml>
with 0 unique warnings and 0 duplicates.
[FINDBUGS] Successfully parsed file <https://builds.apache.org/job/Apache-falcon/ws/common/target/findbugs.xml>
with 0 unique warnings and 0 duplicates.
[FINDBUGS] Successfully parsed file <https://builds.apache.org/job/Apache-falcon/ws/examples/target/findbugs.xml>
with 0 unique warnings and 0 duplicates.
[FINDBUGS] Successfully parsed file <https://builds.apache.org/job/Apache-falcon/ws/extensions/target/findbugs.xml>
with 0 unique warnings and 0 duplicates.
[FINDBUGS] Successfully parsed file <https://builds.apache.org/job/Apache-falcon/ws/hadoop-dependencies/target/findbugs.xml>
with 0 unique warnings and 0 duplicates.
[FINDBUGS] Successfully parsed file <https://builds.apache.org/job/Apache-falcon/ws/lifecycle/target/findbugs.xml>
with 0 unique warnings and 0 duplicates.
[FINDBUGS] Successfully parsed file <https://builds.apache.org/job/Apache-falcon/ws/messaging/target/findbugs.xml>
with 0 unique warnings and 0 duplicates.
[FINDBUGS] Successfully parsed file <https://builds.apache.org/job/Apache-falcon/ws/metrics/target/findbugs.xml>
with 0 unique warnings and 0 duplicates.
[FINDBUGS] Successfully parsed file <https://builds.apache.org/job/Apache-falcon/ws/oozie-el-extensions/target/findbugs.xml>
with 0 unique warnings and 0 duplicates.
[FINDBUGS] Successfully parsed file <https://builds.apache.org/job/Apache-falcon/ws/oozie/target/findbugs.xml>
with 0 unique warnings and 0 duplicates.
[FINDBUGS] Successfully parsed file <https://builds.apache.org/job/Apache-falcon/ws/replication/target/findbugs.xml>
with 0 unique warnings and 0 duplicates.
[FINDBUGS] Successfully parsed file <https://builds.apache.org/job/Apache-falcon/ws/rerun/target/findbugs.xml>
with 0 unique warnings and 0 duplicates.
[FINDBUGS] Successfully parsed file <https://builds.apache.org/job/Apache-falcon/ws/retention/target/findbugs.xml>
with 0 unique warnings and 0 duplicates.
[FINDBUGS] Successfully parsed file <https://builds.apache.org/job/Apache-falcon/ws/scheduler/target/findbugs.xml>
with 0 unique warnings and 0 duplicates.
[FINDBUGS] Successfully parsed file <https://builds.apache.org/job/Apache-falcon/ws/shell/target/findbugs.xml>
with 0 unique warnings and 0 duplicates.
[FINDBUGS] Successfully parsed file <https://builds.apache.org/job/Apache-falcon/ws/test-tools/hadoop-webapp/target/findbugs.xml>
with 0 unique warnings and 0 duplicates.
[FINDBUGS] Successfully parsed file <https://builds.apache.org/job/Apache-falcon/ws/test-util/target/findbugs.xml>
with 0 unique warnings and 0 duplicates.
[FINDBUGS] Successfully parsed file <https://builds.apache.org/job/Apache-falcon/ws/unit/target/findbugs.xml>
with 0 unique warnings and 0 duplicates.
[FINDBUGS] Successfully parsed file <https://builds.apache.org/job/Apache-falcon/ws/webapp/target/findbugs.xml>
with 0 unique warnings and 0 duplicates.
Skipping warnings blame since Git is the only supported SCM up to now.%n
[FINDBUGS] Computing warning deltas based on reference build #1144
Archiving artifacts
[Fast Archiver] Compressed 11.94 MB of artifacts by 75.9% relative to #1144
Recording test results
TestNG Reports Processing: START
Looking for TestNG results report in workspace using pattern: **/target/testng-results.xml
Did not find any matching files.

Mime
View raw message