falcon-dev mailing list archives

Site index · List index
Message view « Date » · « Thread »
Top « Date » · « Thread »
From Apache Jenkins Server <jenk...@builds.apache.org>
Subject Build failed in Jenkins: Apache-falcon #1159
Date Thu, 09 Aug 2018 10:53:21 GMT
See <https://builds.apache.org/job/Apache-falcon/1159/display/redirect?page=changes>

Changes:

[pallavi-rao] FALCON-2336 StartupProperties shouldn't have specific logic to handle…

[pallavi-rao] FALCON-2338 EntityGraphTest.initConfigStore fails intermittently

[pallavi-rao] FALCON-2339 Falcon doesn't work with sql server as database

[pallavi-rao] FALCON-2340 Passing groupid to oozie while scheduling the process

[pallavi-rao] FALCON-2341 Entity SLA Alert publishing wrong results into DB

------------------------------------------
[...truncated 322.25 KB...]
[INFO] --- maven-failsafe-plugin:2.16:integration-test (integration-test) @ falcon-rerun ---
[WARNING] The parameter forkMode is deprecated since version 2.14. Use forkCount and reuseForks
instead.
[INFO] 
[INFO] --- maven-failsafe-plugin:2.16:verify (verify) @ falcon-rerun ---
[INFO] Failsafe report directory: <https://builds.apache.org/job/Apache-falcon/ws/rerun/target/failsafe-reports>
[INFO] 
[INFO] --- apache-rat-plugin:0.7:check (rat-check) @ falcon-rerun ---
[INFO] Exclude: *.txt
[INFO] Exclude: **/*.txt
[INFO] Exclude: **/*.svg
[INFO] Exclude: *.md
[INFO] Exclude: **/*.md
[INFO] Exclude: .git/**
[INFO] Exclude: **/.idea/**
[INFO] Exclude: **/*.twiki
[INFO] Exclude: **/*.iml
[INFO] Exclude: **/target/**
[INFO] Exclude: **/activemq-data/**
[INFO] Exclude: **/build/**
[INFO] Exclude: **/*.patch
[INFO] Exclude: derby.log
[INFO] Exclude: **/logs/**
[INFO] Exclude: **/.classpath
[INFO] Exclude: **/.project
[INFO] Exclude: **/.settings/**
[INFO] Exclude: **/test-output/**
[INFO] Exclude: **/data.txt
[INFO] Exclude: **/maven-eclipse.xml
[INFO] Exclude: **/.externalToolBuilders/**
[INFO] Exclude: html5-ui/**
[INFO] Exclude: **/metastore_db/**
[INFO] Exclude: **/db1.log
[INFO] Exclude: **/db1.properties
[INFO] Exclude: **/db1.script
[INFO] Exclude: **/credential_provider.jceks
[INFO] Exclude: **/*.json
[INFO] Exclude: **/falcon-cli-hist.log
[INFO] 
[INFO] --- maven-checkstyle-plugin:2.9.1:check (checkstyle-check) @ falcon-rerun ---
[INFO] Starting audit...
Audit done.

[INFO] 
[INFO] >>> findbugs-maven-plugin:3.0.3:check (findbugs-check) > :findbugs @ falcon-rerun
>>>
[INFO] 
[INFO] --- findbugs-maven-plugin:3.0.3:findbugs (findbugs) @ falcon-rerun ---
[INFO] Fork Value is true
[INFO] Done FindBugs Analysis....
[INFO] 
[INFO] <<< findbugs-maven-plugin:3.0.3:check (findbugs-check) < :findbugs @ falcon-rerun
<<<
[INFO] 
[INFO] 
[INFO] --- findbugs-maven-plugin:3.0.3:check (findbugs-check) @ falcon-rerun ---
[INFO] BugInstance size is 0
[INFO] Error size is 0
[INFO] No errors/warnings found
[INFO] 
[INFO] -------------------< org.apache.falcon:falcon-prism >-------------------
[INFO] Building Apache Falcon Prism 0.11                                [30/35]
[INFO] --------------------------------[ war ]---------------------------------
[INFO] 
[INFO] --- maven-clean-plugin:2.5:clean (default-clean) @ falcon-prism ---
[INFO] Deleting <https://builds.apache.org/job/Apache-falcon/ws/prism/target>
[INFO] 
[INFO] --- maven-enforcer-plugin:1.3.1:enforce (enforce-property) @ falcon-prism ---
[INFO] 
[INFO] --- buildnumber-maven-plugin:1.0:create (default) @ falcon-prism ---
[INFO] Checking for local modifications: skipped.
[INFO] Updating project files from SCM: skipped.
[INFO] Executing: /bin/sh -c cd <https://builds.apache.org/job/Apache-falcon/ws/prism>
&& git show
[INFO] Working directory: <https://builds.apache.org/job/Apache-falcon/ws/prism>
[INFO] Storing buildNumber: 470e5e9f5de9ba1b6149dec60e87d3a04270eda3 at timestamp: 1533811958518
[INFO] Executing: /bin/sh -c cd <https://builds.apache.org/job/Apache-falcon/ws/prism>
&& git show
[INFO] Working directory: <https://builds.apache.org/job/Apache-falcon/ws/prism>
[INFO] Storing buildScmBranch: UNKNOWN
[INFO] 
[INFO] --- enunciate-maven-plugin:2.6.0:docs (default) @ falcon-prism ---
[INFO] [ENUNCIATE] Using enunciate configuration at <https://builds.apache.org/job/Apache-falcon/ws/prism/enunciate.xml>
Downloading from cdh.repo: https://repository.cloudera.com/artifactory/cloudera-repos/org/apache/falcon/falcon-common/0.11/falcon-common-0.11-sources.jar
Downloading from cdh.repo: https://repository.cloudera.com/artifactory/cloudera-repos/org/apache/falcon/falcon-common-types/0.11/falcon-common-types-0.11-sources.jar
Downloading from cdh.repo: https://repository.cloudera.com/artifactory/cloudera-repos/org/apache/falcon/falcon-oozie-adaptor/0.11/falcon-oozie-adaptor-0.11-sources.jar
Downloading from cdh.repo: https://repository.cloudera.com/artifactory/cloudera-repos/org/apache/falcon/falcon-oozie-el-extension/0.11/falcon-oozie-el-extension-0.11-sources.jar
Downloading from cdh.repo: https://repository.cloudera.com/artifactory/cloudera-repos/org/apache/falcon/falcon-messaging/0.11/falcon-messaging-0.11-sources.jar
Downloading from cdh.repo: https://repository.cloudera.com/artifactory/cloudera-repos/org/apache/falcon/falcon-extensions/0.11/falcon-extensions-0.11-sources.jar
Downloading from cdh.repo: https://repository.cloudera.com/artifactory/cloudera-repos/org/apache/falcon/falcon-feed-lifecycle/0.11/falcon-feed-lifecycle-0.11-sources.jar
Downloading from cdh.repo: https://repository.cloudera.com/artifactory/cloudera-repos/org/apache/falcon/falcon-retention/0.11/falcon-retention-0.11-sources.jar
Downloading from cdh.repo: https://repository.cloudera.com/artifactory/cloudera-repos/org/apache/falcon/falcon-metrics/0.11/falcon-metrics-0.11-sources.jar
Downloading from cdh.repo: https://repository.cloudera.com/artifactory/cloudera-repos/org/apache/falcon/falcon-rerun/0.11/falcon-rerun-0.11-sources.jar
[INFO] Reflections took 10581 ms to scan 266 urls, producing 1298 keys and 1298 values 
[ERROR] [ENUNCIATE] 
[ERROR] [ENUNCIATE] Both Jackson 1 and Jackson 2 Enunciate modules are enabled.
[ERROR] [ENUNCIATE] This may cause duplicated and/or inconsistent JSON documentation.
[ERROR] [ENUNCIATE] It is recommended that you disable one of the modules by either
[ERROR] [ENUNCIATE] pruning your classpath of one of the versions of the Jackson
[ERROR] [ENUNCIATE] library, or by explicitly disabling one of the modules in the
[ERROR] [ENUNCIATE] Enunciate configuration file. For more information, see
[ERROR] [ENUNCIATE] https://github.com/stoicflame/enunciate/wiki/Two-JSON-Sections
[ERROR] [ENUNCIATE] 
[WARNING] [ENUNCIATE] Some source files were not found for the Java classes that define the
Web service API.
[WARNING] [ENUNCIATE] Enunciate will be unable to find the documentation for the classes that
are missing source files. (For details, rebuild with debug-level logging.)
[WARNING] [ENUNCIATE] In order for Enunciate to find the source files for API classes that
are not being compiled in the current project, the source file must be on the Enunciate sourcepath
and the class must be explicitly included in the Enunciate configuration.
[WARNING] [ENUNCIATE] For more information, see https://github.com/stoicflame/enunciate/wiki/Discovering-Source-Files
[WARNING] [ENUNCIATE] FIELD job of ExtensionJobList: The C client doesn't have a built-in
way of serializing a Map. Use @XmlJavaTypeAdapter to supply your own adapter for the Map.
[WARNING] [ENUNCIATE] Web service API makes use of elements that cannot be handled by the
C XML client. C XML client will not be generated.
[WARNING] [ENUNCIATE] FIELD instance of Instance of EntitySummaryResult: C# can't handle properties/fields
that are of the same name as their containing class. Either rename the property/field, or
use the @com.webcohesion.enunciate.metadata.ClientName annotation to rename the property/field
on the client-side.
[WARNING] [ENUNCIATE] FIELD job of ExtensionJobList: The C# client doesn't have a built-in
way of serializing a Map. Use @XmlJavaTypeAdapter to supply your own adapter for the Map.
[WARNING] [ENUNCIATE] Web service API makes use of elements that cannot be handled by the
C# XML client. C# XML client will not be generated.
[WARNING] [ENUNCIATE] FIELD job of ExtensionJobList: The Objective-C client doesn't have a
built-in way of serializing a Map. Use @XmlJavaTypeAdapter to supply your own adapter for
the Map.
[WARNING] [ENUNCIATE] Web service API makes use of elements that cannot be handled by the
Objective-C XML client. Objective-C XML client will not be generated.
[INFO] 
[INFO] --- maven-remote-resources-plugin:1.5:process (default) @ falcon-prism ---
[INFO] 
[INFO] --- keytool-maven-plugin:1.5:clean (clean-server) @ falcon-prism ---
[WARNING] Keystore file '<https://builds.apache.org/job/Apache-falcon/ws/prism/target/prism.keystore'>
doesn't exist.
[INFO] 
[INFO] --- keytool-maven-plugin:1.5:generateKeyPair (server) @ falcon-prism ---
[INFO] 
[INFO] --- maven-resources-plugin:2.7:resources (default-resources) @ falcon-prism ---
[INFO] Using 'UTF-8' encoding to copy filtered resources.
[INFO] Copying 2 resources
[INFO] Copying 1 resource
[INFO] Copying 0 resource
[INFO] Copying 2 resources to META-INF
[INFO] Copying 3 resources
[INFO] 
[INFO] --- maven-compiler-plugin:2.3.2:compile (default-compile) @ falcon-prism ---
[INFO] Compiling 53 source files to <https://builds.apache.org/job/Apache-falcon/ws/prism/target/classes>
[INFO] 
[INFO] --- aspectj-maven-plugin:1.10:compile (default) @ falcon-prism ---
Downloading from central: https://repo.maven.apache.org/maven2/org/aspectj/aspectjtools/1.8.13/aspectjtools-1.8.13.pom
Downloading from central: https://repo.maven.apache.org/maven2/org/apache/maven/maven-compat/3.0.5/maven-compat-3.0.5.pom
Downloading from central: https://repo.maven.apache.org/maven2/org/apache/maven/reporting/maven-reporting-impl/2.4/maven-reporting-impl-2.4.pom
[INFO] ------------------------------------------------------------------------
[INFO] Reactor Summary:
[INFO] 
[INFO] Apache Falcon 0.11 ................................. SUCCESS [  7.006 s]
[INFO] Apache Falcon UI ................................... SUCCESS [ 13.506 s]
[INFO] Build Tools ........................................ SUCCESS [  4.962 s]
[INFO] Apache Falcon Java common types .................... SUCCESS [ 31.497 s]
[INFO] Apache Falcon Metrics .............................. SUCCESS [ 18.096 s]
[INFO] Apache Falcon Hadoop Dependencies .................. SUCCESS [ 14.849 s]
[INFO] Apache Falcon Test Utility ......................... SUCCESS [ 13.322 s]
[INFO] Apache Falcon Commons .............................. SUCCESS [03:07 min]
[INFO] Apache Falcon extensions ........................... SUCCESS [ 54.158 s]
[INFO] Apache Falcon Java client .......................... SUCCESS [ 21.681 s]
[INFO] Apache Falcon Shell ................................ SUCCESS [ 14.907 s]
[INFO] Apache Falcon CLI client ........................... SUCCESS [ 21.141 s]
[INFO] Apache Falcon Titan 1.0 support .................... SUCCESS [  7.176 s]
[INFO] Apache Falcon Oozie EL Extension ................... SUCCESS [ 16.998 s]
[INFO] Apache Falcon Embedded Hadoop - Test Cluster ....... SUCCESS [ 38.633 s]
[INFO] Apache Falcon Sharelib Hive - Test Cluster ......... SUCCESS [  2.008 s]
[INFO] Apache Falcon Sharelib Pig - Test Cluster .......... SUCCESS [  0.966 s]
[INFO] Apache Falcon Sharelib Hcatalog - Test Cluster ..... SUCCESS [  1.122 s]
[INFO] Apache Falcon Sharelib Oozie - Test Cluster ........ SUCCESS [  0.735 s]
[INFO] Apache Falcon Test Tools - Test Cluster ............ SUCCESS [  0.589 s]
[INFO] Apache Falcon Messaging ............................ SUCCESS [ 36.353 s]
[INFO] Apache Falcon LIfecycle Module ..................... SUCCESS [ 21.591 s]
[INFO] Apache Falcon Oozie Adaptor ........................ SUCCESS [02:32 min]
[INFO] Apache Falcon Scheduler ............................ SUCCESS [01:37 min]
[INFO] Apache Falcon Acquisition .......................... SUCCESS [  1.077 s]
[INFO] Apache Falcon Distcp Replication ................... SUCCESS [ 20.598 s]
[INFO] Apache Falcon Retention ............................ SUCCESS [ 18.469 s]
[INFO] Apache Falcon Archival ............................. SUCCESS [  1.030 s]
[INFO] Apache Falcon Rerun ................................ SUCCESS [ 30.182 s]
[INFO] Apache Falcon Prism ................................ FAILURE [ 29.150 s]
[INFO] Apache Falcon Unit ................................. SKIPPED
[INFO] Apache Falcon Examples ............................. SKIPPED
[INFO] Apache Falcon Web Application ...................... SKIPPED
[INFO] Apache Falcon Documentation ........................ SKIPPED
[INFO] Apache Falcon Distro 0.11 .......................... SKIPPED
[INFO] ------------------------------------------------------------------------
[INFO] BUILD FAILURE
[INFO] ------------------------------------------------------------------------
[INFO] Total time: 14:40 min
[INFO] Finished at: 2018-08-09T10:53:07Z
[INFO] ------------------------------------------------------------------------
[WARNING] The requested profile "hadoop-2" could not be activated because it does not exist.
[ERROR] Failed to execute goal org.codehaus.mojo:aspectj-maven-plugin:1.10:compile (default)
on project falcon-prism: Execution default of goal org.codehaus.mojo:aspectj-maven-plugin:1.10:compile
failed: Plugin org.codehaus.mojo:aspectj-maven-plugin:1.10 or one of its dependencies could
not be resolved: Failed to collect dependencies at org.codehaus.mojo:aspectj-maven-plugin:jar:1.10
-> org.aspectj:aspectjtools:jar:1.8.13: Failed to read artifact descriptor for org.aspectj:aspectjtools:jar:1.8.13:
Could not transfer artifact org.aspectj:aspectjtools:pom:1.8.13 from/to central (https://repo.maven.apache.org/maven2):
Received fatal alert: protocol_version -> [Help 1]
[ERROR] 
[ERROR] To see the full stack trace of the errors, re-run Maven with the -e switch.
[ERROR] Re-run Maven using the -X switch to enable full debug logging.
[ERROR] 
[ERROR] For more information about the errors and possible solutions, please read the following
articles:
[ERROR] [Help 1] http://cwiki.apache.org/confluence/display/MAVEN/PluginResolutionException
[ERROR] 
[ERROR] After correcting the problems, you can resume the build with the command
[ERROR]   mvn <goals> -rf :falcon-prism
Build step 'Execute shell' marked build as failure
[CHECKSTYLE] Collecting checkstyle analysis files...
[CHECKSTYLE] Searching for all files in <https://builds.apache.org/job/Apache-falcon/ws/>
that match the pattern **/target/checkstyle-result.xml
[CHECKSTYLE] Parsing 28 files in <https://builds.apache.org/job/Apache-falcon/ws/>
[CHECKSTYLE] Successfully parsed file <https://builds.apache.org/job/Apache-falcon/ws/acquisition/target/checkstyle-result.xml>
with 0 unique warnings and 0 duplicates.
[CHECKSTYLE] Successfully parsed file <https://builds.apache.org/job/Apache-falcon/ws/archival/target/checkstyle-result.xml>
with 0 unique warnings and 0 duplicates.
[CHECKSTYLE] Successfully parsed file <https://builds.apache.org/job/Apache-falcon/ws/build-tools/target/checkstyle-result.xml>
with 0 unique warnings and 0 duplicates.
[CHECKSTYLE] Successfully parsed file <https://builds.apache.org/job/Apache-falcon/ws/cli/target/checkstyle-result.xml>
with 0 unique warnings and 0 duplicates.
[CHECKSTYLE] Successfully parsed file <https://builds.apache.org/job/Apache-falcon/ws/client/target/checkstyle-result.xml>
with 0 unique warnings and 0 duplicates.
[CHECKSTYLE] Successfully parsed file <https://builds.apache.org/job/Apache-falcon/ws/common-types/target/checkstyle-result.xml>
with 0 unique warnings and 0 duplicates.
[CHECKSTYLE] Successfully parsed file <https://builds.apache.org/job/Apache-falcon/ws/common/target/checkstyle-result.xml>
with 0 unique warnings and 0 duplicates.
[CHECKSTYLE] Successfully parsed file <https://builds.apache.org/job/Apache-falcon/ws/extensions/target/checkstyle-result.xml>
with 0 unique warnings and 0 duplicates.
[CHECKSTYLE] Successfully parsed file <https://builds.apache.org/job/Apache-falcon/ws/falcon-ui/target/checkstyle-result.xml>
with 0 unique warnings and 0 duplicates.
[CHECKSTYLE] Successfully parsed file <https://builds.apache.org/job/Apache-falcon/ws/hadoop-dependencies/target/checkstyle-result.xml>
with 0 unique warnings and 0 duplicates.
[CHECKSTYLE] Successfully parsed file <https://builds.apache.org/job/Apache-falcon/ws/lifecycle/target/checkstyle-result.xml>
with 0 unique warnings and 0 duplicates.
[CHECKSTYLE] Successfully parsed file <https://builds.apache.org/job/Apache-falcon/ws/messaging/target/checkstyle-result.xml>
with 0 unique warnings and 0 duplicates.
[CHECKSTYLE] Successfully parsed file <https://builds.apache.org/job/Apache-falcon/ws/metrics/target/checkstyle-result.xml>
with 0 unique warnings and 0 duplicates.
[CHECKSTYLE] Successfully parsed file <https://builds.apache.org/job/Apache-falcon/ws/oozie-el-extensions/target/checkstyle-result.xml>
with 0 unique warnings and 0 duplicates.
[CHECKSTYLE] Successfully parsed file <https://builds.apache.org/job/Apache-falcon/ws/oozie/target/checkstyle-result.xml>
with 0 unique warnings and 0 duplicates.
[CHECKSTYLE] Successfully parsed file <https://builds.apache.org/job/Apache-falcon/ws/replication/target/checkstyle-result.xml>
with 0 unique warnings and 0 duplicates.
[CHECKSTYLE] Successfully parsed file <https://builds.apache.org/job/Apache-falcon/ws/rerun/target/checkstyle-result.xml>
with 0 unique warnings and 0 duplicates.
[CHECKSTYLE] Successfully parsed file <https://builds.apache.org/job/Apache-falcon/ws/retention/target/checkstyle-result.xml>
with 0 unique warnings and 0 duplicates.
[CHECKSTYLE] Successfully parsed file <https://builds.apache.org/job/Apache-falcon/ws/scheduler/target/checkstyle-result.xml>
with 0 unique warnings and 0 duplicates.
[CHECKSTYLE] Successfully parsed file <https://builds.apache.org/job/Apache-falcon/ws/shell/target/checkstyle-result.xml>
with 0 unique warnings and 0 duplicates.
[CHECKSTYLE] Successfully parsed file <https://builds.apache.org/job/Apache-falcon/ws/target/checkstyle-result.xml>
with 0 unique warnings and 0 duplicates.
[CHECKSTYLE] Successfully parsed file <https://builds.apache.org/job/Apache-falcon/ws/test-tools/hadoop-webapp/target/checkstyle-result.xml>
with 0 unique warnings and 0 duplicates.
[CHECKSTYLE] Successfully parsed file <https://builds.apache.org/job/Apache-falcon/ws/test-tools/hcatalog-sharelib/target/checkstyle-result.xml>
with 0 unique warnings and 0 duplicates.
[CHECKSTYLE] Successfully parsed file <https://builds.apache.org/job/Apache-falcon/ws/test-tools/hive-sharelib/target/checkstyle-result.xml>
with 0 unique warnings and 0 duplicates.
[CHECKSTYLE] Successfully parsed file <https://builds.apache.org/job/Apache-falcon/ws/test-tools/oozie-sharelib/target/checkstyle-result.xml>
with 0 unique warnings and 0 duplicates.
[CHECKSTYLE] Successfully parsed file <https://builds.apache.org/job/Apache-falcon/ws/test-tools/pig-sharelib/target/checkstyle-result.xml>
with 0 unique warnings and 0 duplicates.
[CHECKSTYLE] Successfully parsed file <https://builds.apache.org/job/Apache-falcon/ws/test-tools/target/checkstyle-result.xml>
with 0 unique warnings and 0 duplicates.
[CHECKSTYLE] Successfully parsed file <https://builds.apache.org/job/Apache-falcon/ws/test-util/target/checkstyle-result.xml>
with 0 unique warnings and 0 duplicates.
Skipping warnings blame since Git is the only supported SCM up to now.%n
[CHECKSTYLE] Computing warning deltas based on reference build #1144
[FINDBUGS] Collecting findbugs analysis files...
[FINDBUGS] Searching for all files in <https://builds.apache.org/job/Apache-falcon/ws/>
that match the pattern **/target/findbugs.xml
[FINDBUGS] Parsing 18 files in <https://builds.apache.org/job/Apache-falcon/ws/>
[FINDBUGS] Successfully parsed file <https://builds.apache.org/job/Apache-falcon/ws/cli/target/findbugs.xml>
with 0 unique warnings and 0 duplicates.
[FINDBUGS] Successfully parsed file <https://builds.apache.org/job/Apache-falcon/ws/client/target/findbugs.xml>
with 0 unique warnings and 0 duplicates.
[FINDBUGS] Successfully parsed file <https://builds.apache.org/job/Apache-falcon/ws/common-types/target/findbugs.xml>
with 0 unique warnings and 0 duplicates.
[FINDBUGS] Successfully parsed file <https://builds.apache.org/job/Apache-falcon/ws/common/target/findbugs.xml>
with 0 unique warnings and 0 duplicates.
[FINDBUGS] Successfully parsed file <https://builds.apache.org/job/Apache-falcon/ws/extensions/target/findbugs.xml>
with 0 unique warnings and 0 duplicates.
[FINDBUGS] Successfully parsed file <https://builds.apache.org/job/Apache-falcon/ws/hadoop-dependencies/target/findbugs.xml>
with 0 unique warnings and 0 duplicates.
[FINDBUGS] Successfully parsed file <https://builds.apache.org/job/Apache-falcon/ws/lifecycle/target/findbugs.xml>
with 0 unique warnings and 0 duplicates.
[FINDBUGS] Successfully parsed file <https://builds.apache.org/job/Apache-falcon/ws/messaging/target/findbugs.xml>
with 0 unique warnings and 0 duplicates.
[FINDBUGS] Successfully parsed file <https://builds.apache.org/job/Apache-falcon/ws/metrics/target/findbugs.xml>
with 0 unique warnings and 0 duplicates.
[FINDBUGS] Successfully parsed file <https://builds.apache.org/job/Apache-falcon/ws/oozie-el-extensions/target/findbugs.xml>
with 0 unique warnings and 0 duplicates.
[FINDBUGS] Successfully parsed file <https://builds.apache.org/job/Apache-falcon/ws/oozie/target/findbugs.xml>
with 0 unique warnings and 0 duplicates.
[FINDBUGS] Successfully parsed file <https://builds.apache.org/job/Apache-falcon/ws/replication/target/findbugs.xml>
with 0 unique warnings and 0 duplicates.
[FINDBUGS] Successfully parsed file <https://builds.apache.org/job/Apache-falcon/ws/rerun/target/findbugs.xml>
with 0 unique warnings and 0 duplicates.
[FINDBUGS] Successfully parsed file <https://builds.apache.org/job/Apache-falcon/ws/retention/target/findbugs.xml>
with 0 unique warnings and 0 duplicates.
[FINDBUGS] Successfully parsed file <https://builds.apache.org/job/Apache-falcon/ws/scheduler/target/findbugs.xml>
with 0 unique warnings and 0 duplicates.
[FINDBUGS] Successfully parsed file <https://builds.apache.org/job/Apache-falcon/ws/shell/target/findbugs.xml>
with 0 unique warnings and 0 duplicates.
[FINDBUGS] Successfully parsed file <https://builds.apache.org/job/Apache-falcon/ws/test-tools/hadoop-webapp/target/findbugs.xml>
with 0 unique warnings and 0 duplicates.
[FINDBUGS] Successfully parsed file <https://builds.apache.org/job/Apache-falcon/ws/test-util/target/findbugs.xml>
with 0 unique warnings and 0 duplicates.
Skipping warnings blame since Git is the only supported SCM up to now.%n
[FINDBUGS] Computing warning deltas based on reference build #1144
Archiving artifacts
Recording test results
TestNG Reports Processing: START
Looking for TestNG results report in workspace using pattern: **/target/testng-results.xml
Did not find any matching files.

Mime
View raw message