flex-commits mailing list archives

Site index · List index
Message view « Date » · « Thread »
Top « Date » · « Thread »
From flex.ci.bui...@gmail.com
Subject Build failed in Jenkins: flex-asjs #478
Date Thu, 05 Mar 2015 05:19:51 GMT
See <http://apacheflexbuild.cloudapp.net:8080/job/flex-asjs/478/>

------------------------------------------
[...truncated 504 lines...]
     [java] Compiling file: <http://apacheflexbuild.cloudapp.net:8080/job/flex-asjs/ws/frameworks/js/FlexJS/libs/org/apache/flex/charts/optimized/SVGLineSegmentItemRenderer.js>
     [java] Compiling file: <http://apacheflexbuild.cloudapp.net:8080/job/flex-asjs/ws/frameworks/js/FlexJS/libs/org/apache/flex/html/beads/DateFieldView.js>
     [java] Compiling file: <http://apacheflexbuild.cloudapp.net:8080/job/flex-asjs/ws/frameworks/js/FlexJS/libs/org/apache/flex/html/beads/FormatableTextInputView.js>
     [java] Compiling file: <http://apacheflexbuild.cloudapp.net:8080/job/flex-asjs/ws/frameworks/js/FlexJS/libs/org/apache/flex/effects/Parallel.js>
     [java] Compiling file: <http://apacheflexbuild.cloudapp.net:8080/job/flex-asjs/ws/frameworks/js/FlexJS/libs/org/apache/flex/html/beads/controllers/DropMouseController.js>
     [java] Compiling file: <http://apacheflexbuild.cloudapp.net:8080/job/flex-asjs/ws/frameworks/js/FlexJS/libs/org/apache/flex/charts/StackedBarChart.js>
     [java] Compiling file: <http://apacheflexbuild.cloudapp.net:8080/job/flex-asjs/ws/frameworks/js/FlexJS/libs/org/apache/flex/html/accessories/DateFormatMMDDYYYYBead.js>
     [java] Compiling file: <http://apacheflexbuild.cloudapp.net:8080/job/flex-asjs/ws/frameworks/js/FlexJS/libs/org/apache/flex/html/beads/FormatableLabelView.js>
     [java] Compiling file: <http://apacheflexbuild.cloudapp.net:8080/job/flex-asjs/ws/frameworks/js/FlexJS/libs/org/apache/flex/charts/supportClasses/IWedgeItemRenderer.js>
     [java] Compiling file: <http://apacheflexbuild.cloudapp.net:8080/job/flex-asjs/ws/frameworks/js/FlexJS/libs/org/apache/flex/core/BindableCSSStyles.js>
     [java] Compiling file: <http://apacheflexbuild.cloudapp.net:8080/job/flex-asjs/ws/frameworks/js/FlexJS/libs/org/apache/flex/charts/optimized/SVGChartDataGroup.js>
     [java] Compiling file: <http://apacheflexbuild.cloudapp.net:8080/job/flex-asjs/ws/frameworks/js/FlexJS/libs/org/apache/flex/effects/Sequence.js>
     [java] Compiling file: <http://apacheflexbuild.cloudapp.net:8080/job/flex-asjs/ws/frameworks/js/FlexJS/libs/org/apache/flex/html/beads/controllers/DragMouseController.js>
     [java] Compiling file: <http://apacheflexbuild.cloudapp.net:8080/job/flex-asjs/ws/frameworks/js/FlexJS/libs/org/apache/flex/html/beads/DataGridView.js>
     [java] Compiling file: <http://apacheflexbuild.cloudapp.net:8080/job/flex-asjs/ws/frameworks/js/FlexJS/libs/org/apache/flex/effects/Fade.js>
     [java] Compiling file: <http://apacheflexbuild.cloudapp.net:8080/job/flex-asjs/ws/frameworks/js/FlexJS/libs/org/apache/flex/html/supportClasses/DateChooserButton.js>
     [java] Compiling file: <http://apacheflexbuild.cloudapp.net:8080/job/flex-asjs/ws/frameworks/js/FlexJS/libs/org/apache/flex/charts/supportClasses/PieSeries.js>
     [java] Compiling file: <http://apacheflexbuild.cloudapp.net:8080/job/flex-asjs/ws/frameworks/js/FlexJS/libs/org/apache/flex/effects/IEffect.js>
     [java] Compiling file: <http://apacheflexbuild.cloudapp.net:8080/job/flex-asjs/ws/frameworks/js/FlexJS/libs/org/apache/flex/html/beads/TitleBarMeasurementBead.js>
     [java] Compiling file: <http://apacheflexbuild.cloudapp.net:8080/job/flex-asjs/ws/frameworks/js/FlexJS/libs/org/apache/flex/core/IDateChooserModel.js>
     [java] Compiling file: <http://apacheflexbuild.cloudapp.net:8080/job/flex-asjs/ws/frameworks/js/FlexJS/libs/org/apache/flex/states/Transition.js>
     [java] Compiling file: <http://apacheflexbuild.cloudapp.net:8080/job/flex-asjs/ws/frameworks/js/FlexJS/libs/org/apache/flex/core/SimpleCSSStyles.js>
     [java] Compiling file: <http://apacheflexbuild.cloudapp.net:8080/job/flex-asjs/ws/frameworks/js/FlexJS/libs/org/apache/flex/html/accessories/ToolTipBead.js>
     [java] Compiling file: <http://apacheflexbuild.cloudapp.net:8080/job/flex-asjs/ws/frameworks/js/FlexJS/libs/org/apache/flex/effects/Wipe.js>
     [java] Compiling file: <http://apacheflexbuild.cloudapp.net:8080/job/flex-asjs/ws/frameworks/js/FlexJS/libs/org/apache/flex/charts/beads/layouts/ColumnChartLayout.js>
     [java] Compiling file: <http://apacheflexbuild.cloudapp.net:8080/job/flex-asjs/ws/frameworks/js/FlexJS/libs/org/apache/flex/charts/supportClasses/BarSeries.js>
     [java] Compiling file: <http://apacheflexbuild.cloudapp.net:8080/job/flex-asjs/ws/frameworks/js/FlexJS/libs/org/apache/flex/charts/beads/VerticalCategoryAxisBead.js>
     [java] Compiling file: <http://apacheflexbuild.cloudapp.net:8080/job/flex-asjs/ws/frameworks/js/FlexJS/libs/org/apache/flex/charts/BarChart.js>
     [java] Compiling file: <http://apacheflexbuild.cloudapp.net:8080/job/flex-asjs/ws/frameworks/js/FlexJS/libs/org/apache/flex/charts/StackedColumnChart.js>
     [java] Compiling file: <http://apacheflexbuild.cloudapp.net:8080/job/flex-asjs/ws/frameworks/js/FlexJS/libs/org/apache/flex/core/DropType.js>
     [java] Compiling file: <http://apacheflexbuild.cloudapp.net:8080/job/flex-asjs/ws/frameworks/js/FlexJS/libs/org/apache/flex/core/ApplicationDataBinding.js>
     [java] Compiling file: <http://apacheflexbuild.cloudapp.net:8080/job/flex-asjs/ws/frameworks/js/FlexJS/libs/org/apache/flex/effects/Resize.js>
     [java] Compiling file: <http://apacheflexbuild.cloudapp.net:8080/job/flex-asjs/ws/frameworks/js/FlexJS/libs/org/apache/flex/html/beads/models/DataGridModel.js>
     [java] Compiling file: <http://apacheflexbuild.cloudapp.net:8080/job/flex-asjs/ws/frameworks/js/FlexJS/libs/org/apache/flex/charts/ColumnChart.js>
     [java] Compiling file: <http://apacheflexbuild.cloudapp.net:8080/job/flex-asjs/ws/frameworks/js/FlexJS/libs/org/apache/flex/charts/beads/VerticalLinearAxisBead.js>
     [java] Compiling file: <http://apacheflexbuild.cloudapp.net:8080/job/flex-asjs/ws/frameworks/js/FlexJS/libs/org/apache/flex/charts/beads/layouts/ChartBaseLayout.js>
     [java] Compiling file: <http://apacheflexbuild.cloudapp.net:8080/job/flex-asjs/ws/frameworks/js/FlexJS/libs/org/apache/flex/core/ContainerDataBinding.js>
     [java] Compiling file: <http://apacheflexbuild.cloudapp.net:8080/job/flex-asjs/ws/frameworks/js/FlexJS/libs/org/apache/flex/html/beads/layouts/OneFlexibleChildVerticalLayout.js>
     [java] Compiling file: <http://apacheflexbuild.cloudapp.net:8080/job/flex-asjs/ws/frameworks/js/FlexJS/libs/org/apache/flex/html/beads/layouts/VerticalColumnLayout.js>
     [java] Compiling file: <http://apacheflexbuild.cloudapp.net:8080/job/flex-asjs/ws/frameworks/js/FlexJS/libs/org/apache/flex/charts/PieChart.js>
     [java] Compiling file: <http://apacheflexbuild.cloudapp.net:8080/job/flex-asjs/ws/frameworks/js/FlexJS/libs/org/apache/flex/core/IDataGridPresentationModel.js>
     [java] Compiling file: <http://apacheflexbuild.cloudapp.net:8080/job/flex-asjs/ws/frameworks/js/FlexJS/libs/org/apache/flex/html/beads/models/DataGridPresentationModel.js>
     [java] Compiling file: <http://apacheflexbuild.cloudapp.net:8080/job/flex-asjs/ws/frameworks/js/FlexJS/libs/org/apache/flex/charts/beads/ChartItemRendererFactory.js>
     [java] Compiling file: <http://apacheflexbuild.cloudapp.net:8080/job/flex-asjs/ws/frameworks/js/FlexJS/libs/org/apache/flex/html/supportClasses/DataGridColumn.js>
     [java] Compiling file: <http://apacheflexbuild.cloudapp.net:8080/job/flex-asjs/ws/frameworks/js/FlexJS/libs/org/apache/flex/charts/beads/layouts/LineChartLinearVsLinearLayout.js>
     [java] Compiling file: <http://apacheflexbuild.cloudapp.net:8080/job/flex-asjs/ws/frameworks/js/FlexJS/libs/org/apache/flex/charts/supportClasses/WedgeItemRenderer.js>
     [java] Compiling file: <http://apacheflexbuild.cloudapp.net:8080/job/flex-asjs/ws/frameworks/js/FlexJS/libs/org/apache/flex/charts/beads/layouts/PieChartLayout.js>
     [java] Compiling file: <http://apacheflexbuild.cloudapp.net:8080/job/flex-asjs/ws/frameworks/js/FlexJS/libs/org/apache/flex/html/beads/DataGridColumnView.js>
     [java] Compiling file: <http://apacheflexbuild.cloudapp.net:8080/job/flex-asjs/ws/frameworks/js/FlexJS/libs/org/apache/flex/html/beads/layouts/FlexibleFirstChildHorizontalLayout.js>
     [java] Picked up JAVA_TOOL_OPTIONS: -Dfile.encoding=UTF8
     [java] Compiling file: <http://apacheflexbuild.cloudapp.net:8080/job/flex-asjs/ws/frameworks/js/FlexJS/libs/org/apache/flex/html/DateChooser.js>
     [java] Compiling file: <http://apacheflexbuild.cloudapp.net:8080/job/flex-asjs/ws/frameworks/js/FlexJS/libs/org/apache/flex/html/DateField.js>
     [java] Compiling file: <http://apacheflexbuild.cloudapp.net:8080/job/flex-asjs/ws/frameworks/js/FlexJS/libs/org/apache/flex/charts/supportClasses/ColumnSeries.js>
     [java] Compiling file: <http://apacheflexbuild.cloudapp.net:8080/job/flex-asjs/ws/frameworks/js/FlexJS/libs/org/apache/flex/charts/supportClasses/LineSeries.js>
     [java] Compiling file: <http://apacheflexbuild.cloudapp.net:8080/job/flex-asjs/ws/frameworks/js/FlexJS/libs/org/apache/flex/html/accessories/CurrencyFormatter.js>
     [java] Compiling file: <http://apacheflexbuild.cloudapp.net:8080/job/flex-asjs/ws/frameworks/js/FlexJS/libs/org/apache/flex/charts/beads/DataItemRendererFactoryForSeriesData.js>

gjslint:

jshint:

compile:

main:

ide:

post-build:

main:
     [echo] ant main target completed on 03/05/2015 05:17:20 AM

sample-themes:

runtime-setup:

mustella-setup:

load-task:

basictests:
    [mxmlc] Loading configuration: <http://apacheflexbuild.cloudapp.net:8080/job/flex-asjs/ws/frameworks/flex-config.xml>
    [mxmlc] Loading configuration: <http://apacheflexbuild.cloudapp.net:8080/job/flex-asjs/ws/mustella/tests/basicTests/BasicTestsApp-config.xml>
    [mxmlc] 
    [mxmlc] 97412 bytes written to C:\Jenkins\workspace\flex-asjs\mustella\tests\basicTests\BasicTestsApp.swf
in 11.181 seconds
    [mxmlc] Picked up JAVA_TOOL_OPTIONS: -Dfile.encoding=UTF8
     [echo] launching player and swf

mustellaresultsparser:
     [java] results: PASSED

basictests-mustella:

marmotinni-setup:

prepare:
     [echo] Making lib directory <http://apacheflexbuild.cloudapp.net:8080/job/flex-asjs/ws/marmotinni/java/c>:\Jenkins\workspace\flex-asjs\marmotinni\java/lib

selenium2-jar-check:

selenium2-jar:

main:

basictests-compile-js:
     [echo] FLEX_HOME: <http://apacheflexbuild.cloudapp.net:8080/job/flex-asjs/ws/>
     [echo] FALCONJX_HOME: c:\Jenkins\workspace\flex-falcon\compiler.jx
     [echo] GOOG_HOME: C:\google\closure\Library
     [java] Compiling file: <http://apacheflexbuild.cloudapp.net:8080/job/flex-asjs/ws/mustella/tests/bin/js-debug/BasicTestsApp.js>
     [java] Compiling file: <http://apacheflexbuild.cloudapp.net:8080/job/flex-asjs/ws/mustella/tests/bin/js-debug/BasicTests.js>
     [java] Compiling file: <http://apacheflexbuild.cloudapp.net:8080/job/flex-asjs/ws/mustella/tests/bin/js-debug/shim/VBox.js>
     [java] Compiling file: <http://apacheflexbuild.cloudapp.net:8080/job/flex-asjs/ws/mustella/tests/bin/js-debug/halo/views/ButtonTests.js>
     [java] Compiling file: <http://apacheflexbuild.cloudapp.net:8080/job/flex-asjs/ws/mustella/tests/bin/js-debug/halo/views/CheckBoxTests.js>
     [java] Dependencies calculated for '<http://apacheflexbuild.cloudapp.net:8080/job/flex-asjs/ws/mustella/tests/bin/js-debug/BasicTestsApp.js'>
     [java] Dependencies calculated for '<http://apacheflexbuild.cloudapp.net:8080/job/flex-asjs/ws/mustella/tests/bin/js-debug/org/apache/flex/utils/EffectTimer.js'>
     [java] Dependencies calculated for '<http://apacheflexbuild.cloudapp.net:8080/job/flex-asjs/ws/mustella/tests/bin/js-debug/org/apache/flex/core/IEffectTimer.js'>
     [java] Dependencies calculated for '<http://apacheflexbuild.cloudapp.net:8080/job/flex-asjs/ws/mustella/tests/bin/js-debug/org/apache/flex/events/IEventDispatcher.js'>
     [java] Dependencies calculated for '<http://apacheflexbuild.cloudapp.net:8080/job/flex-asjs/ws/mustella/tests/bin/js-debug/org/apache/flex/core/ValuesManager.js'>
     [java] Dependencies calculated for '<http://apacheflexbuild.cloudapp.net:8080/job/flex-asjs/ws/mustella/tests/bin/js-debug/org/apache/flex/core/IValuesImpl.js'>
     [java] Dependencies calculated for '<http://apacheflexbuild.cloudapp.net:8080/job/flex-asjs/ws/mustella/tests/bin/js-debug/org/apache/flex/events/EventDispatcher.js'>
     [java] Dependencies calculated for '<http://apacheflexbuild.cloudapp.net:8080/job/flex-asjs/ws/mustella/tests/bin/js-debug/org/apache/flex/events/ValueEvent.js'>
     [java] Dependencies calculated for '<http://apacheflexbuild.cloudapp.net:8080/job/flex-asjs/ws/mustella/tests/bin/js-debug/org/apache/flex/core/SimpleStatesImpl.js'>
     [java] Dependencies calculated for '<http://apacheflexbuild.cloudapp.net:8080/job/flex-asjs/ws/mustella/tests/bin/js-debug/mx/states/AddItems.js'>
     [java] Dependencies calculated for '<http://apacheflexbuild.cloudapp.net:8080/job/flex-asjs/ws/mustella/tests/bin/js-debug/org/apache/flex/core/IDocument.js'>
     [java] Dependencies calculated for '<http://apacheflexbuild.cloudapp.net:8080/job/flex-asjs/ws/mustella/tests/bin/js-debug/mx/states/SetEventHandler.js'>
     [java] Dependencies calculated for '<http://apacheflexbuild.cloudapp.net:8080/job/flex-asjs/ws/mustella/tests/bin/js-debug/mx/states/SetProperty.js'>
     [java] Dependencies calculated for '<http://apacheflexbuild.cloudapp.net:8080/job/flex-asjs/ws/mustella/tests/bin/js-debug/mx/states/State.js'>
     [java] Dependencies calculated for '<http://apacheflexbuild.cloudapp.net:8080/job/flex-asjs/ws/mustella/tests/bin/js-debug/org/apache/flex/core/IBead.js'>
     [java] Dependencies calculated for '<http://apacheflexbuild.cloudapp.net:8080/job/flex-asjs/ws/mustella/tests/bin/js-debug/org/apache/flex/core/IStatesImpl.js'>
     [java] Dependencies calculated for '<http://apacheflexbuild.cloudapp.net:8080/job/flex-asjs/ws/mustella/tests/bin/js-debug/org/apache/flex/core/IStrand.js'>
     [java] Dependencies calculated for '<http://apacheflexbuild.cloudapp.net:8080/job/flex-asjs/ws/mustella/tests/bin/js-debug/org/apache/flex/core/UIBase.js'>
     [java] Dependencies calculated for '<http://apacheflexbuild.cloudapp.net:8080/job/flex-asjs/ws/mustella/tests/bin/js-debug/org/apache/flex/core/HTMLElementWrapper.js'>
     [java] Dependencies calculated for '<http://apacheflexbuild.cloudapp.net:8080/job/flex-asjs/ws/mustella/tests/bin/js-debug/org/apache/flex/core/IBeadModel.js'>
     [java] Dependencies calculated for '<http://apacheflexbuild.cloudapp.net:8080/job/flex-asjs/ws/mustella/tests/bin/js-debug/org/apache/flex/utils/Language.js'>
     [java] Dependencies calculated for '<http://apacheflexbuild.cloudapp.net:8080/job/flex-asjs/ws/mustella/tests/bin/js-debug/org/apache/flex/core/IBeadController.js'>
     [java] Dependencies calculated for '<http://apacheflexbuild.cloudapp.net:8080/job/flex-asjs/ws/mustella/tests/bin/js-debug/org/apache/flex/core/IBeadLayout.js'>
     [java] Dependencies calculated for '<http://apacheflexbuild.cloudapp.net:8080/job/flex-asjs/ws/mustella/tests/bin/js-debug/org/apache/flex/core/IBeadView.js'>
     [java] Dependencies calculated for '<http://apacheflexbuild.cloudapp.net:8080/job/flex-asjs/ws/mustella/tests/bin/js-debug/org/apache/flex/core/ILayoutChild.js'>
     [java] Dependencies calculated for '<http://apacheflexbuild.cloudapp.net:8080/job/flex-asjs/ws/mustella/tests/bin/js-debug/org/apache/flex/core/IChild.js'>
     [java] Dependencies calculated for '<http://apacheflexbuild.cloudapp.net:8080/job/flex-asjs/ws/mustella/tests/bin/js-debug/org/apache/flex/core/IParentIUIBase.js'>
     [java] Dependencies calculated for '<http://apacheflexbuild.cloudapp.net:8080/job/flex-asjs/ws/mustella/tests/bin/js-debug/org/apache/flex/core/IParent.js'>
     [java] Dependencies calculated for '<http://apacheflexbuild.cloudapp.net:8080/job/flex-asjs/ws/mustella/tests/bin/js-debug/org/apache/flex/core/IUIBase.js'>
     [java] Dependencies calculated for '<http://apacheflexbuild.cloudapp.net:8080/job/flex-asjs/ws/mustella/tests/bin/js-debug/org/apache/flex/core/IStyleableObject.js'>
     [java] Dependencies calculated for '<http://apacheflexbuild.cloudapp.net:8080/job/flex-asjs/ws/mustella/tests/bin/js-debug/org/apache/flex/events/ValueChangeEvent.js'>
     [java] Dependencies calculated for '<http://apacheflexbuild.cloudapp.net:8080/job/flex-asjs/ws/mustella/tests/bin/js-debug/org/apache/flex/html/beads/ContainerView.js'>
     [java] Dependencies calculated for '<http://apacheflexbuild.cloudapp.net:8080/job/flex-asjs/ws/mustella/tests/bin/js-debug/org/apache/flex/core/BeadViewBase.js'>
     [java] Dependencies calculated for '<http://apacheflexbuild.cloudapp.net:8080/job/flex-asjs/ws/mustella/tests/bin/js-debug/org/apache/flex/core/ILayoutParent.js'>
     [java] Dependencies calculated for '<http://apacheflexbuild.cloudapp.net:8080/job/flex-asjs/ws/mustella/tests/bin/js-debug/org/apache/flex/html/beads/layouts/NonVirtualVerticalLayout.js'>
     [java] Dependencies calculated for '<http://apacheflexbuild.cloudapp.net:8080/job/flex-asjs/ws/mustella/tests/bin/js-debug/org/apache/flex/core/Application.js'>
     [java] Dependencies calculated for '<http://apacheflexbuild.cloudapp.net:8080/job/flex-asjs/ws/mustella/tests/bin/js-debug/org/apache/flex/utils/MXMLDataInterpreter.js'>
     [java] Dependencies calculated for '<http://apacheflexbuild.cloudapp.net:8080/job/flex-asjs/ws/mustella/tests/bin/js-debug/org/apache/flex/core/SimpleCSSValuesImpl.js'>
     [java] Dependencies calculated for '<http://apacheflexbuild.cloudapp.net:8080/job/flex-asjs/ws/mustella/tests/bin/js-debug/BasicTests.js'>
     [java] Dependencies calculated for '<http://apacheflexbuild.cloudapp.net:8080/job/flex-asjs/ws/mustella/tests/bin/js-debug/org/apache/flex/core/ViewBase.js'>
     [java] Dependencies calculated for '<http://apacheflexbuild.cloudapp.net:8080/job/flex-asjs/ws/mustella/tests/bin/js-debug/org/apache/flex/core/IPopUpHost.js'>
     [java] Dependencies calculated for '<http://apacheflexbuild.cloudapp.net:8080/job/flex-asjs/ws/mustella/tests/bin/js-debug/org/apache/flex/events/Event.js'>
     [java] Dependencies calculated for '<http://apacheflexbuild.cloudapp.net:8080/job/flex-asjs/ws/mustella/tests/bin/js-debug/halo/views/ButtonTests.js'>
     [java] Dependencies calculated for '<http://apacheflexbuild.cloudapp.net:8080/job/flex-asjs/ws/mustella/tests/bin/js-debug/shim/VBox.js'>
     [java] Dependencies calculated for '<http://apacheflexbuild.cloudapp.net:8080/job/flex-asjs/ws/mustella/tests/bin/js-debug/org/apache/flex/html/Container.js'>
     [java] Dependencies calculated for '<http://apacheflexbuild.cloudapp.net:8080/job/flex-asjs/ws/mustella/tests/bin/js-debug/org/apache/flex/core/ContainerBase.js'>
     [java] Dependencies calculated for '<http://apacheflexbuild.cloudapp.net:8080/job/flex-asjs/ws/mustella/tests/bin/js-debug/org/apache/flex/core/IMXMLDocument.js'>
     [java] Dependencies calculated for '<http://apacheflexbuild.cloudapp.net:8080/job/flex-asjs/ws/mustella/tests/bin/js-debug/org/apache/flex/core/IContainer.js'>
     [java] Dependencies calculated for '<http://apacheflexbuild.cloudapp.net:8080/job/flex-asjs/ws/mustella/tests/bin/js-debug/org/apache/flex/html/TextButton.js'>
     [java] Dependencies calculated for '<http://apacheflexbuild.cloudapp.net:8080/job/flex-asjs/ws/mustella/tests/bin/js-debug/org/apache/flex/html/Button.js'>
     [java] Dependencies calculated for '<http://apacheflexbuild.cloudapp.net:8080/job/flex-asjs/ws/mustella/tests/bin/js-debug/org/apache/flex/html/Label.js'>
     [java] Dependencies calculated for '<http://apacheflexbuild.cloudapp.net:8080/job/flex-asjs/ws/mustella/tests/bin/js-debug/halo/views/CheckBoxTests.js'>
     [java] Dependencies calculated for '<http://apacheflexbuild.cloudapp.net:8080/job/flex-asjs/ws/mustella/tests/bin/js-debug/org/apache/flex/html/CheckBox.js'>
     [java] Dependencies calculated for '<http://apacheflexbuild.cloudapp.net:8080/job/flex-asjs/ws/mustella/tests/bin/js-debug/org/apache/flex/utils/MixinManager.js'>
     [java] Mar 05, 2015 5:18:28 AM com.google.javascript.jscomp.LoggerErrorManager println
     [java] WARNING: C:\Jenkins\workspace\flex-asjs\mustella\tests\bin\js-debug\org\apache\flex\core\HTMLElementWrapper.js:178:
WARNING - inconsistent return type
     [java] found   : (Node|null|undefined)
     [java] required: (Object|null)
     [java]   if (!this.event_) return this.currentTarget;
     [java]                            ^
     [java] 
     [java] Mar 05, 2015 5:18:28 AM com.google.javascript.jscomp.LoggerErrorManager printSummary
     [java] WARNING: 0 error(s), 1 warning(s), 95.1% typed
     [java] The project 'BasicTestsApp' has been successfully compiled and optimized.
     [java] Picked up JAVA_TOOL_OPTIONS: -Dfile.encoding=UTF8

basictests-compile-java:
   [delete] Deleting directory <http://apacheflexbuild.cloudapp.net:8080/job/flex-asjs/ws/mustella/java/bin>
    [mkdir] Created dir: <http://apacheflexbuild.cloudapp.net:8080/job/flex-asjs/ws/mustella/java/bin>
    [javac] <http://apacheflexbuild.cloudapp.net:8080/job/flex-asjs/ws/build.xml>:1305:
warning: 'includeantruntime' was not set, defaulting to build.sysclasspath=last; set to false
for repeatable builds
    [javac] Compiling 11 source files to <http://apacheflexbuild.cloudapp.net:8080/job/flex-asjs/ws/mustella/java/bin>

basictests-run-js:
     [echo] url=file://<http://apacheflexbuild.cloudapp.net:8080/job/flex-asjs/ws/mustella/tests/basicTests/bin/js-debug/index.html>
     [echo] script=<http://apacheflexbuild.cloudapp.net:8080/job/flex-asjs/ws/mustella/tests/basicTests/halo/scripts/ButtonTestScript.mxml>
     [echo] script=<http://apacheflexbuild.cloudapp.net:8080/job/flex-asjs/ws/mustella/tests/basicTests/halo/scripts/CheckBoxTestScript.mxml>
     [java] file://<http://apacheflexbuild.cloudapp.net:8080/job/flex-asjs/ws/mustella/tests/bin/js-debug/index.html>
     [java] Mar 05, 2015 5:19:36 AM org.openqa.selenium.os.UnixProcess$SeleniumWatchDog destroyHarder
     [java] INFO: Command failed to close cleanly. Destroying forcefully (v2). org.openqa.selenium.os.UnixProcess$SeleniumWatchDog@287f8baf
     [java] Exception in thread "main" org.openqa.selenium.WebDriverException: Failed to connect
to binary FirefoxBinary(C:\Program Files (x86)\Mozilla Firefox\firefox.exe) on port 7055;
process output follows: 
     [java] 1425532733366	addons.manager	DEBUG	Application has been upgraded
     [java] 1425532733380	addons.manager	DEBUG	Loaded provider scope for resource://gre/modules/addons/XPIProvider.jsm:
["XPIProvider"]
     [java] 1425532733383	addons.manager	DEBUG	Loaded provider scope for resource://gre/modules/LightweightThemeManager.jsm:
["LightweightThemeManager"]
     [java] 1425532733386	addons.xpi	DEBUG	startup
     [java] 1425532733387	addons.xpi	DEBUG	Skipping unavailable install location app-system-local
     [java] 1425532733387	addons.xpi	DEBUG	Skipping unavailable install location app-system-share
     [java] 1425532733389	addons.xpi	DEBUG	Ignoring file entry whose name is not a valid add-on
ID: C:\Users\APACHE~1\AppData\Local\Temp\2\anonymous705635036630029916webdriver-profile\extensions\webdriver-staging
     [java] 1425532733411	addons.xpi	DEBUG	checkForChanges
     [java] 1425532733421	addons.xpi	DEBUG	Directory state JSON differs: cache [] state [{"name":"app-global","addons":{"{972ce4c6-7e08-4474-a285-3208198ce6fd}":{"descriptor":"C:\\Program
Files (x86)\\Mozilla Firefox\\browser\\extensions\\{972ce4c6-7e08-4474-a285-3208198ce6fd}","mtime":1406058543363,"rdfTime":1406058543061}}},{"name":"app-profile","addons":{"fxdriver@googlecode.com":{"descriptor":"C:\\Users\\APACHE~1\\AppData\\Local\\Temp\\2\\anonymous705635036630029916webdriver-profile\\extensions\\fxdriver@googlecode.com","mtime":1425532725496,"rdfTime":1425532722345}}}]
     [java] 1425532733428	addons.xpi-utils	DEBUG	Opening XPI database C:\Users\APACHE~1\AppData\Local\Temp\2\anonymous705635036630029916webdriver-profile\extensions.json
     [java] 1425532733430	addons.xpi	DEBUG	New add-on fxdriver@googlecode.com installed in
app-profile
     [java] *** Blocklist::_loadBlocklistFromFile: blocklist is disabled
     [java] 1425532740007	addons.xpi-utils	DEBUG	Make addon app-profile:fxdriver@googlecode.com
visible
     [java] 1425532740010	DeferredSave.extensions.json	DEBUG	Save changes
     [java] 1425532740010	DeferredSave.extensions.json	DEBUG	Save changes
     [java] 1425532740011	addons.xpi	DEBUG	New add-on {972ce4c6-7e08-4474-a285-3208198ce6fd}
installed in app-global
     [java] 1425532740016	addons.xpi-utils	DEBUG	Make addon app-global:{972ce4c6-7e08-4474-a285-3208198ce6fd}
visible
     [java] 1425532740016	DeferredSave.extensions.json	DEBUG	Save changes
     [java] 1425532740016	DeferredSave.extensions.json	DEBUG	Save changes
     [java] 1425532740029	addons.xpi	DEBUG	Updating database with changes to installed add-ons
     [java] 1425532740029	addons.xpi-utils	DEBUG	Updating add-on states
     [java] 1425532740030	addons.xpi-utils	DEBUG	Writing add-ons list
     [java] 
     [java] Build info: version: '2.44.0', revision: '76d78cf', time: '2014-10-23 20:03:00'
     [java] System info: host: 'apacheflexbuild', ip: '100.68.172.64', os.name: 'Windows Server
2008 R2', os.arch: 'amd64', os.version: '6.1', java.version: '1.7.0_55'
     [java] Driver info: driver.version: FirefoxDriver
     [java] 	at org.openqa.selenium.firefox.internal.NewProfileExtensionConnection.start(NewProfileExtensionConnection.java:134)
     [java] 	at org.openqa.selenium.firefox.FirefoxDriver.startClient(FirefoxDriver.java:246)
     [java] 	at org.openqa.selenium.remote.RemoteWebDriver.<init>(RemoteWebDriver.java:114)
     [java] 	at org.openqa.selenium.firefox.FirefoxDriver.<init>(FirefoxDriver.java:193)
     [java] 	at org.openqa.selenium.firefox.FirefoxDriver.<init>(FirefoxDriver.java:186)
     [java] 	at org.openqa.selenium.firefox.FirefoxDriver.<init>(FirefoxDriver.java:182)
     [java] 	at org.openqa.selenium.firefox.FirefoxDriver.<init>(FirefoxDriver.java:95)
     [java] 	at marmotinni.MarmotinniRunner.main(Unknown Source)
     [java] Caused by: org.openqa.selenium.WebDriverException: java.lang.InterruptedException:
Process timed out after waiting for 45000 ms.
     [java] Build info: version: '2.44.0', revision: '76d78cf', time: '2014-10-23 20:03:00'
     [java] System info: host: 'apacheflexbuild', ip: '100.68.172.64', os.name: 'Windows Server
2008 R2', os.arch: 'amd64', os.version: '6.1', java.version: '1.7.0_55'
     [java] Driver info: driver.version: FirefoxDriver
     [java] 	at org.openqa.selenium.os.CommandLine.waitFor(CommandLine.java:131)
     [java] 	at org.openqa.selenium.firefox.FirefoxBinary.waitFor(FirefoxBinary.java:222)
     [java] 	at org.openqa.selenium.firefox.FirefoxBinary.clean(FirefoxBinary.java:242)
     [java] 	at org.openqa.selenium.firefox.internal.NewProfileExtensionConnection.start(NewProfileExtensionConnection.java:91)
     [java] 	... 7 more
     [java] Caused by: java.lang.InterruptedException: Process timed out after waiting for
45000 ms.
     [java] 	at org.openqa.selenium.os.UnixProcess.waitFor(UnixProcess.java:148)
     [java] 	at org.openqa.selenium.os.CommandLine.waitFor(CommandLine.java:129)
     [java] 	... 10 more
     [java] Picked up JAVA_TOOL_OPTIONS: -Dfile.encoding=UTF8

BUILD FAILED
<http://apacheflexbuild.cloudapp.net:8080/job/flex-asjs/ws/build.xml>:1211: Java returned:
1

Total time: 5 minutes 9 seconds
Picked up JAVA_TOOL_OPTIONS: -Dfile.encoding=UTF8
Build step 'Invoke Ant' marked build as failure
Archiving artifacts

Mime
View raw message