flink-issues mailing list archives

Site index · List index
Message view « Date » · « Thread »
Top « Date » · « Thread »
From "Chesnay Schepler (JIRA)" <j...@apache.org>
Subject [jira] [Created] (FLINK-12655) SlotCountExceedingParallelismTest failed on Travis
Date Tue, 28 May 2019 15:41:00 GMT
Chesnay Schepler created FLINK-12655:
----------------------------------------

             Summary: SlotCountExceedingParallelismTest failed on Travis
                 Key: FLINK-12655
                 URL: https://issues.apache.org/jira/browse/FLINK-12655
             Project: Flink
          Issue Type: Bug
          Components: Runtime / Coordination
    Affects Versions: 1.9.0
            Reporter: Chesnay Schepler
            Assignee: Chesnay Schepler
             Fix For: 1.9.0


https://travis-ci.org/apache/flink/jobs/538166458
{code}
akka.actor.RobustActorSystemTest
12:42:34.415 [INFO] 
12:42:34.415 [INFO] Results:
12:42:34.415 [INFO] 
12:42:34.415 [ERROR] Errors: 
12:42:34.420 [ERROR]   SlotCountExceedingParallelismTest.testNoSlotSharingAndBlockingResultBoth:91->submitJobGraphAndWait:97
» JobExecution
12:42:34.420 [ERROR]   SlotCountExceedingParallelismTest.testNoSlotSharingAndBlockingResultReceiver:84->submitJobGraphAndWait:97
» JobExecution
12:42:34.420 [ERROR]   SlotCountExceedingParallelismTest.testNoSlotSharingAndBlockingResultSender:77->submitJobGraphAndWait:97
» 
{code}



--
This message was sent by Atlassian JIRA
(v7.6.3#76005)

Mime
View raw message