flume-issues mailing list archives

Site index · List index
Message view « Date » · « Thread »
Top « Date » · « Thread »
From "Lutz Weischer (Jira)" <j...@apache.org>
Subject [jira] [Created] (FLUME-3381) mvn install -DskipTests fails on AArch64, CentOS 8, Java 1.8
Date Wed, 18 Nov 2020 11:34:00 GMT
Lutz Weischer created FLUME-3381:
------------------------------------

             Summary: mvn install -DskipTests fails on AArch64, CentOS 8, Java 1.8 
                 Key: FLUME-3381
                 URL: https://issues.apache.org/jira/browse/FLUME-3381
             Project: Flume
          Issue Type: Bug
            Reporter: Lutz Weischer


...
[INFO] Reactor Summary:
[INFO]
[INFO] Build Support ...................................... SUCCESS [  1.585 s]
[INFO] Apache Flume 1.10.0-SNAPSHOT ....................... SUCCESS [  7.822 s]
[INFO] Flume NG SDK ....................................... SUCCESS [ 29.554 s]
[INFO] Flume NG Hadoop Credential Store Config Filter ..... SUCCESS [  0.300 s]
[INFO] Flume NG Config Filters API ........................ SUCCESS [  6.039 s]
[INFO] Flume NG Configuration ............................. SUCCESS [ 14.720 s]
[INFO] Flume Auth ......................................... SUCCESS [ 14.964 s]
[INFO] Flume NG Core ...................................... SUCCESS [ 34.181 s]
[INFO] Flume NG Sinks ..................................... SUCCESS [  0.319 s]
[INFO] Flume NG HDFS Sink ................................. SUCCESS [ 19.210 s]
[INFO] Flume NG IRC Sink .................................. SUCCESS [  8.460 s]
[INFO] Flume NG Channels .................................. SUCCESS [  0.249 s]
[INFO] Flume NG JDBC channel .............................. SUCCESS [ 15.174 s]
[INFO] Flume NG file-based channel ........................ SUCCESS [ 28.811 s]
[INFO] Flume NG Spillable Memory channel .................. SUCCESS [ 10.793 s]
[INFO] Flume NG Node ...................................... SUCCESS [ 14.197 s]
[INFO] Flume NG Embedded Agent ............................ SUCCESS [ 10.641 s]
[INFO] Flume NG HBase Sink ................................ SUCCESS [ 18.219 s]
[INFO] Flume NG HBase2 Sink ............................... SUCCESS [ 17.511 s]
[INFO] Flume NG ElasticSearch Sink ........................ SUCCESS [ 13.358 s]
[INFO] Flume NG Morphline Solr Sink ....................... FAILURE [  3.744 s]
[INFO] Flume Shared Utils ................................. SKIPPED
[INFO] Flume Shared Kafka ................................. SKIPPED
[INFO] Flume Shared Kafka Test Utils ...................... SKIPPED
[INFO] Flume Kafka Sink ................................... SKIPPED
[INFO] Flume Kudu Sink .................................... SKIPPED
[INFO] Flume HTTP/S Sink .................................. SKIPPED
[INFO] Flume NG Kite Dataset Sink ......................... SKIPPED
[INFO] Flume NG Hive Sink ................................. SKIPPED
[INFO] Flume Sources ...................................... SKIPPED
[INFO] Flume Scribe Source ................................ SKIPPED
[INFO] Flume JMS Source ................................... SKIPPED
[INFO] Flume Twitter Source ............................... SKIPPED
[INFO] Flume Kafka Source ................................. SKIPPED
[INFO] Flume Taildir Source ............................... SKIPPED
[INFO] flume-kafka-channel ................................ SKIPPED
[INFO] Flume legacy Sources ............................... SKIPPED
[INFO] Flume legacy Avro source ........................... SKIPPED
[INFO] Flume legacy Thrift Source ......................... SKIPPED
[INFO] Flume NG Environment Variable Config Filter ........ SKIPPED
[INFO] flume-ng-hadoop-credential-store-config-filter ..... SKIPPED
[INFO] Flume NG External Process Config Filter ............ SKIPPED
[INFO] Flume NG Clients ................................... SKIPPED
[INFO] Flume NG Log4j Appender ............................ SKIPPED
[INFO] Flume NG Tools ..................................... SKIPPED
[INFO] Flume NG distribution .............................. SKIPPED
[INFO] Flume NG Integration Tests 1.10.0-SNAPSHOT ......... SKIPPED
[INFO] ------------------------------------------------------------------------
[INFO] BUILD FAILURE
[INFO] ------------------------------------------------------------------------
[INFO] Total time: 04:31 min
[INFO] Finished at: 2020-11-18T12:33:29+01:00
[INFO] ------------------------------------------------------------------------
[ERROR] Failed to execute goal org.apache.maven.plugins:maven-remote-resources-plugin:1.5:process
(process-resource-bundles) on project flume-ng-morphline-solr-sink: Execution process-resource-bundles
of goal org.apache.maven.plugins:maven-remote-resources-plugin:1.5:process failed: For artifact
{rome:null:null:jar}: The artifactId cannot be empty. -> [Help 1]
[ERROR]
[ERROR] To see the full stack trace of the errors, re-run Maven with the -e switch.
[ERROR] Re-run Maven using the -X switch to enable full debug logging.
[ERROR]
[ERROR] For more information about the errors and possible solutions, please read the following
articles:
[ERROR] [Help 1] http://cwiki.apache.org/confluence/display/MAVEN/PluginExecutionException
[ERROR]
[ERROR] After correcting the problems, you can resume the build with the command
[ERROR]   mvn <goals> -rf :flume-ng-morphline-solr-sink



--
This message was sent by Atlassian Jira
(v8.3.4#803005)

---------------------------------------------------------------------
To unsubscribe, e-mail: issues-unsubscribe@flume.apache.org
For additional commands, e-mail: issues-help@flume.apache.org


Mime
View raw message