fluo-notifications mailing list archives

Site index · List index
Message view « Date » · « Thread »
Top « Date » · « Thread »
From Apache Jenkins Server <jenk...@builds.apache.org>
Subject Build failed in Jenkins: Fluo #2
Date Fri, 22 Jul 2016 10:32:26 GMT
See <https://builds.apache.org/job/Fluo/2/>

------------------------------------------
Started by timer
[EnvInject] - Loading node environment variables.
Building remotely on ubuntu3 (Ubuntu ubuntu legacy-ubuntu) in workspace <https://builds.apache.org/job/Fluo/ws/>
Cloning the remote Git repository
Cloning repository https://git-wip-us.apache.org/repos/asf/incubator-fluo.git
 > git init <https://builds.apache.org/job/Fluo/ws/> # timeout=10
Fetching upstream changes from https://git-wip-us.apache.org/repos/asf/incubator-fluo.git
 > git --version # timeout=10
 > git -c core.askpass=true fetch --tags --progress https://git-wip-us.apache.org/repos/asf/incubator-fluo.git
+refs/heads/*:refs/remotes/origin/*
 > git config remote.origin.url https://git-wip-us.apache.org/repos/asf/incubator-fluo.git
# timeout=10
 > git config --add remote.origin.fetch +refs/heads/*:refs/remotes/origin/* # timeout=10
 > git config remote.origin.url https://git-wip-us.apache.org/repos/asf/incubator-fluo.git
# timeout=10
Fetching upstream changes from https://git-wip-us.apache.org/repos/asf/incubator-fluo.git
 > git -c core.askpass=true fetch --tags --progress https://git-wip-us.apache.org/repos/asf/incubator-fluo.git
+refs/heads/*:refs/remotes/origin/*
 > git rev-parse refs/remotes/origin/master^{commit} # timeout=10
 > git rev-parse refs/remotes/origin/origin/master^{commit} # timeout=10
Checking out Revision 8944203df03c3ec35edb1784a47f3b49091a051a (refs/remotes/origin/master)
 > git config core.sparsecheckout # timeout=10
 > git checkout -f 8944203df03c3ec35edb1784a47f3b49091a051a
 > git rev-list 8944203df03c3ec35edb1784a47f3b49091a051a # timeout=10
Parsing POMs
Downloaded artifact http://repo.maven.apache.org/maven2/io/fluo/fluo-io-parent/2/fluo-io-parent-2.pom
Discovered a new module org.apache.fluo:fluo-parent Fluo Parent
Discovered a new module org.apache.fluo:fluo-accumulo Fluo Accumulo Extensions
Discovered a new module org.apache.fluo:fluo-api Fluo API
Discovered a new module org.apache.fluo:fluo-cluster Fluo Cluster
Discovered a new module org.apache.fluo:fluo-core Fluo Core
Discovered a new module org.apache.fluo:fluo-distribution Fluo Distribution
Discovered a new module org.apache.fluo:fluo-integration Fluo Integration
Discovered a new module org.apache.fluo:fluo-mapreduce Fluo MapReduce
Discovered a new module org.apache.fluo:fluo-mini Fluo Mini
Modules changed, recalculating dependency graph
Established TCP socket on 43189
maven32-agent.jar already up to date
maven32-interceptor.jar already up to date
maven3-interceptor-commons.jar already up to date
[Fluo] $ /home/jenkins/jenkins-slave/tools/hudson.model.JDK/jdk1.8.0_66/bin/java -Xmx2g -Xms256m
-XX:MaxPermSize=512m -cp /home/jenkins/jenkins-slave/maven32-agent.jar:/home/jenkins/tools/maven/latest3/boot/plexus-classworlds-2.5.1.jar:/home/jenkins/tools/maven/latest3/conf/logging
jenkins.maven3.agent.Maven32Main /home/jenkins/tools/maven/latest3/ /x1/jenkins/jenkins-slave/slave.jar
/home/jenkins/jenkins-slave/maven32-interceptor.jar /home/jenkins/jenkins-slave/maven3-interceptor-commons.jar
43189
Java HotSpot(TM) 64-Bit Server VM warning: ignoring option MaxPermSize=512m; support was removed
in 8.0
<===[JENKINS REMOTING CAPACITY]===>   channel started
Executing Maven:  -B -f <https://builds.apache.org/job/Fluo/ws/pom.xml> -Dmaven.repo.local=/home/jenkins/jenkins-slave/maven-repositories/0
deploy
[INFO] Scanning for projects...
[INFO] ------------------------------------------------------------------------
[INFO] Reactor Build Order:
[INFO] 
[INFO] Fluo Parent
[INFO] Fluo API
[INFO] Fluo Accumulo Extensions
[INFO] Fluo Core
[INFO] Fluo Cluster
[INFO] Fluo Mini
[INFO] Fluo Integration
[INFO] Fluo MapReduce
[INFO] Fluo Distribution
[INFO] 
[INFO] Using the builder org.apache.maven.lifecycle.internal.builder.singlethreaded.SingleThreadedBuilder
with a thread count of 1
[INFO]                                                                         
[INFO] ------------------------------------------------------------------------
[INFO] Building Fluo Parent 1.0.0-incubating-SNAPSHOT
[INFO] ------------------------------------------------------------------------
[INFO] Downloading: http://repo.maven.apache.org/maven2/net/revelc/code/formatter-maven-plugin/0.5.2/formatter-maven-plugin-0.5.2.pom
[INFO] Downloaded: http://repo.maven.apache.org/maven2/net/revelc/code/formatter-maven-plugin/0.5.2/formatter-maven-plugin-0.5.2.pom
(22 KB at 55.3 KB/sec)
[INFO] Downloading: http://repo.maven.apache.org/maven2/net/revelc/code/formatter-maven-plugin/0.5.2/formatter-maven-plugin-0.5.2.jar
[INFO] Downloaded: http://repo.maven.apache.org/maven2/net/revelc/code/formatter-maven-plugin/0.5.2/formatter-maven-plugin-0.5.2.jar
(29 KB at 302.2 KB/sec)
[INFO] 
[INFO] --- maven-enforcer-plugin:1.4.1:enforce (enforce-maven) @ fluo-parent ---
[INFO] 
[INFO] --- apache-rat-plugin:0.11:check (check-licenses) @ fluo-parent ---
[INFO] 59 implicit excludes (use -debug for more details).
[INFO] Exclude: /.travis.yml
[INFO] Exclude: **/services/org.apache.fluo.core.metrics.ReporterStarter
[INFO] Exclude: README.md
[INFO] Exclude: docs/**.md
[INFO] Exclude: contrib/grafana/**.json
[INFO] 19 resources included (use -debug for more details)
[INFO] Rat check: Summary of files. Unapproved: 0 unknown: 0 generated: 0 approved: 12 licence.
[INFO] 
[INFO] --- sortpom-maven-plugin:2.4.0:sort (sort-pom) @ fluo-parent ---
[INFO] Sorting file <https://builds.apache.org/job/Fluo/ws/pom.xml>
[INFO] Pom file is already sorted, exiting
[INFO] 
[INFO] --- formatter-maven-plugin:0.5.2:format (format-source) @ fluo-parent ---
[INFO] Downloading: http://repo.maven.apache.org/maven2/io/fluo/resources/1.0.1/resources-1.0.1.pom
[INFO] Downloaded: http://repo.maven.apache.org/maven2/io/fluo/resources/1.0.1/resources-1.0.1.pom
(24 KB at 97.1 KB/sec)
[INFO] Downloading: http://repo.maven.apache.org/maven2/io/fluo/resources/1.0.1/resources-1.0.1.jar
[INFO] Downloaded: http://repo.maven.apache.org/maven2/io/fluo/resources/1.0.1/resources-1.0.1.jar
(12 KB at 29.7 KB/sec)
[INFO] Using 'UTF-8' encoding to format source files.
[INFO] Number of files to be formatted: 0
[INFO] 
[INFO] --- sortpom-maven-plugin:2.4.0:verify (verify-pom) @ fluo-parent ---
[INFO] Verifying file <https://builds.apache.org/job/Fluo/ws/pom.xml>
[INFO] 
[INFO] --- modernizer-maven-plugin:1.4.0:modernizer (modernizer) @ fluo-parent ---
[INFO] 
[INFO] --- maven-failsafe-plugin:2.19.1:integration-test (run-integration-tests) @ fluo-parent
---
[INFO] No tests to run.
[JENKINS] Recording test results
[INFO] 
[INFO] --- maven-checkstyle-plugin:2.17:check (check-style) @ fluo-parent ---
[INFO] Downloading: http://repo.maven.apache.org/maven2/com/puppycrawl/tools/checkstyle/6.15/checkstyle-6.15.pom
[INFO] Downloaded: http://repo.maven.apache.org/maven2/com/puppycrawl/tools/checkstyle/6.15/checkstyle-6.15.pom
(68 KB at 551.5 KB/sec)
[INFO] Downloading: http://repo.maven.apache.org/maven2/com/puppycrawl/tools/checkstyle/6.15/checkstyle-6.15.jar
[INFO] Downloaded: http://repo.maven.apache.org/maven2/com/puppycrawl/tools/checkstyle/6.15/checkstyle-6.15.jar
(1100 KB at 2477.4 KB/sec)
[INFO] 
[INFO] --- maven-checkstyle-plugin:2.17:check (accumulo-api-check) @ fluo-parent ---
[INFO] 
[INFO] --- maven-failsafe-plugin:2.19.1:verify (run-integration-tests) @ fluo-parent ---
[JENKINS] Recording test results
[INFO] 
[INFO] >>> findbugs-maven-plugin:3.0.3:check (find-bugs) @ fluo-parent >>>
[INFO] 
[INFO] --- findbugs-maven-plugin:3.0.3:findbugs (findbugs) @ fluo-parent ---
[INFO] 
[INFO] <<< findbugs-maven-plugin:3.0.3:check (find-bugs) @ fluo-parent <<<
[INFO] 
[INFO] --- findbugs-maven-plugin:3.0.3:check (find-bugs) @ fluo-parent ---
[INFO] 
[INFO] --- maven-dependency-plugin:2.10:analyze-only (analyze) @ fluo-parent ---
[INFO] Skipping pom project
[INFO] 
[INFO] --- maven-install-plugin:2.5.2:install (default-install) @ fluo-parent ---
[INFO] Installing <https://builds.apache.org/job/Fluo/ws/pom.xml> to /home/jenkins/jenkins-slave/maven-repositories/0/org/apache/fluo/fluo-parent/1.0.0-incubating-SNAPSHOT/fluo-parent-1.0.0-incubating-SNAPSHOT.pom
[INFO] 
[INFO] --- maven-deploy-plugin:2.8.2:deploy (default-deploy) @ fluo-parent ---
[INFO] Downloading: https://oss.sonatype.org/content/repositories/snapshots/org/apache/fluo/fluo-parent/1.0.0-incubating-SNAPSHOT/maven-metadata.xml
[INFO] Uploading: https://oss.sonatype.org/content/repositories/snapshots/org/apache/fluo/fluo-parent/1.0.0-incubating-SNAPSHOT/fluo-parent-1.0.0-incubating-20160722.103229-1.pom
[INFO] ------------------------------------------------------------------------
[INFO] Reactor Summary:
[INFO] 
[INFO] Fluo Parent ....................................... FAILURE [ 21.883 s]
[INFO] Fluo API .......................................... SKIPPED
[INFO] Fluo Accumulo Extensions .......................... SKIPPED
[INFO] Fluo Core ......................................... SKIPPED
[INFO] Fluo Cluster ...................................... SKIPPED
[INFO] Fluo Mini ......................................... SKIPPED
[INFO] Fluo Integration .................................. SKIPPED
[INFO] Fluo MapReduce .................................... SKIPPED
[INFO] Fluo Distribution ................................. SKIPPED
[INFO] ------------------------------------------------------------------------
[INFO] BUILD FAILURE
[INFO] ------------------------------------------------------------------------
[INFO] Total time: 23.341 s
[INFO] Finished at: 2016-07-22T10:32:31+00:00
[INFO] Final Memory: 37M/475M
[INFO] ------------------------------------------------------------------------
[ERROR] Failed to execute goal org.apache.maven.plugins:maven-deploy-plugin:2.8.2:deploy (default-deploy)
on project fluo-parent: Failed to deploy artifacts: Could not transfer artifact org.apache.fluo:fluo-parent:pom:1.0.0-incubating-20160722.103229-1
from/to sonatype-nexus-snapshots (https://oss.sonatype.org/content/repositories/snapshots/):
Failed to transfer file: https://oss.sonatype.org/content/repositories/snapshots/org/apache/fluo/fluo-parent/1.0.0-incubating-SNAPSHOT/fluo-parent-1.0.0-incubating-20160722.103229-1.pom.
Return code is: 401, ReasonPhrase: Unauthorized. -> [Help 1]
[ERROR] 
[ERROR] To see the full stack trace of the errors, re-run Maven with the -e switch.
[ERROR] Re-run Maven using the -X switch to enable full debug logging.
[ERROR] 
[ERROR] For more information about the errors and possible solutions, please read the following
articles:
[ERROR] [Help 1] http://cwiki.apache.org/confluence/display/MAVEN/MojoExecutionException
[JENKINS] Archiving <https://builds.apache.org/job/Fluo/ws/modules/accumulo/pom.xml>
to org.apache.fluo/fluo-accumulo/1.0.0-incubating-SNAPSHOT/fluo-accumulo-1.0.0-incubating-SNAPSHOT.pom
No prior successful build to compare, so performing full copy of artifacts
[JENKINS] Archiving <https://builds.apache.org/job/Fluo/ws/modules/mini/pom.xml> to
org.apache.fluo/fluo-mini/1.0.0-incubating-SNAPSHOT/fluo-mini-1.0.0-incubating-SNAPSHOT.pom
No prior successful build to compare, so performing full copy of artifacts
[JENKINS] Archiving <https://builds.apache.org/job/Fluo/ws/modules/api/pom.xml> to org.apache.fluo/fluo-api/1.0.0-incubating-SNAPSHOT/fluo-api-1.0.0-incubating-SNAPSHOT.pom
No prior successful build to compare, so performing full copy of artifacts
[JENKINS] Archiving <https://builds.apache.org/job/Fluo/ws/modules/mapreduce/pom.xml>
to org.apache.fluo/fluo-mapreduce/1.0.0-incubating-SNAPSHOT/fluo-mapreduce-1.0.0-incubating-SNAPSHOT.pom
No prior successful build to compare, so performing full copy of artifacts
[JENKINS] Archiving <https://builds.apache.org/job/Fluo/ws/modules/distribution/pom.xml>
to org.apache.fluo/fluo-distribution/1.0.0-incubating-SNAPSHOT/fluo-distribution-1.0.0-incubating-SNAPSHOT.pom
No prior successful build to compare, so performing full copy of artifacts
[JENKINS] Archiving <https://builds.apache.org/job/Fluo/ws/modules/integration/pom.xml>
to org.apache.fluo/fluo-integration/1.0.0-incubating-SNAPSHOT/fluo-integration-1.0.0-incubating-SNAPSHOT.pom
No prior successful build to compare, so performing full copy of artifacts
[JENKINS] Archiving <https://builds.apache.org/job/Fluo/ws/modules/core/pom.xml> to
org.apache.fluo/fluo-core/1.0.0-incubating-SNAPSHOT/fluo-core-1.0.0-incubating-SNAPSHOT.pom
No prior successful build to compare, so performing full copy of artifacts
[JENKINS] Archiving <https://builds.apache.org/job/Fluo/ws/pom.xml> to org.apache.fluo/fluo-parent/1.0.0-incubating-SNAPSHOT/fluo-parent-1.0.0-incubating-SNAPSHOT.pom
No prior successful build to compare, so performing full copy of artifacts
[JENKINS] Archiving <https://builds.apache.org/job/Fluo/ws/modules/cluster/pom.xml>
to org.apache.fluo/fluo-cluster/1.0.0-incubating-SNAPSHOT/fluo-cluster-1.0.0-incubating-SNAPSHOT.pom
No prior successful build to compare, so performing full copy of artifacts
channel stopped

Mime
View raw message