fluo-notifications mailing list archives

Site index · List index
Message view « Date » · « Thread »
Top « Date » · « Thread »
From Apache Jenkins Server <jenk...@builds.apache.org>
Subject Build failed in Jenkins: Fluo #93
Date Sat, 15 Oct 2016 10:47:23 GMT
See <https://builds.apache.org/job/Fluo/93/>

------------------------------------------
[...truncated 627 lines...]
[INFO] Rat check: Summary of files. Unapproved: 0 unknown: 0 generated: 0 approved: 2 licence.
[INFO] 
[INFO] --- sortpom-maven-plugin:2.5.0:sort (sort-pom) @ fluo-mini ---
[INFO] Sorting file <https://builds.apache.org/job/Fluo/ws/modules/mini/pom.xml>
[INFO] Pom file is already sorted, exiting
[INFO] 
[INFO] --- formatter-maven-plugin:0.5.2:format (format-source) @ fluo-mini ---
[INFO] Using 'UTF-8' encoding to format source files.
[INFO] Number of files to be formatted: 1
[INFO] Successfully formatted: 0 file(s)
[INFO] Fail to format        : 0 file(s)
[INFO] Skipped               : 1 file(s)
[INFO] Approximate time taken: 0s
[INFO] 
[INFO] --- maven-remote-resources-plugin:1.5:process (process-resource-bundles) @ fluo-mini
---
[INFO] 
[INFO] --- maven-resources-plugin:2.7:resources (default-resources) @ fluo-mini ---
[INFO] Using 'UTF-8' encoding to copy filtered resources.
[INFO] skip non existing resourceDirectory <https://builds.apache.org/job/Fluo/ws/modules/mini/src/main/resources>
[INFO] Copying 3 resources
[INFO] 
[INFO] --- sortpom-maven-plugin:2.5.0:verify (verify-pom) @ fluo-mini ---
[INFO] Verifying file <https://builds.apache.org/job/Fluo/ws/modules/mini/pom.xml>
[INFO] 
[INFO] --- maven-compiler-plugin:3.5.1:compile (default-compile) @ fluo-mini ---
[INFO] Nothing to compile - all classes are up to date
[INFO] 
[INFO] --- maven-resources-plugin:2.7:testResources (default-testResources) @ fluo-mini ---
[INFO] Using 'UTF-8' encoding to copy filtered resources.
[INFO] skip non existing resourceDirectory <https://builds.apache.org/job/Fluo/ws/modules/mini/src/test/resources>
[INFO] Copying 3 resources
[INFO] 
[INFO] --- maven-compiler-plugin:3.5.1:testCompile (default-testCompile) @ fluo-mini ---
[INFO] No sources to compile
[INFO] 
[INFO] --- modernizer-maven-plugin:1.4.0:modernizer (modernizer) @ fluo-mini ---
[INFO] 
[INFO] --- maven-surefire-plugin:2.19.1:test (default-test) @ fluo-mini ---
[JENKINS] Recording test results
[INFO] 
[INFO] --- maven-jar-plugin:3.0.0:jar (default-jar) @ fluo-mini ---
[INFO] Building jar: <https://builds.apache.org/job/Fluo/ws/modules/mini/target/fluo-mini-1.1.0-incubating-SNAPSHOT.jar>
[INFO] 
[INFO] --- maven-site-plugin:3.5.1:attach-descriptor (attach-descriptor) @ fluo-mini ---
[INFO] 
[INFO] --- maven-failsafe-plugin:2.19.1:integration-test (run-integration-tests) @ fluo-mini
---
[JENKINS] Recording test results
[INFO] 
[INFO] --- maven-checkstyle-plugin:2.17:check (check-style) @ fluo-mini ---
[INFO] 
[INFO] --- maven-checkstyle-plugin:2.17:check (accumulo-api-check) @ fluo-mini ---
[INFO] 
[INFO] --- maven-failsafe-plugin:2.19.1:verify (run-integration-tests) @ fluo-mini ---
[INFO] 
[INFO] >>> findbugs-maven-plugin:3.0.3:check (find-bugs) > :findbugs @ fluo-mini
>>>
[JENKINS] Recording test results[INFO] 

[INFO] --- findbugs-maven-plugin:3.0.3:findbugs (findbugs) @ fluo-mini ---
[INFO] Fork Value is true
[INFO] Done FindBugs Analysis....
[INFO] 
[INFO] <<< findbugs-maven-plugin:3.0.3:check (find-bugs) < :findbugs @ fluo-mini
<<<
[INFO] 
[INFO] --- findbugs-maven-plugin:3.0.3:check (find-bugs) @ fluo-mini ---
[INFO] BugInstance size is 0
[INFO] Error size is 0
[INFO] No errors/warnings found
[INFO] 
[INFO] --- maven-dependency-plugin:2.10:analyze-only (analyze) @ fluo-mini ---
[INFO] No dependency problems found
[INFO] 
[INFO] --- maven-install-plugin:2.5.2:install (default-install) @ fluo-mini ---
[INFO] Installing <https://builds.apache.org/job/Fluo/ws/modules/mini/target/fluo-mini-1.1.0-incubating-SNAPSHOT.jar>
to /home/jenkins/jenkins-slave/maven-repositories/0/org/apache/fluo/fluo-mini/1.1.0-incubating-SNAPSHOT/fluo-mini-1.1.0-incubating-SNAPSHOT.jar
[INFO] Installing <https://builds.apache.org/job/Fluo/ws/modules/mini/pom.xml> to /home/jenkins/jenkins-slave/maven-repositories/0/org/apache/fluo/fluo-mini/1.1.0-incubating-SNAPSHOT/fluo-mini-1.1.0-incubating-SNAPSHOT.pom
[INFO] 
[INFO] --- maven-deploy-plugin:2.8.2:deploy (default-deploy) @ fluo-mini ---
[INFO] Downloading: https://repository.apache.org/content/repositories/snapshots/org/apache/fluo/fluo-mini/1.1.0-incubating-SNAPSHOT/maven-metadata.xml
[INFO] Downloaded: https://repository.apache.org/content/repositories/snapshots/org/apache/fluo/fluo-mini/1.1.0-incubating-SNAPSHOT/maven-metadata.xml
(807 B at 1.5 KB/sec)
[INFO] Uploading: https://repository.apache.org/content/repositories/snapshots/org/apache/fluo/fluo-mini/1.1.0-incubating-SNAPSHOT/fluo-mini-1.1.0-incubating-20161015.104158-9.jar
[INFO] Uploaded: https://repository.apache.org/content/repositories/snapshots/org/apache/fluo/fluo-mini/1.1.0-incubating-SNAPSHOT/fluo-mini-1.1.0-incubating-20161015.104158-9.jar
(15 KB at 16.0 KB/sec)
[INFO] Uploading: https://repository.apache.org/content/repositories/snapshots/org/apache/fluo/fluo-mini/1.1.0-incubating-SNAPSHOT/fluo-mini-1.1.0-incubating-20161015.104158-9.pom
[INFO] Uploaded: https://repository.apache.org/content/repositories/snapshots/org/apache/fluo/fluo-mini/1.1.0-incubating-SNAPSHOT/fluo-mini-1.1.0-incubating-20161015.104158-9.pom
(3 KB at 3.0 KB/sec)
[INFO] Downloading: https://repository.apache.org/content/repositories/snapshots/org/apache/fluo/fluo-mini/maven-metadata.xml
[INFO] Downloaded: https://repository.apache.org/content/repositories/snapshots/org/apache/fluo/fluo-mini/maven-metadata.xml
(366 B at 0.6 KB/sec)
[INFO] Uploading: https://repository.apache.org/content/repositories/snapshots/org/apache/fluo/fluo-mini/1.1.0-incubating-SNAPSHOT/maven-metadata.xml
[INFO] Uploaded: https://repository.apache.org/content/repositories/snapshots/org/apache/fluo/fluo-mini/1.1.0-incubating-SNAPSHOT/maven-metadata.xml
(807 B at 1.0 KB/sec)
[INFO] Uploading: https://repository.apache.org/content/repositories/snapshots/org/apache/fluo/fluo-mini/maven-metadata.xml
[INFO] Uploaded: https://repository.apache.org/content/repositories/snapshots/org/apache/fluo/fluo-mini/maven-metadata.xml
(366 B at 0.4 KB/sec)
[INFO]                                                                         
[INFO] ------------------------------------------------------------------------
[INFO] Building Fluo Integration 1.1.0-incubating-SNAPSHOT
[INFO] ------------------------------------------------------------------------
[INFO] 
[INFO] --- mavanagaiata:0.7.2:commit (git-commit) @ fluo-integration ---
[INFO] 
[INFO] --- maven-enforcer-plugin:1.4.1:enforce (enforce-rules) @ fluo-integration ---
[INFO] 
[INFO] --- apache-rat-plugin:0.11:check (check-licenses) @ fluo-integration ---
[INFO] 51 implicit excludes (use -debug for more details).
[INFO] Exclude: DEPENDENCIES
[INFO] Exclude: /.travis.yml
[INFO] Exclude: **/services/org.apache.fluo.core.metrics.ReporterStarter
[INFO] Exclude: contrib/grafana/**.json
[INFO] 34 resources included (use -debug for more details)
[INFO] Rat check: Summary of files. Unapproved: 0 unknown: 0 generated: 0 approved: 34 licence.
[INFO] 
[INFO] --- sortpom-maven-plugin:2.5.0:sort (sort-pom) @ fluo-integration ---
[INFO] Sorting file <https://builds.apache.org/job/Fluo/ws/modules/integration/pom.xml>
[INFO] Pom file is already sorted, exiting
[INFO] 
[INFO] --- formatter-maven-plugin:0.5.2:format (format-source) @ fluo-integration ---
[INFO] Using 'UTF-8' encoding to format source files.
[INFO] Number of files to be formatted: 32
[INFO] Successfully formatted: 0 file(s)
[INFO] Fail to format        : 0 file(s)
[INFO] Skipped               : 32 file(s)
[INFO] Approximate time taken: 0s
[INFO] 
[INFO] --- maven-remote-resources-plugin:1.5:process (process-resource-bundles) @ fluo-integration
---
[INFO] 
[INFO] --- maven-resources-plugin:2.7:resources (default-resources) @ fluo-integration ---
[INFO] Using 'UTF-8' encoding to copy filtered resources.
[INFO] skip non existing resourceDirectory <https://builds.apache.org/job/Fluo/ws/modules/integration/src/main/resources>
[INFO] Copying 3 resources
[INFO] 
[INFO] --- sortpom-maven-plugin:2.5.0:verify (verify-pom) @ fluo-integration ---
[INFO] Verifying file <https://builds.apache.org/job/Fluo/ws/modules/integration/pom.xml>
[INFO] 
[INFO] --- maven-compiler-plugin:3.5.1:compile (default-compile) @ fluo-integration ---
[INFO] No sources to compile
[INFO] 
[INFO] --- maven-resources-plugin:2.7:testResources (default-testResources) @ fluo-integration
---
[INFO] Using 'UTF-8' encoding to copy filtered resources.
[INFO] Copying 1 resource
[INFO] Copying 3 resources
[INFO] 
[INFO] --- maven-compiler-plugin:3.5.1:testCompile (default-testCompile) @ fluo-integration
---
[INFO] Nothing to compile - all classes are up to date
[INFO] 
[INFO] --- modernizer-maven-plugin:1.4.0:modernizer (modernizer) @ fluo-integration ---
[INFO] 
[INFO] --- maven-surefire-plugin:2.19.1:test (default-test) @ fluo-integration ---

-------------------------------------------------------
 T E S T S
-------------------------------------------------------

Results :

Tests run: 0, Failures: 0, Errors: 0, Skipped: 0

[JENKINS] Recording test results
[INFO] 
[INFO] --- maven-jar-plugin:3.0.0:jar (default-jar) @ fluo-integration ---
[INFO] Building jar: <https://builds.apache.org/job/Fluo/ws/modules/integration/target/fluo-integration-1.1.0-incubating-SNAPSHOT.jar>
[INFO] 
[INFO] --- maven-site-plugin:3.5.1:attach-descriptor (attach-descriptor) @ fluo-integration
---
[INFO] 
[INFO] --- maven-jar-plugin:3.0.0:test-jar (default) @ fluo-integration ---
[INFO] Building jar: <https://builds.apache.org/job/Fluo/ws/modules/integration/target/fluo-integration-1.1.0-incubating-SNAPSHOT-tests.jar>
[INFO] 
[INFO] --- accumulo-maven-plugin:1.6.5:start (run-plugin) @ fluo-integration ---
[INFO] Starting MiniAccumuloCluster: it-instance-maven in <https://builds.apache.org/job/Fluo/ws/modules/integration/target/accumulo-maven-plugin/it-instance-maven>
[INFO] Starting MAC against instance it-instance-maven and zookeeper(s) localhost:1374.
[INFO] 
[INFO] --- maven-failsafe-plugin:2.19.1:integration-test (run-integration-tests) @ fluo-integration
---

-------------------------------------------------------
 T E S T S
-------------------------------------------------------
Running org.apache.fluo.integration.client.LoaderExecutorIT
Tests run: 1, Failures: 0, Errors: 0, Skipped: 0, Time elapsed: 12.321 sec - in org.apache.fluo.integration.client.LoaderExecutorIT
Running org.apache.fluo.integration.client.FluoAdminImplIT
Tests run: 3, Failures: 0, Errors: 0, Skipped: 0, Time elapsed: 50.33 sec - in org.apache.fluo.integration.client.FluoAdminImplIT
Running org.apache.fluo.integration.log.LogIT
2016-10-15 10:44:13,372 [worker.WorkTaskAsync] ERROR: Failed to process work 14 stat count
 53
java.util.concurrent.RejectedExecutionException: Task org.apache.fluo.core.worker.NotificationProcessor$FutureNotificationTask@344d4e44
rejected from org.apache.fluo.core.util.FluoExecutors$1@3a8aa6bd[Terminated, pool size = 3,
active threads = 0, queued tasks = 0, completed tasks = 111]
	at java.util.concurrent.ThreadPoolExecutor$AbortPolicy.rejectedExecution(ThreadPoolExecutor.java:2047)
	at java.util.concurrent.ThreadPoolExecutor.reject(ThreadPoolExecutor.java:823)
	at java.util.concurrent.ThreadPoolExecutor.execute(ThreadPoolExecutor.java:1369)
	at org.apache.fluo.core.worker.NotificationProcessor.requeueNotification(NotificationProcessor.java:208)
	at org.apache.fluo.core.worker.WorkTaskAsync$WorkTaskCommitObserver.commitFailed(WorkTaskAsync.java:63)
	at org.apache.fluo.core.async.CommitManager$CQCommitObserver.commitFailed(CommitManager.java:117)
	at org.apache.fluo.core.log.TracingTransaction$LoggingCommitObserver.commitFailed(TracingTransaction.java:272)
	at org.apache.fluo.core.impl.TransactionImpl.synchronousPostLockPrimary(TransactionImpl.java:846)
	at org.apache.fluo.core.impl.TransactionImpl.access$800(TransactionImpl.java:85)
	at org.apache.fluo.core.impl.TransactionImpl$2.runCommitStep(TransactionImpl.java:806)
	at org.apache.fluo.core.impl.TransactionImpl$SynchronousCommitTask.run(TransactionImpl.java:689)
	at java.util.concurrent.ThreadPoolExecutor.runWorker(ThreadPoolExecutor.java:1142)
	at java.util.concurrent.ThreadPoolExecutor$Worker.run(ThreadPoolExecutor.java:617)
	at java.lang.Thread.run(Thread.java:745)
Tests run: 5, Failures: 0, Errors: 0, Skipped: 0, Time elapsed: 33.866 sec - in org.apache.fluo.integration.log.LogIT
Running org.apache.fluo.integration.impl.FluoIT
2016-10-15 10:45:26,408 [util.Halt] ERROR: Oracle has lost leadership unexpectedly and is
now halting.

Results :

Tests run: 9, Failures: 0, Errors: 0, Skipped: 0

[JENKINS] Recording test results
[INFO] ------------------------------------------------------------------------
[INFO] Reactor Summary:
[INFO] 
[INFO] Fluo Project ....................................... SUCCESS [ 58.278 s]
[INFO] Fluo API ........................................... SUCCESS [ 44.874 s]
[INFO] Fluo Accumulo Extensions ........................... SUCCESS [ 41.276 s]
[INFO] Fluo Core .......................................... SUCCESS [ 43.576 s]
[INFO] Fluo Cluster ....................................... SUCCESS [ 37.647 s]
[INFO] Fluo Mini .......................................... SUCCESS [ 24.616 s]
[INFO] Fluo Integration ................................... FAILURE [03:22 min]
[INFO] Fluo MapReduce ..................................... SKIPPED
[INFO] Fluo Distribution .................................. SKIPPED
[INFO] ------------------------------------------------------------------------
[INFO] BUILD FAILURE
[INFO] ------------------------------------------------------------------------
[INFO] Total time: 07:50 min
[INFO] Finished at: 2016-10-15T10:45:32+00:00
[INFO] Final Memory: 72M/797M
[INFO] ------------------------------------------------------------------------
Waiting for Jenkins to finish collecting data
[ERROR] Failed to execute goal org.apache.maven.plugins:maven-failsafe-plugin:2.19.1:integration-test
(run-integration-tests) on project fluo-integration: Execution run-integration-tests of goal
org.apache.maven.plugins:maven-failsafe-plugin:2.19.1:integration-test failed: The forked
VM terminated without properly saying goodbye. VM crash or System.exit called?
[ERROR] Command was /bin/sh -c cd <https://builds.apache.org/job/Fluo/ws/modules/integration>
&& /usr/local/asfpackages/java/jdk1.8.0_102/jre/bin/java -jar <https://builds.apache.org/job/Fluo/ws/modules/integration/target/surefire/surefirebooter2197447756613983371.jar>
<https://builds.apache.org/job/Fluo/ws/modules/integration/target/surefire/surefire626770209223155660tmp>
<https://builds.apache.org/job/Fluo/ws/modules/integration/target/surefire/surefire_03500916351722485931tmp>
[ERROR] -> [Help 1]
[ERROR] 
[ERROR] To see the full stack trace of the errors, re-run Maven with the -e switch.
[ERROR] Re-run Maven using the -X switch to enable full debug logging.
[ERROR] 
[ERROR] For more information about the errors and possible solutions, please read the following
articles:
[ERROR] [Help 1] http://cwiki.apache.org/confluence/display/MAVEN/PluginExecutionException
[ERROR] 
[ERROR] After correcting the problems, you can resume the build with the command
[ERROR]   mvn <goals> -rf :fluo-integration
[JENKINS] Archiving <https://builds.apache.org/job/Fluo/ws/modules/api/pom.xml> to org.apache.fluo/fluo-api/1.1.0-incubating-SNAPSHOT/fluo-api-1.1.0-incubating-SNAPSHOT.pom
[JENKINS] Archiving <https://builds.apache.org/job/Fluo/ws/modules/api/target/fluo-api-1.1.0-incubating-SNAPSHOT.jar>
to org.apache.fluo/fluo-api/1.1.0-incubating-20161015.103925-9/fluo-api-1.1.0-incubating-20161015.103925-9.jar
[JENKINS] Archiving <https://builds.apache.org/job/Fluo/ws/modules/cluster/pom.xml>
to org.apache.fluo/fluo-cluster/1.1.0-incubating-SNAPSHOT/fluo-cluster-1.1.0-incubating-SNAPSHOT.pom
[JENKINS] Archiving <https://builds.apache.org/job/Fluo/ws/modules/cluster/target/fluo-cluster-1.1.0-incubating-SNAPSHOT.jar>
to org.apache.fluo/fluo-cluster/1.1.0-incubating-20161015.104131-9/fluo-cluster-1.1.0-incubating-20161015.104131-9.jar
[JENKINS] Archiving <https://builds.apache.org/job/Fluo/ws/modules/core/pom.xml> to
org.apache.fluo/fluo-core/1.1.0-incubating-SNAPSHOT/fluo-core-1.1.0-incubating-SNAPSHOT.pom
[JENKINS] Archiving <https://builds.apache.org/job/Fluo/ws/modules/core/target/fluo-core-1.1.0-incubating-SNAPSHOT.jar>
to org.apache.fluo/fluo-core/1.1.0-incubating-20161015.104052-9/fluo-core-1.1.0-incubating-20161015.104052-9.jar
[JENKINS] Archiving <https://builds.apache.org/job/Fluo/ws/modules/integration/pom.xml>
to org.apache.fluo/fluo-integration/1.1.0-incubating-SNAPSHOT/fluo-integration-1.1.0-incubating-SNAPSHOT.pom
[JENKINS] Archiving <https://builds.apache.org/job/Fluo/ws/modules/integration/target/fluo-integration-1.1.0-incubating-SNAPSHOT.jar>
to org.apache.fluo/fluo-integration/1.1.0-incubating-SNAPSHOT/fluo-integration-1.1.0-incubating-SNAPSHOT.jar
[JENKINS] Archiving <https://builds.apache.org/job/Fluo/ws/modules/integration/target/fluo-integration-1.1.0-incubating-SNAPSHOT-tests.jar>
to org.apache.fluo/fluo-integration/1.1.0-incubating-SNAPSHOT/fluo-integration-1.1.0-incubating-SNAPSHOT-tests.jar
[JENKINS] Archiving <https://builds.apache.org/job/Fluo/ws/modules/mini/pom.xml> to
org.apache.fluo/fluo-mini/1.1.0-incubating-SNAPSHOT/fluo-mini-1.1.0-incubating-SNAPSHOT.pom
[JENKINS] Archiving <https://builds.apache.org/job/Fluo/ws/modules/mini/target/fluo-mini-1.1.0-incubating-SNAPSHOT.jar>
to org.apache.fluo/fluo-mini/1.1.0-incubating-20161015.104158-9/fluo-mini-1.1.0-incubating-20161015.104158-9.jar
[JENKINS] Archiving <https://builds.apache.org/job/Fluo/ws/modules/distribution/pom.xml>
to org.apache.fluo/fluo/1.1.0-incubating-SNAPSHOT/fluo-1.1.0-incubating-SNAPSHOT.pom
[JENKINS] Archiving <https://builds.apache.org/job/Fluo/ws/modules/accumulo/pom.xml>
to org.apache.fluo/fluo-accumulo/1.1.0-incubating-SNAPSHOT/fluo-accumulo-1.1.0-incubating-SNAPSHOT.pom
[JENKINS] Archiving <https://builds.apache.org/job/Fluo/ws/modules/accumulo/target/fluo-accumulo-1.1.0-incubating-SNAPSHOT.jar>
to org.apache.fluo/fluo-accumulo/1.1.0-incubating-20161015.104008-9/fluo-accumulo-1.1.0-incubating-20161015.104008-9.jar
[JENKINS] Archiving <https://builds.apache.org/job/Fluo/ws/pom.xml> to org.apache.fluo/fluo-project/1.1.0-incubating-SNAPSHOT/fluo-project-1.1.0-incubating-SNAPSHOT.pom
[JENKINS] Archiving <https://builds.apache.org/job/Fluo/ws/modules/mapreduce/pom.xml>
to org.apache.fluo/fluo-mapreduce/1.1.0-incubating-SNAPSHOT/fluo-mapreduce-1.1.0-incubating-SNAPSHOT.pom
channel stopped

Mime
View raw message