giraph-dev mailing list archives

Site index · List index
Message view « Date » · « Thread »
Top « Date » · « Thread »
From Apache Jenkins Server <jenk...@builds.apache.org>
Subject Failed: GIRAPH-141 PreCommit Build #47
Date Fri, 14 Dec 2012 04:39:29 GMT
Jira: https://issues.apache.org/jira/browse/GIRAPH-141
Build: https://builds.apache.org/job/PreCommit-GIRAPH-Build/47/

###################################################################################
########################## LAST 60 LINES OF THE CONSOLE ###########################
[...truncated 272 lines...]
Hunk #2 FAILED at 54.
2 out of 2 hunks FAILED -- saving rejects to file b/giraph/src/test/java/org/apache/giraph/graph/TestIntIntNullIntVertex.java.rej
patching file b/giraph/src/test/java/org/apache/giraph/graph/TestMutableVertex.java
Hunk #1 FAILED at 46.
Hunk #2 FAILED at 147.
Hunk #3 FAILED at 181.
Hunk #4 FAILED at 218.
Hunk #5 FAILED at 274.
5 out of 5 hunks FAILED -- saving rejects to file b/giraph/src/test/java/org/apache/giraph/graph/TestMutableVertex.java.rej
patching file b/giraph/src/test/java/org/apache/giraph/graph/partition/TestGiraphTransferRegulator.java
Hunk #1 FAILED at 17.
Hunk #2 FAILED at 32.
Hunk #3 FAILED at 71.
3 out of 3 hunks FAILED -- saving rejects to file b/giraph/src/test/java/org/apache/giraph/graph/partition/TestGiraphTransferRegulator.java.rej
patching file b/giraph/src/test/java/org/apache/giraph/io/TestTextDoubleDoubleAdjacencyListVertexInputFormat.java
Hunk #1 FAILED at 17.
Hunk #2 FAILED at 138.
2 out of 2 hunks FAILED -- saving rejects to file b/giraph/src/test/java/org/apache/giraph/io/TestTextDoubleDoubleAdjacencyListVertexInputFormat.java.rej
PATCH APPLICATION FAILED




-1 overall.  Here are the results of testing the latest attachment 
  http://issues.apache.org/jira/secure/attachment/12560914/GIRAPH-141.patch
  against trunk revision 1419623.

    -1 patch.  The patch command could not apply the patch.

Console output: https://builds.apache.org/job/PreCommit-GIRAPH-Build/47//console

This message is automatically generated.


======================================================================
======================================================================
    Adding comment to Jira.
======================================================================
======================================================================


Comment added.
046b5fb9d163a00c73913b975e22f77d3175db1a logged out


======================================================================
======================================================================
    Finished build.
======================================================================
======================================================================


Build step 'Execute shell' marked build as failure
[FINDBUGS] Skipping publisher since build result is FAILURE
Archiving artifacts
Recording test results
[description-setter] Could not determine description.
Email was triggered for: Failure
Sending email for trigger: Failure



###################################################################################
############################## FAILED TESTS (if any) ##############################
No tests ran.
Mime
  • Unnamed multipart/mixed (inline, None, 0 bytes)
View raw message