giraph-dev mailing list archives

Site index · List index
Message view « Date » · « Thread »
Top « Date » · « Thread »
From "Dionysios Logothetis (JIRA)" <j...@apache.org>
Subject [jira] [Resolved] (GIRAPH-544) Tests failing/hanging on hadoop_trunk profile
Date Wed, 08 May 2019 16:12:00 GMT

     [ https://issues.apache.org/jira/browse/GIRAPH-544?page=com.atlassian.jira.plugin.system.issuetabpanels:all-tabpanel
]

Dionysios Logothetis resolved GIRAPH-544.
-----------------------------------------
    Resolution: Fixed

> Tests failing/hanging on hadoop_trunk profile
> ---------------------------------------------
>
>                 Key: GIRAPH-544
>                 URL: https://issues.apache.org/jira/browse/GIRAPH-544
>             Project: Giraph
>          Issue Type: Bug
>          Components: test
>    Affects Versions: 1.0.0
>            Reporter: Eli Reisman
>            Priority: Major
>              Labels: test-fail
>
> Tests are failing (a couple) then hanging forever (on one in particular) on a clean trunk
when running
> mvn -Phadoop_trunk clean verify
> dump looks like this (up to where it hangs):
> {code}
> T E S T S
> -------------------------------------------------------
> Running org.apache.giraph.comm.SaslConnectionTest
> log4j:WARN No appenders could be found for logger (org.apache.giraph.comm.netty.NettyServer).
> log4j:WARN Please initialize the log4j system properly.
> Tests run: 1, Failures: 0, Errors: 0, Skipped: 0, Time elapsed: 0.623 sec
> Running org.apache.giraph.partition.TestGiraphTransferRegulator
> 2013-02-28 17:10:41.870 java[95826:1203] Unable to load realm info from SCDynamicStore
> 2013-02-28 17:10:42.047 java[95826:1203] Unable to load realm info from SCDynamicStore
> Tests run: 1, Failures: 0, Errors: 0, Skipped: 0, Time elapsed: 0.413 sec
> Running org.apache.giraph.bsp.BspUtilsTest
> testCreateClass: took 317503000 ns for 200000 elements 1587.515 ns / element
> testNativeCreateClass: took 30277000 ns for 200000 elements 151.385 ns / element
> testNewInstance: took 10546000 ns for 200000 elements 52.73 ns / element
> testSyncNewInstance: took 9424000 ns for 200000 elements 47.12 ns / element
> testReflectionUtilsNewInstance: took 27517000 ns for 200000 elements 137.585 ns / element
> testConstructorNewInstance: took 17887000 ns for 200000 elements 89.435 ns / element
> testImmutableClassesGiraphConfigurationNewInstance: took 8145000 ns for 200000 elements
40.725 ns / element
> Tests run: 7, Failures: 0, Errors: 0, Skipped: 0, Time elapsed: 1.024 sec
> Running org.apache.giraph.aggregators.TestFloatAggregators
> Tests run: 5, Failures: 0, Errors: 0, Skipped: 0, Time elapsed: 0.008 sec
> Running org.apache.giraph.comm.ConnectionTest
> Tests run: 3, Failures: 0, Errors: 0, Skipped: 0, Time elapsed: 0.06 sec
> Running org.apache.giraph.vertex.TestMutableVertex
> testSerialize: Serializing took 181650 ns for 2413 bytes 1.3283788E7 bytes / sec for
org.apache.giraph.vertex.TestMutableVertex$IFDLHashMapVertex
> testSerialize: Deserializing took 393110 ns for 2413 bytes 6138231.5 bytes / sec for
org.apache.giraph.vertex.TestMutableVertex$IFDLHashMapVertex
> testDynamicChannelBufferSerializeVertexClass: Serializing took 311830 ns for 2413 bytes
7738191.0 bytes / sec for org.apache.giraph.vertex.TestMutableVertex$IFDLHashMapVertex
> testDynamicChannelBufferSerializeVertexClass: Deserializing took 225930 ns for 2413 bytes
1.06803E7 bytes / sec for org.apache.giraph.vertex.TestMutableVertex$IFDLHashMapVertex
> testUnsafeSerializeVertexClass: Serializing took 122680 ns for 2413 bytes 1.9669058E7
bytes / sec for org.apache.giraph.vertex.TestMutableVertex$IFDLHashMapVertex
> testUnsafeSerializeVertexClass: Deserializing took 94710 ns for 2413 bytes 2.5477776E7
bytes / sec for org.apache.giraph.vertex.TestMutableVertex$IFDLHashMapVertex
> testSerialize: Serializing took 66190 ns for 2413 bytes 3.645566E7 bytes / sec for org.apache.giraph.vertex.TestMutableVertex$IFDLEdgeListVertex
> testSerialize: Deserializing took 149700 ns for 2413 bytes 1.6118905E7 bytes / sec for
org.apache.giraph.vertex.TestMutableVertex$IFDLEdgeListVertex
> testDynamicChannelBufferSerializeVertexClass: Serializing took 185560 ns for 2413 bytes
1.3003881E7 bytes / sec for org.apache.giraph.vertex.TestMutableVertex$IFDLEdgeListVertex
> testDynamicChannelBufferSerializeVertexClass: Deserializing took 110540 ns for 2413 bytes
2.1829204E7 bytes / sec for org.apache.giraph.vertex.TestMutableVertex$IFDLEdgeListVertex
> testUnsafeSerializeVertexClass: Serializing took 36320 ns for 2413 bytes 6.6437228E7
bytes / sec for org.apache.giraph.vertex.TestMutableVertex$IFDLEdgeListVertex
> testUnsafeSerializeVertexClass: Deserializing took 31820 ns for 2413 bytes 7.5832816E7
bytes / sec for org.apache.giraph.vertex.TestMutableVertex$IFDLEdgeListVertex
> testSerialize: Serializing took 5370 ns for 2417 bytes 4.50093088E8 bytes / sec for org.apache.giraph.vertex.TestMutableVertex$IFDLRepresentativeVertex
> testSerialize: Deserializing took 5460 ns for 2417 bytes 4.42673984E8 bytes / sec for
org.apache.giraph.vertex.TestMutableVertex$IFDLRepresentativeVertex
> testDynamicChannelBufferSerializeVertexClass: Serializing took 15360 ns for 2417 bytes
1.57356768E8 bytes / sec for org.apache.giraph.vertex.TestMutableVertex$IFDLRepresentativeVertex
> testDynamicChannelBufferSerializeVertexClass: Deserializing took 8170 ns for 2417 bytes
2.95838432E8 bytes / sec for org.apache.giraph.vertex.TestMutableVertex$IFDLRepresentativeVertex
> testUnsafeSerializeVertexClass: Serializing took 2250 ns for 2417 bytes 1.07422221E9
bytes / sec for org.apache.giraph.vertex.TestMutableVertex$IFDLRepresentativeVertex
> testUnsafeSerializeVertexClass: Deserializing took 4590 ns for 2417 bytes 5.2657952E8
bytes / sec for org.apache.giraph.vertex.TestMutableVertex$IFDLRepresentativeVertex
> Tests run: 5, Failures: 0, Errors: 0, Skipped: 0, Time elapsed: 0.449 sec
> Running org.apache.giraph.comm.RequestFailureTest
> Tests run: 3, Failures: 0, Errors: 0, Skipped: 0, Time elapsed: 4.079 sec
> Running org.apache.giraph.aggregators.TestIntAggregators
> Tests run: 5, Failures: 0, Errors: 0, Skipped: 0, Time elapsed: 0.006 sec
> Running org.apache.giraph.io.TestIdWithValueTextOutputFormat
> Tests run: 3, Failures: 0, Errors: 0, Skipped: 0, Time elapsed: 0.064 sec
> Running org.apache.giraph.io.TestJsonBase64Format
> setupConfiguration: Using local job runner with location /Users/ereisman/apache/giraph/giraph-core/target/giraph-0.2-SNAPSHOT-for-hadoop-3.0.0-SNAPSHOT-jar-with-dependencies.jar
for org.apache.giraph.io.TestJsonBase64Format
> Tests run: 1, Failures: 0, Errors: 1, Skipped: 0, Time elapsed: 0.054 sec <<<
FAILURE!
> Running org.apache.giraph.aggregators.TestBooleanAggregators
> Tests run: 3, Failures: 0, Errors: 0, Skipped: 0, Time elapsed: 0.004 sec
> Running org.apache.giraph.master.TestMasterObserver
> Tests run: 1, Failures: 0, Errors: 1, Skipped: 0, Time elapsed: 0.053 sec <<<
FAILURE!
> Running org.apache.giraph.conf.TestGiraphConfiguration
> Tests run: 2, Failures: 0, Errors: 0, Skipped: 0, Time elapsed: 0.02 sec
> Running org.apache.giraph.comm.TestMessageStores
> Tests run: 3, Failures: 0, Errors: 0, Skipped: 0, Time elapsed: 0.881 sec
> Running org.apache.giraph.io.TestTextDoubleDoubleAdjacencyListVertexInputFormat
> Tests run: 5, Failures: 0, Errors: 0, Skipped: 0, Time elapsed: 0.053 sec
> Running org.apache.giraph.utils.ComparisonUtilsTest
> Tests run: 4, Failures: 0, Errors: 0, Skipped: 0, Time elapsed: 0.003 sec
> Running org.apache.giraph.vertex.TestIntIntNullIntVertex
> Tests run: 1, Failures: 0, Errors: 0, Skipped: 0, Time elapsed: 0.003 sec
> Running org.apache.giraph.vertex.TestMultiGraphVertex
> Tests run: 1, Failures: 0, Errors: 0, Skipped: 0, Time elapsed: 0.038 sec
> Running org.apache.giraph.zk.TestZooKeeperExt
> testCreateExt: No prop.zookeeper.list set, skipping test
> testDeleteExt: No prop.zookeeper.list set, skipping test
> testGetChildrenExt: No prop.zookeeper.list set, skipping test
> Tests run: 3, Failures: 0, Errors: 0, Skipped: 0, Time elapsed: 0.003 sec
> Running org.apache.giraph.zk.TestZooKeeperManager
> Tests run: 1, Failures: 0, Errors: 0, Skipped: 0, Time elapsed: 0.019 sec
> Running org.apache.giraph.io.TestLongDoubleDoubleAdjacencyListVertexInputFormat
> Tests run: 4, Failures: 0, Errors: 0, Skipped: 0, Time elapsed: 0.035 sec
> Running org.apache.giraph.io.TestEdgeInput
> Tests run: 3, Failures: 0, Errors: 3, Skipped: 0, Time elapsed: 0.093 sec <<<
FAILURE!
> Running org.apache.giraph.partition.TestPartitionStores
> Tests run: 3, Failures: 0, Errors: 0, Skipped: 0, Time elapsed: 0.06 sec
> Running org.apache.giraph.comm.RequestTest
> {code}



--
This message was sent by Atlassian JIRA
(v7.6.3#76005)

Mime
View raw message