gora-dev mailing list archives

Site index · List index
Message view « Date » · « Thread »
Top « Date » · « Thread »
From Apache Jenkins Server <jenk...@builds.apache.org>
Subject Build failed in Jenkins: gora-trunk #224
Date Mon, 09 Apr 2012 05:09:27 GMT
See <https://builds.apache.org/job/gora-trunk/224/>

------------------------------------------
[...truncated 5601 lines...]
[ERROR] There are test failures.

Please refer to <https://builds.apache.org/job/gora-trunk/ws/trunk./gora-hbase/target/surefire-reports>
for the individual test results.
[JENKINS] Recording test results
[INFO] 
[INFO] --- maven-bundle-plugin:2.3.7:bundle (default-bundle) @ gora-hbase ---
[INFO] 
[INFO] --- maven-site-plugin:3.0:attach-descriptor (attach-descriptor) @ gora-hbase ---
[INFO] [INFO] Copying xmlParserAPIs-2.6.2.jar to <https://builds.apache.org/job/gora-trunk/ws/trunk./gora-hbase/lib/xmlParserAPIs-2.6.2.jar>
[INFO] Copying oro-2.0.8.jar to <https://builds.apache.org/job/gora-trunk/ws/trunk./gora-hbase/lib/oro-2.0.8.jar>
[INFO] Copying slf4j-api-1.5.8.jar to <https://builds.apache.org/job/gora-trunk/ws/trunk./gora-hbase/lib/slf4j-api-1.5.8.jar>
[INFO] Copying ftpserver-deprecated-1.0.0-M2.jar to <https://builds.apache.org/job/gora-trunk/ws/trunk./gora-hbase/lib/ftpserver-deprecated-1.0.0-M2.jar>
[INFO] Copying hamcrest-core-1.1.jar to <https://builds.apache.org/job/gora-trunk/ws/trunk./gora-hbase/lib/hamcrest-core-1.1.jar>
[INFO] Copying stax-api-1.0.1.jar to <https://builds.apache.org/job/gora-trunk/ws/trunk./gora-hbase/lib/stax-api-1.0.1.jar>
[INFO] Copying slf4j-log4j12-1.5.8.jar to <https://builds.apache.org/job/gora-trunk/ws/trunk./gora-hbase/lib/slf4j-log4j12-1.5.8.jar>
[INFO] Copying commons-net-1.4.1.jar to <https://builds.apache.org/job/gora-trunk/ws/trunk./gora-hbase/lib/commons-net-1.4.1.jar>
[INFO] Copying guava-10.0.1.jar to <https://builds.apache.org/job/gora-trunk/ws/trunk./gora-hbase/lib/guava-10.0.1.jar>
[INFO] Copying neethi-3.0.1.jar to <https://builds.apache.org/job/gora-trunk/ws/trunk./gora-hbase/lib/neethi-3.0.1.jar>
[INFO] Copying jettison-1.3.1.jar to <https://builds.apache.org/job/gora-trunk/ws/trunk./gora-hbase/lib/jettison-1.3.1.jar>
[INFO] Copying cxf-rt-transports-http-2.5.2.jar to <https://builds.apache.org/job/gora-trunk/ws/trunk./gora-hbase/lib/cxf-rt-transports-http-2.5.2.jar>
[INFO] Copying cxf-rt-transports-common-2.5.2.jar to <https://builds.apache.org/job/gora-trunk/ws/trunk./gora-hbase/lib/cxf-rt-transports-common-2.5.2.jar>
[INFO] Copying commons-beanutils-1.7.0.jar to <https://builds.apache.org/job/gora-trunk/ws/trunk./gora-hbase/lib/commons-beanutils-1.7.0.jar>
[INFO] Copying cxf-rt-core-2.5.2.jar to <https://builds.apache.org/job/gora-trunk/ws/trunk./gora-hbase/lib/cxf-rt-core-2.5.2.jar>
[INFO] Copying jackson-jaxrs-1.5.5.jar to <https://builds.apache.org/job/gora-trunk/ws/trunk./gora-hbase/lib/jackson-jaxrs-1.5.5.jar>
[INFO] Copying commons-httpclient-3.1.jar to <https://builds.apache.org/job/gora-trunk/ws/trunk./gora-hbase/lib/commons-httpclient-3.1.jar>
[INFO] Copying junit-4.10.jar to <https://builds.apache.org/job/gora-trunk/ws/trunk./gora-hbase/lib/junit-4.10.jar>
[INFO] Copying jdom-1.1.2.jar to <https://builds.apache.org/job/gora-trunk/ws/trunk./gora-hbase/lib/jdom-1.1.2.jar>
[INFO] Copying xmlschema-core-2.0.1.jar to <https://builds.apache.org/job/gora-trunk/ws/trunk./gora-hbase/lib/xmlschema-core-2.0.1.jar>
[INFO] Copying cxf-rt-frontend-jaxrs-2.5.2.jar to <https://builds.apache.org/job/gora-trunk/ws/trunk./gora-hbase/lib/cxf-rt-frontend-jaxrs-2.5.2.jar>
[INFO] Copying mina-core-2.0.0-M5.jar to <https://builds.apache.org/job/gora-trunk/ws/trunk./gora-hbase/lib/mina-core-2.0.0-M5.jar>
[INFO] Copying avro-1.3.3.jar to <https://builds.apache.org/job/gora-trunk/ws/trunk./gora-hbase/lib/avro-1.3.3.jar>
[INFO] Copying jsr311-api-1.1.1.jar to <https://builds.apache.org/job/gora-trunk/ws/trunk./gora-hbase/lib/jsr311-api-1.1.1.jar>
[INFO] Copying jersey-server-1.4.jar to <https://builds.apache.org/job/gora-trunk/ws/trunk./gora-hbase/lib/jersey-server-1.4.jar>
[INFO] Copying commons-cli-1.2.jar to <https://builds.apache.org/job/gora-trunk/ws/trunk./gora-hbase/lib/commons-cli-1.2.jar>
[INFO] Copying xom-1.0.jar to <https://builds.apache.org/job/gora-trunk/ws/trunk./gora-hbase/lib/xom-1.0.jar>
[INFO] Copying icu4j-2.6.1.jar to <https://builds.apache.org/job/gora-trunk/ws/trunk./gora-hbase/lib/icu4j-2.6.1.jar>

[INFO] [INFO] Copying jasper-compiler-5.5.23.jar to <https://builds.apache.org/job/gora-trunk/ws/trunk./gora-hbase/lib/jasper-compiler-5.5.23.jar>
[INFO] Copying hadoop-core-1.0.1.jar to <https://builds.apache.org/job/gora-trunk/ws/trunk./gora-hbase/lib/hadoop-core-1.0.1.jar>
--- maven-dependency-plugin:2.4:copy-dependencies (default) @ gora-hbase ---
[INFO] Copying hbase-0.90.4-tests.jar to <https://builds.apache.org/job/gora-trunk/ws/trunk./gora-hbase/lib/hbase-0.90.4-tests.jar>
[INFO] Copying log4j-1.2.16.jar to <https://builds.apache.org/job/gora-trunk/ws/trunk./gora-hbase/lib/log4j-1.2.16.jar>
[INFO] Copying cxf-api-2.5.2.jar to <https://builds.apache.org/job/gora-trunk/ws/trunk./gora-hbase/lib/cxf-api-2.5.2.jar>
[INFO] Copying spring-web-3.0.6.RELEASE.jar to <https://builds.apache.org/job/gora-trunk/ws/trunk./gora-hbase/lib/spring-web-3.0.6.RELEASE.jar>
[INFO] Copying stax2-api-3.1.1.jar to <https://builds.apache.org/job/gora-trunk/ws/trunk./gora-hbase/lib/stax2-api-3.1.1.jar>
[INFO] Copying spring-expression-3.0.6.RELEASE.jar to <https://builds.apache.org/job/gora-trunk/ws/trunk./gora-hbase/lib/spring-expression-3.0.6.RELEASE.jar>
[INFO] Copying zookeeper-3.3.2.jar to <https://builds.apache.org/job/gora-trunk/ws/trunk./gora-hbase/lib/zookeeper-3.3.2.jar>
[INFO] Copying kfs-0.3.jar to <https://builds.apache.org/job/gora-trunk/ws/trunk./gora-hbase/lib/kfs-0.3.jar>
[INFO] Copying commons-codec-1.4.jar to <https://builds.apache.org/job/gora-trunk/ws/trunk./gora-hbase/lib/commons-codec-1.4.jar>
[INFO] Copying thrift-0.2.0.jar to <https://builds.apache.org/job/gora-trunk/ws/trunk./gora-hbase/lib/thrift-0.2.0.jar>
[INFO] Copying jersey-json-1.4.jar to <https://builds.apache.org/job/gora-trunk/ws/trunk./gora-hbase/lib/jersey-json-1.4.jar>
[INFO] Copying ant-1.7.1.jar to <https://builds.apache.org/job/gora-trunk/ws/trunk./gora-hbase/lib/ant-1.7.1.jar>
[INFO] Copying jaxb-api-2.1.jar to <https://builds.apache.org/job/gora-trunk/ws/trunk./gora-hbase/lib/jaxb-api-2.1.jar>
[INFO] Copying dom4j-1.6.1.jar to <https://builds.apache.org/job/gora-trunk/ws/trunk./gora-hbase/lib/dom4j-1.6.1.jar>
[INFO] Copying woodstox-core-asl-4.1.1.jar to <https://builds.apache.org/job/gora-trunk/ws/trunk./gora-hbase/lib/woodstox-core-asl-4.1.1.jar>
[INFO] Copying spring-context-3.0.6.RELEASE.jar to <https://builds.apache.org/job/gora-trunk/ws/trunk./gora-hbase/lib/spring-context-3.0.6.RELEASE.jar>
[INFO] Copying hadoop-test-1.0.1.jar to <https://builds.apache.org/job/gora-trunk/ws/trunk./gora-hbase/lib/hadoop-test-1.0.1.jar>
[INFO] Copying commons-el-1.0.jar to <https://builds.apache.org/job/gora-trunk/ws/trunk./gora-hbase/lib/commons-el-1.0.jar>
[INFO] Copying cxf-rt-bindings-xml-2.5.2.jar to <https://builds.apache.org/job/gora-trunk/ws/trunk./gora-hbase/lib/cxf-rt-bindings-xml-2.5.2.jar>
[INFO] Copying asm-3.1.jar to <https://builds.apache.org/job/gora-trunk/ws/trunk./gora-hbase/lib/asm-3.1.jar>
[INFO] Copying hbase-0.90.4.jar to <https://builds.apache.org/job/gora-trunk/ws/trunk./gora-hbase/lib/hbase-0.90.4.jar>
[INFO] Copying core-3.1.1.jar to <https://builds.apache.org/job/gora-trunk/ws/trunk./gora-hbase/lib/core-3.1.1.jar>
[INFO] Copying jackson-xc-1.5.5.jar to <https://builds.apache.org/job/gora-trunk/ws/trunk./gora-hbase/lib/jackson-xc-1.5.5.jar>
[INFO] Copying geronimo-javamail_1.4_spec-1.7.1.jar to <https://builds.apache.org/job/gora-trunk/ws/trunk./gora-hbase/lib/geronimo-javamail_1.4_spec-1.7.1.jar>
[INFO] Copying spring-asm-3.0.6.RELEASE.jar to <https://builds.apache.org/job/gora-trunk/ws/trunk./gora-hbase/lib/spring-asm-3.0.6.RELEASE.jar>
[INFO] Copying commons-logging-1.1.1.jar to <https://builds.apache.org/job/gora-trunk/ws/trunk./gora-hbase/lib/commons-logging-1.1.1.jar>
[INFO] Copying commons-lang-2.6.jar to <https://builds.apache.org/job/gora-trunk/ws/trunk./gora-hbase/lib/commons-lang-2.6.jar>
[INFO] Copying spring-beans-3.0.6.RELEASE.jar to <https://builds.apache.org/job/gora-trunk/ws/trunk./gora-hbase/lib/spring-beans-3.0.6.RELEASE.jar>
[INFO] Copying jsp-2.1-6.1.14.jar to <https://builds.apache.org/job/gora-trunk/ws/trunk./gora-hbase/lib/jsp-2.1-6.1.14.jar>
[INFO] Copying jetty-util-6.1.26.jar to <https://builds.apache.org/job/gora-trunk/ws/trunk./gora-hbase/lib/jetty-util-6.1.26.jar>
[INFO] Copying commons-digester-1.8.jar to <https://builds.apache.org/job/gora-trunk/ws/trunk./gora-hbase/lib/commons-digester-1.8.jar>
[INFO] Copying activation-1.1.jar to <https://builds.apache.org/job/gora-trunk/ws/trunk./gora-hbase/lib/activation-1.1.jar>
[INFO] Copying xmlenc-0.52.jar to <https://builds.apache.org/job/gora-trunk/ws/trunk./gora-hbase/lib/xmlenc-0.52.jar>
[INFO] Copying commons-beanutils-core-1.8.0.jar to <https://builds.apache.org/job/gora-trunk/ws/trunk./gora-hbase/lib/commons-beanutils-core-1.8.0.jar>
[INFO] Copying xalan-2.6.0.jar to <https://builds.apache.org/job/gora-trunk/ws/trunk./gora-hbase/lib/xalan-2.6.0.jar>
[INFO] Copying aopalliance-1.0.jar to <https://builds.apache.org/job/gora-trunk/ws/trunk./gora-hbase/lib/aopalliance-1.0.jar>
[INFO] Copying ftpserver-core-1.0.0.jar to <https://builds.apache.org/job/gora-trunk/ws/trunk./gora-hbase/lib/ftpserver-core-1.0.0.jar>
[INFO] Copying xml-apis-1.3.02.jar to <https://builds.apache.org/job/gora-trunk/ws/trunk./gora-hbase/lib/xml-apis-1.3.02.jar>
[INFO] Copying spring-aop-3.0.6.RELEASE.jar to <https://builds.apache.org/job/gora-trunk/ws/trunk./gora-hbase/lib/spring-aop-3.0.6.RELEASE.jar>
[INFO] Copying jersey-core-1.4.jar to <https://builds.apache.org/job/gora-trunk/ws/trunk./gora-hbase/lib/jersey-core-1.4.jar>
[INFO] Copying jaxb-impl-2.1.12.jar to <https://builds.apache.org/job/gora-trunk/ws/trunk./gora-hbase/lib/jaxb-impl-2.1.12.jar>
[INFO] Copying paranamer-2.2.jar to <https://builds.apache.org/job/gora-trunk/ws/trunk./gora-hbase/lib/paranamer-2.2.jar>
[INFO] Copying jsr305-1.3.9.jar to <https://builds.apache.org/job/gora-trunk/ws/trunk./gora-hbase/lib/jsr305-1.3.9.jar>
[INFO] Copying servlet-api-2.5-6.1.14.jar to <https://builds.apache.org/job/gora-trunk/ws/trunk./gora-hbase/lib/servlet-api-2.5-6.1.14.jar>
[INFO] Copying paranamer-ant-2.2.jar to <https://builds.apache.org/job/gora-trunk/ws/trunk./gora-hbase/lib/paranamer-ant-2.2.jar>
[INFO] Copying spring-core-3.0.6.RELEASE.jar to <https://builds.apache.org/job/gora-trunk/ws/trunk./gora-hbase/lib/spring-core-3.0.6.RELEASE.jar>
[INFO] Copying ftplet-api-1.0.0.jar to <https://builds.apache.org/job/gora-trunk/ws/trunk./gora-hbase/lib/ftplet-api-1.0.0.jar>
[INFO] Copying jaxen-1.1.3.jar to <https://builds.apache.org/job/gora-trunk/ws/trunk./gora-hbase/lib/jaxen-1.1.3.jar>
[INFO] Copying jsp-api-2.1-6.1.14.jar to <https://builds.apache.org/job/gora-trunk/ws/trunk./gora-hbase/lib/jsp-api-2.1-6.1.14.jar>
[INFO] Copying commons-collections-3.2.1.jar to <https://builds.apache.org/job/gora-trunk/ws/trunk./gora-hbase/lib/commons-collections-3.2.1.jar>
[INFO] Copying xercesImpl-2.9.1.jar to <https://builds.apache.org/job/gora-trunk/ws/trunk./gora-hbase/lib/xercesImpl-2.9.1.jar>
[INFO] Copying jackson-mapper-asl-1.4.2.jar to <https://builds.apache.org/job/gora-trunk/ws/trunk./gora-hbase/lib/jackson-mapper-asl-1.4.2.jar>
[INFO] Copying qdox-1.10.1.jar to <https://builds.apache.org/job/gora-trunk/ws/trunk./gora-hbase/lib/qdox-1.10.1.jar>
[INFO] Copying ant-launcher-1.7.1.jar to <https://builds.apache.org/job/gora-trunk/ws/trunk./gora-hbase/lib/ant-launcher-1.7.1.jar>
[INFO] Copying paranamer-generator-2.2.jar to <https://builds.apache.org/job/gora-trunk/ws/trunk./gora-hbase/lib/paranamer-generator-2.2.jar>
[INFO] Copying cxf-common-utilities-2.5.2.jar to <https://builds.apache.org/job/gora-trunk/ws/trunk./gora-hbase/lib/cxf-common-utilities-2.5.2.jar>
[INFO] Copying commons-configuration-1.6.jar to <https://builds.apache.org/job/gora-trunk/ws/trunk./gora-hbase/lib/commons-configuration-1.6.jar>
[INFO] Copying jackson-core-asl-1.4.2.jar to <https://builds.apache.org/job/gora-trunk/ws/trunk./gora-hbase/lib/jackson-core-asl-1.4.2.jar>
[INFO] Copying slf4j-simple-1.5.8.jar to <https://builds.apache.org/job/gora-trunk/ws/trunk./gora-hbase/lib/slf4j-simple-1.5.8.jar>
[INFO] Copying commons-math-2.1.jar to <https://builds.apache.org/job/gora-trunk/ws/trunk./gora-hbase/lib/commons-math-2.1.jar>
[INFO] Copying jasper-runtime-5.5.23.jar to <https://builds.apache.org/job/gora-trunk/ws/trunk./gora-hbase/lib/jasper-runtime-5.5.23.jar>
[INFO] Copying jdom-1.0.jar to <https://builds.apache.org/job/gora-trunk/ws/trunk./gora-hbase/lib/jdom-1.0.jar>
[INFO] Copying jruby-complete-1.6.0.jar to <https://builds.apache.org/job/gora-trunk/ws/trunk./gora-hbase/lib/jruby-complete-1.6.0.jar>
[INFO] Copying wsdl4j-1.6.2.jar to <https://builds.apache.org/job/gora-trunk/ws/trunk./gora-hbase/lib/wsdl4j-1.6.2.jar>
[INFO] Copying jetty-6.1.26.jar to <https://builds.apache.org/job/gora-trunk/ws/trunk./gora-hbase/lib/jetty-6.1.26.jar>
[INFO] Copying gora-core-0.2-SNAPSHOT.jar to <https://builds.apache.org/job/gora-trunk/ws/trunk./gora-hbase/lib/gora-core-0.2-SNAPSHOT.jar>
[INFO] Copying gora-core-0.2-SNAPSHOT-tests.jar to <https://builds.apache.org/job/gora-trunk/ws/trunk./gora-hbase/lib/gora-core-0.2-SNAPSHOT-tests.jar>
[INFO] Copying protobuf-java-2.3.0.jar to <https://builds.apache.org/job/gora-trunk/ws/trunk./gora-hbase/lib/protobuf-java-2.3.0.jar>
[INFO] 
[INFO] --- maven-jar-plugin:2.4:jar (default) @ gora-hbase ---
[INFO] Building jar: <https://builds.apache.org/job/gora-trunk/ws/trunk./gora-hbase/target/gora-hbase-0.2-SNAPSHOT.jar>
[INFO] META-INF/maven/org.apache.gora/gora-hbase/pom.xml already added, skipping
[INFO] META-INF/maven/org.apache.gora/gora-hbase/pom.properties already added, skipping
[INFO] [INFO] Building jar: <https://builds.apache.org/job/gora-trunk/ws/trunk./gora-hbase/target/gora-hbase-0.2-SNAPSHOT-tests.jar>

[INFO] --- maven-jar-plugin:2.4:test-jar (default) @ gora-hbase ---
[INFO] [INFO] Installing <https://builds.apache.org/job/gora-trunk/ws/trunk./gora-hbase/target/gora-hbase-0.2-SNAPSHOT.jar>
to /home/hudson/hudson-slave/maven-repositories/1/org/apache/gora/gora-hbase/0.2-SNAPSHOT/gora-hbase-0.2-SNAPSHOT.jar
[INFO] Installing <https://builds.apache.org/job/gora-trunk/ws/trunk./gora-hbase/pom.xml>
to /home/hudson/hudson-slave/maven-repositories/1/org/apache/gora/gora-hbase/0.2-SNAPSHOT/gora-hbase-0.2-SNAPSHOT.pom
[INFO] Installing <https://builds.apache.org/job/gora-trunk/ws/trunk./gora-hbase/target/gora-hbase-0.2-SNAPSHOT-tests.jar>
to /home/hudson/hudson-slave/maven-repositories/1/org/apache/gora/gora-hbase/0.2-SNAPSHOT/gora-hbase-0.2-SNAPSHOT-tests.jar

[INFO] --- maven-install-plugin:2.3.1:install (default-install) @ gora-hbase ---
[INFO] 
[INFO] --- maven-bundle-plugin:2.3.7:install (default-install) @ gora-hbase ---
[INFO] Installing org/apache/gora/gora-hbase/0.2-SNAPSHOT/gora-hbase-0.2-SNAPSHOT.jar
[INFO] Writing OBR metadata
[JENKINS] Archiving <https://builds.apache.org/job/gora-trunk/ws/trunk./gora-hbase/pom.xml>
to /home/hudson/hudson/jobs/gora-trunk/modules/org.apache.gora$gora-hbase/builds/2012-04-09_05-04-41/archive/org.apache.gora/gora-hbase/0.2-SNAPSHOT/gora-hbase-0.2-SNAPSHOT.pom
[JENKINS] Archiving <https://builds.apache.org/job/gora-trunk/ws/trunk./gora-hbase/target/gora-hbase-0.2-SNAPSHOT.jar>
to /home/hudson/hudson/jobs/gora-trunk/modules/org.apache.gora$gora-hbase/builds/2012-04-09_05-04-41/archive/org.apache.gora/gora-hbase/0.2-SNAPSHOT/gora-hbase-0.2-SNAPSHOT.jar
[JENKINS] Archiving <https://builds.apache.org/job/gora-trunk/ws/trunk./gora-hbase/target/gora-hbase-0.2-SNAPSHOT-tests.jar>
to /home/hudson/hudson/jobs/gora-trunk/modules/org.apache.gora$gora-hbase/builds/2012-04-09_05-04-41/archive/org.apache.gora/gora-hbase/0.2-SNAPSHOT/gora-hbase-0.2-SNAPSHOT-tests.jar
[INFO] Downloading: http://repo1.maven.org/maven2/org/apache/accumulo/accumulo-core/1.4.0/accumulo-core-1.4.0.pom
                                                                        
[INFO] ------------------------------------------------------------------------
[INFO] Building Apache Gora :: Accumulo 0.2-SNAPSHOT
[INFO] ------------------------------------------------------------------------
[JENKINS] Archiving <https://builds.apache.org/job/gora-trunk/ws/trunk./gora-accumulo/pom.xml>
to /home/hudson/hudson/jobs/gora-trunk/modules/org.apache.gora$gora-accumulo/builds/2012-04-09_05-04-41/archive/org.apache.gora/gora-accumulo/0.2-SNAPSHOT/gora-accumulo-0.2-SNAPSHOT.pom
[INFO] ------------------------------------------------------------------------
[INFO] Reactor Summary:
[INFO] 
[INFO] Apache Gora ....................................... SUCCESS [21.706s]
[INFO] Apache Gora :: Core ............................... SUCCESS [1:38.046s]
[INFO] Apache Gora :: Hbase .............................. SUCCESS [1:55.168s]
[INFO] Apache Gora :: Accumulo ........................... FAILURE [21.070s]
[INFO] Apache Gora :: Cassandra .......................... SKIPPED
[INFO] Apache Gora :: SQL ................................ SKIPPED
[INFO] Apache Gora :: Tutorial ........................... SKIPPED
[INFO] ------------------------------------------------------------------------
[INFO] BUILD FAILURE
[INFO] ------------------------------------------------------------------------
[INFO] Total time: 4:24.763s
[INFO] Finished at: Mon Apr 09 05:09:25 UTC 2012
[INFO] Final Memory: 48M/189M
[INFO] ------------------------------------------------------------------------
mavenExecutionResult exceptions not empty
message : Failed to execute goal on project gora-accumulo: Could not resolve dependencies
for project org.apache.gora:gora-accumulo:bundle:0.2-SNAPSHOT: Failed to collect dependencies
for [org.apache.gora:gora-core:jar:0.2-SNAPSHOT (compile), org.apache.gora:gora-core:jar:tests:0.2-SNAPSHOT
(test), org.apache.accumulo:accumulo-core:jar:1.4.0 (compile), org.apache.hadoop:avro:jar:1.3.3
(compile), log4j:log4j:jar:1.2.16 (compile), junit:junit:jar:4.10 (compile), org.apache.hadoop:hadoop-test:jar:1.0.1
(compile)]
cause : Could not resolve dependencies for project org.apache.gora:gora-accumulo:bundle:0.2-SNAPSHOT:
Failed to collect dependencies for [org.apache.gora:gora-core:jar:0.2-SNAPSHOT (compile),
org.apache.gora:gora-core:jar:tests:0.2-SNAPSHOT (test), org.apache.accumulo:accumulo-core:jar:1.4.0
(compile), org.apache.hadoop:avro:jar:1.3.3 (compile), log4j:log4j:jar:1.2.16 (compile), junit:junit:jar:4.10
(compile), org.apache.hadoop:hadoop-test:jar:1.0.1 (compile)]
Stack trace : 
org.apache.maven.lifecycle.LifecycleExecutionException: Failed to execute goal on project
gora-accumulo: Could not resolve dependencies for project org.apache.gora:gora-accumulo:bundle:0.2-SNAPSHOT:
Failed to collect dependencies for [org.apache.gora:gora-core:jar:0.2-SNAPSHOT (compile),
org.apache.gora:gora-core:jar:tests:0.2-SNAPSHOT (test), org.apache.accumulo:accumulo-core:jar:1.4.0
(compile), org.apache.hadoop:avro:jar:1.3.3 (compile), log4j:log4j:jar:1.2.16 (compile), junit:junit:jar:4.10
(compile), org.apache.hadoop:hadoop-test:jar:1.0.1 (compile)]
	at org.apache.maven.lifecycle.internal.LifecycleDependencyResolver.getDependencies(LifecycleDependencyResolver.java:196)
	at org.apache.maven.lifecycle.internal.LifecycleDependencyResolver.resolveProjectDependencies(LifecycleDependencyResolver.java:108)
	at org.apache.maven.lifecycle.internal.MojoExecutor.ensureDependenciesAreResolved(MojoExecutor.java:258)
	at org.apache.maven.lifecycle.internal.MojoExecutor.execute(MojoExecutor.java:201)
	at org.apache.maven.lifecycle.internal.MojoExecutor.execute(MojoExecutor.java:153)
	at org.apache.maven.lifecycle.internal.MojoExecutor.execute(MojoExecutor.java:145)
	at org.apache.maven.lifecycle.internal.LifecycleModuleBuilder.buildProject(LifecycleModuleBuilder.java:84)
	at org.apache.maven.lifecycle.internal.LifecycleModuleBuilder.buildProject(LifecycleModuleBuilder.java:59)
	at org.apache.maven.lifecycle.internal.LifecycleStarter.singleThreadedBuild(LifecycleStarter.java:183)
	at org.apache.maven.lifecycle.internal.LifecycleStarter.execute(LifecycleStarter.java:161)
	at org.apache.maven.DefaultMaven.doExecute(DefaultMaven.java:319)
	at org.apache.maven.DefaultMaven.execute(DefaultMaven.java:156)
	at org.jvnet.hudson.maven3.launcher.Maven3Launcher.main(Maven3Launcher.java:79)
	at sun.reflect.NativeMethodAccessorImpl.invoke0(Native Method)
	at sun.reflect.NativeMethodAccessorImpl.invoke(NativeMethodAccessorImpl.java:39)
	at sun.reflect.DelegatingMethodAccessorImpl.invoke(DelegatingMethodAccessorImpl.java:25)
	at java.lang.reflect.Method.invoke(Method.java:597)
	at org.codehaus.plexus.classworlds.launcher.Launcher.launchStandard(Launcher.java:329)
	at org.codehaus.plexus.classworlds.launcher.Launcher.launch(Launcher.java:239)
	at org.jvnet.hudson.maven3.agent.Maven3Main.launch(Maven3Main.java:158)
	at hudson.maven.Maven3Builder.call(Maven3Builder.java:104)
	at hudson.maven.Maven3Builder.call(Maven3Builder.java:70)
	at hudson.remoting.UserRequest.perform(UserRequest.java:118)
	at hudson.remoting.UserRequest.perform(UserRequest.java:48)
	at hudson.remoting.Request$2.run(Request.java:287)
	at hudson.remoting.InterceptingExecutorService$1.call(InterceptingExecutorService.java:72)
	at java.util.concurrent.FutureTask$Sync.innerRun(FutureTask.java:303)
	at java.util.concurrent.FutureTask.run(FutureTask.java:138)
	at java.util.concurrent.ThreadPoolExecutor$Worker.runTask(ThreadPoolExecutor.java:886)
	at java.util.concurrent.ThreadPoolExecutor$Worker.run(ThreadPoolExecutor.java:908)
	at java.lang.Thread.run(Thread.java:662)
Caused by: org.apache.maven.project.DependencyResolutionException: Could not resolve dependencies
for project org.apache.gora:gora-accumulo:bundle:0.2-SNAPSHOT: Failed to collect dependencies
for [org.apache.gora:gora-core:jar:0.2-SNAPSHOT (compile), org.apache.gora:gora-core:jar:tests:0.2-SNAPSHOT
(test), org.apache.accumulo:accumulo-core:jar:1.4.0 (compile), org.apache.hadoop:avro:jar:1.3.3
(compile), log4j:log4j:jar:1.2.16 (compile), junit:junit:jar:4.10 (compile), org.apache.hadoop:hadoop-test:jar:1.0.1
(compile)]
	at org.apache.maven.project.DefaultProjectDependenciesResolver.resolve(DefaultProjectDependenciesResolver.java:139)
	at org.apache.maven.lifecycle.internal.LifecycleDependencyResolver.getDependencies(LifecycleDependencyResolver.java:171)
	... 30 more
Caused by: org.sonatype.aether.collection.DependencyCollectionException: Failed to collect
dependencies for [org.apache.gora:gora-core:jar:0.2-SNAPSHOT (compile), org.apache.gora:gora-core:jar:tests:0.2-SNAPSHOT
(test), org.apache.accumulo:accumulo-core:jar:1.4.0 (compile), org.apache.hadoop:avro:jar:1.3.3
(compile), log4j:log4j:jar:1.2.16 (compile), junit:junit:jar:4.10 (compile), org.apache.hadoop:hadoop-test:jar:1.0.1
(compile)]
	at org.sonatype.aether.impl.internal.DefaultDependencyCollector.collectDependencies(DefaultDependencyCollector.java:262)
	at org.sonatype.aether.impl.internal.DefaultRepositorySystem.collectDependencies(DefaultRepositorySystem.java:345)
	at org.apache.maven.project.DefaultProjectDependenciesResolver.resolve(DefaultProjectDependenciesResolver.java:131)
	... 31 more
Caused by: org.sonatype.aether.resolution.ArtifactDescriptorException: Failed to read artifact
descriptor for org.apache.accumulo:accumulo-core:jar:1.4.0
	at org.apache.maven.repository.internal.DefaultArtifactDescriptorReader.loadPom(DefaultArtifactDescriptorReader.java:282)
	at org.apache.maven.repository.internal.DefaultArtifactDescriptorReader.readArtifactDescriptor(DefaultArtifactDescriptorReader.java:172)
	at org.sonatype.aether.impl.internal.DefaultDependencyCollector.process(DefaultDependencyCollector.java:419)
	at org.sonatype.aether.impl.internal.DefaultDependencyCollector.collectDependencies(DefaultDependencyCollector.java:243)
	... 33 more
Caused by: org.sonatype.aether.resolution.ArtifactResolutionException: Could not transfer
artifact org.apache.accumulo:accumulo-core:pom:1.4.0 from/to central (http://repo1.maven.org/maven2):
Error transferring file: Connection timed out
	at org.sonatype.aether.impl.internal.DefaultArtifactResolver.resolve(DefaultArtifactResolver.java:541)
	at org.sonatype.aether.impl.internal.DefaultArtifactResolver.resolveArtifacts(DefaultArtifactResolver.java:220)
	at org.sonatype.aether.impl.internal.DefaultArtifactResolver.resolveArtifact(DefaultArtifactResolver.java:197)
	at org.apache.maven.repository.internal.DefaultArtifactDescriptorReader.loadPom(DefaultArtifactDescriptorReader.java:267)
	... 36 more
Caused by: org.sonatype.aether.transfer.ArtifactTransferException: Could not transfer artifact
org.apache.accumulo:accumulo-core:pom:1.4.0 from/to central (http://repo1.maven.org/maven2):
Error transferring file: Connection timed out
	at org.sonatype.aether.connector.wagon.WagonRepositoryConnector$4.wrap(WagonRepositoryConnector.java:949)
	at org.sonatype.aether.connector.wagon.WagonRepositoryConnector$4.wrap(WagonRepositoryConnector.java:940)
	at org.sonatype.aether.connector.wagon.WagonRepositoryConnector$GetTask.flush(WagonRepositoryConnector.java:695)
	at org.sonatype.aether.connector.wagon.WagonRepositoryConnector$GetTask.flush(WagonRepositoryConnector.java:689)
	at org.sonatype.aether.connector.wagon.WagonRepositoryConnector.get(WagonRepositoryConnector.java:445)
	at org.sonatype.aether.impl.internal.DefaultArtifactResolver.resolve(DefaultArtifactResolver.java:460)
	... 39 more
Caused by: org.apache.maven.wagon.TransferFailedException: Error transferring file: Connection
timed out
	at org.apache.maven.wagon.providers.http.LightweightHttpWagon.fillInputData(LightweightHttpWagon.java:143)
	at org.apache.maven.wagon.StreamWagon.getInputStream(StreamWagon.java:116)
	at org.apache.maven.wagon.StreamWagon.getIfNewer(StreamWagon.java:88)
	at org.apache.maven.wagon.StreamWagon.get(StreamWagon.java:61)
	at org.sonatype.aether.connector.wagon.WagonRepositoryConnector$GetTask.run(WagonRepositoryConnector.java:608)
	at org.sonatype.aether.util.concurrency.RunnableErrorForwarder$1.run(RunnableErrorForwarder.java:64)
	... 3 more
Caused by: java.net.ConnectException: Connection timed out
	at java.net.PlainSocketImpl.socketConnect(Native Method)
	at java.net.PlainSocketImpl.doConnect(PlainSocketImpl.java:351)
	at java.net.PlainSocketImpl.connectToAddress(PlainSocketImpl.java:213)
	at java.net.PlainSocketImpl.connect(PlainSocketImpl.java:200)
	at java.net.SocksSocketImpl.connect(SocksSocketImpl.java:366)
	at java.net.Socket.connect(Socket.java:529)
	at java.net.Socket.connect(Socket.java:478)
	at sun.net.NetworkClient.doConnect(NetworkClient.java:163)
	at sun.net.www.http.HttpClient.openServer(HttpClient.java:395)
	at sun.net.www.http.HttpClient.openServer(HttpClient.java:530)
	at sun.net.www.http.HttpClient.<init>(HttpClient.java:234)
	at sun.net.www.http.HttpClient.New(HttpClient.java:307)
	at sun.net.www.http.HttpClient.New(HttpClient.java:324)
	at sun.net.www.protocol.http.HttpURLConnection.getNewHttpClient(HttpURLConnection.java:970)
	at sun.net.www.protocol.http.HttpURLConnection.plainConnect(HttpURLConnection.java:911)
	at sun.net.www.protocol.http.HttpURLConnection.connect(HttpURLConnection.java:836)
	at sun.net.www.protocol.http.HttpURLConnection.getInputStream(HttpURLConnection.java:1172)
	at java.net.HttpURLConnection.getResponseCode(HttpURLConnection.java:379)
	at org.apache.maven.wagon.providers.http.LightweightHttpWagon.fillInputData(LightweightHttpWagon.java:115)
	... 8 more
Maven failed with error.
Sending e-mails to: dev@gora.apache.org
Sending e-mails to: dev@gora.apache.org
channel stopped

Mime
View raw message