gora-dev mailing list archives

Site index · List index
Message view « Date » · « Thread »
Top « Date » · « Thread »
From Apache Jenkins Server <jenk...@builds.apache.org>
Subject Build failed in Jenkins: gora-trunk #218
Date Sun, 08 Apr 2012 13:36:04 GMT
See <https://builds.apache.org/job/gora-trunk/218/changes>

Changes:

[lewismc] Prepare all pom's for RC and minor updates to NOTICE and README

------------------------------------------
[...truncated 13267 lines...]
[INFO] META-INF/maven/org.apache.gora/gora-sql/pom.xml already added, skipping
[INFO] META-INF/maven/org.apache.gora/gora-sql/pom.properties already added, skipping
[INFO] [INFO] Building jar: <https://builds.apache.org/job/gora-trunk/ws/trunk./gora-sql/target/gora-sql-0.2-tests.jar>

[INFO] --- maven-jar-plugin:2.4:test-jar (default) @ gora-sql ---
[INFO] [INFO] Installing <https://builds.apache.org/job/gora-trunk/ws/trunk./gora-sql/target/gora-sql-0.2.jar>
to /home/jenkins/jenkins-slave/maven-repositories/0/org/apache/gora/gora-sql/0.2/gora-sql-0.2.jar
[INFO] Installing <https://builds.apache.org/job/gora-trunk/ws/trunk./gora-sql/pom.xml>
to /home/jenkins/jenkins-slave/maven-repositories/0/org/apache/gora/gora-sql/0.2/gora-sql-0.2.pom
[INFO] Installing <https://builds.apache.org/job/gora-trunk/ws/trunk./gora-sql/target/gora-sql-0.2-tests.jar>
to /home/jenkins/jenkins-slave/maven-repositories/0/org/apache/gora/gora-sql/0.2/gora-sql-0.2-tests.jar

[INFO] --- maven-install-plugin:2.3.1:install (default-install) @ gora-sql ---
[INFO] 
[INFO] --- maven-bundle-plugin:2.3.7:install (default-install) @ gora-sql ---
[INFO] Installing org/apache/gora/gora-sql/0.2/gora-sql-0.2.jar
[INFO] Writing OBR metadata
[JENKINS] Archiving <https://builds.apache.org/job/gora-trunk/ws/trunk./gora-sql/pom.xml>
to /home/hudson/hudson/jobs/gora-trunk/modules/org.apache.gora$gora-sql/builds/2012-04-08_13-01-24/archive/org.apache.gora/gora-sql/0.2/gora-sql-0.2.pom
[JENKINS] Archiving <https://builds.apache.org/job/gora-trunk/ws/trunk./gora-sql/target/gora-sql-0.2.jar>
to /home/hudson/hudson/jobs/gora-trunk/modules/org.apache.gora$gora-sql/builds/2012-04-08_13-01-24/archive/org.apache.gora/gora-sql/0.2/gora-sql-0.2.jar
[JENKINS] Archiving <https://builds.apache.org/job/gora-trunk/ws/trunk./gora-sql/target/gora-sql-0.2-tests.jar>
to /home/hudson/hudson/jobs/gora-trunk/modules/org.apache.gora$gora-sql/builds/2012-04-08_13-01-24/archive/org.apache.gora/gora-sql/0.2/gora-sql-0.2-tests.jar
[INFO]                                                                         
[INFO] ------------------------------------------------------------------------
[INFO] Building Apache Gora :: Tutorial 0.2
[INFO] ------------------------------------------------------------------------
[INFO] Source directory: <https://builds.apache.org/job/gora-trunk/ws/trunk./gora-tutorial/src/examples/java>
added.
[INFO] 
[INFO] --- build-helper-maven-plugin:1.7:add-source (default) @ gora-tutorial ---
[INFO] 
[INFO] --- maven-remote-resources-plugin:1.2.1:process (default) @ gora-tutorial ---
Downloading: http://repo1.maven.org/maven2/org/apache/thrift/thrift/0.2.0/thrift-0.2.0.pom
[debug] execute contextualize
[INFO] [INFO] Using 'UTF-8' encoding to copy filtered resources.
[INFO] Copying 1 resource
[INFO] Copying 3 resources

[INFO] --- maven-resources-plugin:2.5:resources (default-resources) @ gora-tutorial ---
[INFO] [INFO] Compiling 6 source files to <https://builds.apache.org/job/gora-trunk/ws/trunk./gora-tutorial/target/classes>

[INFO] --- maven-compiler-plugin:2.3.2:compile (default-compile) @ gora-tutorial ---
[INFO] 
[INFO] --- maven-bundle-plugin:2.3.7:manifest (bundle-manifest) @ gora-tutorial ---
[debug] execute contextualize
[INFO] [INFO] Using 'UTF-8' encoding to copy filtered resources.
[INFO] skip non existing resourceDirectory <https://builds.apache.org/job/gora-trunk/ws/trunk./gora-tutorial/src/test/resources>
[INFO] Copying 3 resources

[INFO] --- maven-resources-plugin:2.5:testResources (default-testResources) @ gora-tutorial
---
[INFO] [INFO] Nothing to compile - all classes are up to date

[INFO] --- maven-compiler-plugin:2.3.2:testCompile (default-testCompile) @ gora-tutorial ---
[INFO] [INFO] Surefire report directory: <https://builds.apache.org/job/gora-trunk/ws/trunk./gora-tutorial/target/surefire-reports>

-------------------------------------------------------
 T E S T S
-------------------------------------------------------

-------------------------------------------------------
 T E S T S
-------------------------------------------------------

Results :

Tests run: 0, Failures: 0, Errors: 0, Skipped: 0


[INFO] --- maven-surefire-plugin:2.12:test (default-test) @ gora-tutorial ---
[JENKINS] Recording test results
[INFO] [INFO] Building jar: <https://builds.apache.org/job/gora-trunk/ws/trunk./gora-tutorial/target/gora-tutorial-0.2.jar>

[INFO] --- maven-jar-plugin:2.4:jar (default-jar) @ gora-tutorial ---
[INFO] META-INF/maven/org.apache.gora/gora-tutorial/pom.xml already added, skipping
[INFO] META-INF/maven/org.apache.gora/gora-tutorial/pom.properties already added, skipping
[INFO] 
[INFO] --- maven-site-plugin:3.0:attach-descriptor (attach-descriptor) @ gora-tutorial ---
[INFO] [INFO] Copying xmlParserAPIs-2.6.2.jar to <https://builds.apache.org/job/gora-trunk/ws/trunk./gora-tutorial/lib/xmlParserAPIs-2.6.2.jar>
[INFO] Copying oro-2.0.8.jar to <https://builds.apache.org/job/gora-trunk/ws/trunk./gora-tutorial/lib/oro-2.0.8.jar>
[INFO] Copying slf4j-api-1.5.8.jar to <https://builds.apache.org/job/gora-trunk/ws/trunk./gora-tutorial/lib/slf4j-api-1.5.8.jar>
[INFO] Copying ftpserver-deprecated-1.0.0-M2.jar to <https://builds.apache.org/job/gora-trunk/ws/trunk./gora-tutorial/lib/ftpserver-deprecated-1.0.0-M2.jar>
[INFO] Copying hamcrest-core-1.1.jar to <https://builds.apache.org/job/gora-trunk/ws/trunk./gora-tutorial/lib/hamcrest-core-1.1.jar>
[INFO] Copying stax-api-1.0.1.jar to <https://builds.apache.org/job/gora-trunk/ws/trunk./gora-tutorial/lib/stax-api-1.0.1.jar>
[INFO] Copying slf4j-log4j12-1.5.8.jar to <https://builds.apache.org/job/gora-trunk/ws/trunk./gora-tutorial/lib/slf4j-log4j12-1.5.8.jar>
[INFO] Copying commons-net-1.4.1.jar to <https://builds.apache.org/job/gora-trunk/ws/trunk./gora-tutorial/lib/commons-net-1.4.1.jar>
[INFO] Copying guava-10.0.1.jar to <https://builds.apache.org/job/gora-trunk/ws/trunk./gora-tutorial/lib/guava-10.0.1.jar>
[INFO] Copying neethi-3.0.1.jar to <https://builds.apache.org/job/gora-trunk/ws/trunk./gora-tutorial/lib/neethi-3.0.1.jar>
[INFO] Copying jettison-1.3.1.jar to <https://builds.apache.org/job/gora-trunk/ws/trunk./gora-tutorial/lib/jettison-1.3.1.jar>
[INFO] Copying cxf-rt-transports-http-2.5.2.jar to <https://builds.apache.org/job/gora-trunk/ws/trunk./gora-tutorial/lib/cxf-rt-transports-http-2.5.2.jar>
[INFO] Copying cxf-rt-transports-common-2.5.2.jar to <https://builds.apache.org/job/gora-trunk/ws/trunk./gora-tutorial/lib/cxf-rt-transports-common-2.5.2.jar>
[INFO] Copying commons-beanutils-1.7.0.jar to <https://builds.apache.org/job/gora-trunk/ws/trunk./gora-tutorial/lib/commons-beanutils-1.7.0.jar>
[INFO] Copying cxf-rt-core-2.5.2.jar to <https://builds.apache.org/job/gora-trunk/ws/trunk./gora-tutorial/lib/cxf-rt-core-2.5.2.jar>
[INFO] Copying jackson-jaxrs-1.5.5.jar to <https://builds.apache.org/job/gora-trunk/ws/trunk./gora-tutorial/lib/jackson-jaxrs-1.5.5.jar>
[INFO] Copying commons-httpclient-3.1.jar to <https://builds.apache.org/job/gora-trunk/ws/trunk./gora-tutorial/lib/commons-httpclient-3.1.jar>
[INFO] Copying junit-4.10.jar to <https://builds.apache.org/job/gora-trunk/ws/trunk./gora-tutorial/lib/junit-4.10.jar>
[INFO] Copying gora-core-0.2-tests.jar to <https://builds.apache.org/job/gora-trunk/ws/trunk./gora-tutorial/lib/gora-core-0.2-tests.jar>
[INFO] Copying jdom-1.1.2.jar to <https://builds.apache.org/job/gora-trunk/ws/trunk./gora-tutorial/lib/jdom-1.1.2.jar>
[INFO] Copying xmlschema-core-2.0.1.jar to <https://builds.apache.org/job/gora-trunk/ws/trunk./gora-tutorial/lib/xmlschema-core-2.0.1.jar>
[INFO] Copying cxf-rt-frontend-jaxrs-2.5.2.jar to <https://builds.apache.org/job/gora-trunk/ws/trunk./gora-tutorial/lib/cxf-rt-frontend-jaxrs-2.5.2.jar>

[INFO] Copying mina-core-2.0.0-M5.jar to <https://builds.apache.org/job/gora-trunk/ws/trunk./gora-tutorial/lib/mina-core-2.0.0-M5.jar>
[INFO] [INFO] Copying avro-1.3.3.jar to <https://builds.apache.org/job/gora-trunk/ws/trunk./gora-tutorial/lib/avro-1.3.3.jar>
[INFO] Copying jsr311-api-1.1.1.jar to <https://builds.apache.org/job/gora-trunk/ws/trunk./gora-tutorial/lib/jsr311-api-1.1.1.jar>
[INFO] Copying jersey-server-1.4.jar to <https://builds.apache.org/job/gora-trunk/ws/trunk./gora-tutorial/lib/jersey-server-1.4.jar>
--- maven-dependency-plugin:2.4:copy-dependencies (default) @ gora-tutorial ---
[INFO] Copying commons-cli-1.2.jar to <https://builds.apache.org/job/gora-trunk/ws/trunk./gora-tutorial/lib/commons-cli-1.2.jar>
[INFO] Copying xom-1.0.jar to <https://builds.apache.org/job/gora-trunk/ws/trunk./gora-tutorial/lib/xom-1.0.jar>
[INFO] Copying icu4j-2.6.1.jar to <https://builds.apache.org/job/gora-trunk/ws/trunk./gora-tutorial/lib/icu4j-2.6.1.jar>
[INFO] Copying jasper-compiler-5.5.23.jar to <https://builds.apache.org/job/gora-trunk/ws/trunk./gora-tutorial/lib/jasper-compiler-5.5.23.jar>
[INFO] Copying hadoop-core-1.0.1.jar to <https://builds.apache.org/job/gora-trunk/ws/trunk./gora-tutorial/lib/hadoop-core-1.0.1.jar>
[INFO] Copying hbase-0.90.4-tests.jar to <https://builds.apache.org/job/gora-trunk/ws/trunk./gora-tutorial/lib/hbase-0.90.4-tests.jar>
[INFO] Copying log4j-1.2.16.jar to <https://builds.apache.org/job/gora-trunk/ws/trunk./gora-tutorial/lib/log4j-1.2.16.jar>
[INFO] Copying cxf-api-2.5.2.jar to <https://builds.apache.org/job/gora-trunk/ws/trunk./gora-tutorial/lib/cxf-api-2.5.2.jar>
[INFO] Copying spring-web-3.0.6.RELEASE.jar to <https://builds.apache.org/job/gora-trunk/ws/trunk./gora-tutorial/lib/spring-web-3.0.6.RELEASE.jar>
[INFO] Copying stax2-api-3.1.1.jar to <https://builds.apache.org/job/gora-trunk/ws/trunk./gora-tutorial/lib/stax2-api-3.1.1.jar>
[INFO] Copying gora-sql-0.2.jar to <https://builds.apache.org/job/gora-trunk/ws/trunk./gora-tutorial/lib/gora-sql-0.2.jar>
[INFO] Copying spring-expression-3.0.6.RELEASE.jar to <https://builds.apache.org/job/gora-trunk/ws/trunk./gora-tutorial/lib/spring-expression-3.0.6.RELEASE.jar>
[INFO] Copying zookeeper-3.3.2.jar to <https://builds.apache.org/job/gora-trunk/ws/trunk./gora-tutorial/lib/zookeeper-3.3.2.jar>
[INFO] Copying kfs-0.3.jar to <https://builds.apache.org/job/gora-trunk/ws/trunk./gora-tutorial/lib/kfs-0.3.jar>
[INFO] Copying commons-codec-1.4.jar to <https://builds.apache.org/job/gora-trunk/ws/trunk./gora-tutorial/lib/commons-codec-1.4.jar>
[INFO] Copying thrift-0.2.0.jar to <https://builds.apache.org/job/gora-trunk/ws/trunk./gora-tutorial/lib/thrift-0.2.0.jar>
[INFO] Copying jersey-json-1.4.jar to <https://builds.apache.org/job/gora-trunk/ws/trunk./gora-tutorial/lib/jersey-json-1.4.jar>
[INFO] Copying ant-1.7.1.jar to <https://builds.apache.org/job/gora-trunk/ws/trunk./gora-tutorial/lib/ant-1.7.1.jar>
[INFO] Copying hsqldb-2.2.8.jar to <https://builds.apache.org/job/gora-trunk/ws/trunk./gora-tutorial/lib/hsqldb-2.2.8.jar>
[INFO] Copying jaxb-api-2.1.jar to <https://builds.apache.org/job/gora-trunk/ws/trunk./gora-tutorial/lib/jaxb-api-2.1.jar>
[INFO] Copying dom4j-1.6.1.jar to <https://builds.apache.org/job/gora-trunk/ws/trunk./gora-tutorial/lib/dom4j-1.6.1.jar>
[INFO] Copying woodstox-core-asl-4.1.1.jar to <https://builds.apache.org/job/gora-trunk/ws/trunk./gora-tutorial/lib/woodstox-core-asl-4.1.1.jar>
[INFO] Copying gora-hbase-0.2.jar to <https://builds.apache.org/job/gora-trunk/ws/trunk./gora-tutorial/lib/gora-hbase-0.2.jar>
[INFO] Copying spring-context-3.0.6.RELEASE.jar to <https://builds.apache.org/job/gora-trunk/ws/trunk./gora-tutorial/lib/spring-context-3.0.6.RELEASE.jar>
[INFO] Copying hadoop-test-1.0.1.jar to <https://builds.apache.org/job/gora-trunk/ws/trunk./gora-tutorial/lib/hadoop-test-1.0.1.jar>
[INFO] Copying commons-el-1.0.jar to <https://builds.apache.org/job/gora-trunk/ws/trunk./gora-tutorial/lib/commons-el-1.0.jar>
[INFO] Copying slf4j-jdk14-1.5.8.jar to <https://builds.apache.org/job/gora-trunk/ws/trunk./gora-tutorial/lib/slf4j-jdk14-1.5.8.jar>
[INFO] Copying cxf-rt-bindings-xml-2.5.2.jar to <https://builds.apache.org/job/gora-trunk/ws/trunk./gora-tutorial/lib/cxf-rt-bindings-xml-2.5.2.jar>
[INFO] Copying asm-3.1.jar to <https://builds.apache.org/job/gora-trunk/ws/trunk./gora-tutorial/lib/asm-3.1.jar>
[INFO] Copying hbase-0.90.4.jar to <https://builds.apache.org/job/gora-trunk/ws/trunk./gora-tutorial/lib/hbase-0.90.4.jar>
[INFO] Copying core-3.1.1.jar to <https://builds.apache.org/job/gora-trunk/ws/trunk./gora-tutorial/lib/core-3.1.1.jar>
[INFO] Copying jackson-xc-1.5.5.jar to <https://builds.apache.org/job/gora-trunk/ws/trunk./gora-tutorial/lib/jackson-xc-1.5.5.jar>
[INFO] Copying geronimo-javamail_1.4_spec-1.7.1.jar to <https://builds.apache.org/job/gora-trunk/ws/trunk./gora-tutorial/lib/geronimo-javamail_1.4_spec-1.7.1.jar>
[INFO] Copying spring-asm-3.0.6.RELEASE.jar to <https://builds.apache.org/job/gora-trunk/ws/trunk./gora-tutorial/lib/spring-asm-3.0.6.RELEASE.jar>
[INFO] Copying commons-logging-1.1.1.jar to <https://builds.apache.org/job/gora-trunk/ws/trunk./gora-tutorial/lib/commons-logging-1.1.1.jar>
[INFO] Copying commons-lang-2.6.jar to <https://builds.apache.org/job/gora-trunk/ws/trunk./gora-tutorial/lib/commons-lang-2.6.jar>
[INFO] Copying spring-beans-3.0.6.RELEASE.jar to <https://builds.apache.org/job/gora-trunk/ws/trunk./gora-tutorial/lib/spring-beans-3.0.6.RELEASE.jar>
[INFO] Copying jsp-2.1-6.1.14.jar to <https://builds.apache.org/job/gora-trunk/ws/trunk./gora-tutorial/lib/jsp-2.1-6.1.14.jar>
[INFO] Copying jetty-util-6.1.26.jar to <https://builds.apache.org/job/gora-trunk/ws/trunk./gora-tutorial/lib/jetty-util-6.1.26.jar>
[INFO] Copying commons-digester-1.8.jar to <https://builds.apache.org/job/gora-trunk/ws/trunk./gora-tutorial/lib/commons-digester-1.8.jar>
[INFO] Copying activation-1.1.jar to <https://builds.apache.org/job/gora-trunk/ws/trunk./gora-tutorial/lib/activation-1.1.jar>
[INFO] Copying xmlenc-0.52.jar to <https://builds.apache.org/job/gora-trunk/ws/trunk./gora-tutorial/lib/xmlenc-0.52.jar>
[INFO] Copying commons-beanutils-core-1.8.0.jar to <https://builds.apache.org/job/gora-trunk/ws/trunk./gora-tutorial/lib/commons-beanutils-core-1.8.0.jar>
[INFO] Copying xalan-2.6.0.jar to <https://builds.apache.org/job/gora-trunk/ws/trunk./gora-tutorial/lib/xalan-2.6.0.jar>
[INFO] Copying aopalliance-1.0.jar to <https://builds.apache.org/job/gora-trunk/ws/trunk./gora-tutorial/lib/aopalliance-1.0.jar>
[INFO] Copying ftpserver-core-1.0.0.jar to <https://builds.apache.org/job/gora-trunk/ws/trunk./gora-tutorial/lib/ftpserver-core-1.0.0.jar>
[INFO] Copying xml-apis-1.3.02.jar to <https://builds.apache.org/job/gora-trunk/ws/trunk./gora-tutorial/lib/xml-apis-1.3.02.jar>
[INFO] Copying spring-aop-3.0.6.RELEASE.jar to <https://builds.apache.org/job/gora-trunk/ws/trunk./gora-tutorial/lib/spring-aop-3.0.6.RELEASE.jar>
[INFO] Copying jersey-core-1.4.jar to <https://builds.apache.org/job/gora-trunk/ws/trunk./gora-tutorial/lib/jersey-core-1.4.jar>
[INFO] Copying jaxb-impl-2.1.12.jar to <https://builds.apache.org/job/gora-trunk/ws/trunk./gora-tutorial/lib/jaxb-impl-2.1.12.jar>
[INFO] Copying paranamer-2.2.jar to <https://builds.apache.org/job/gora-trunk/ws/trunk./gora-tutorial/lib/paranamer-2.2.jar>
[INFO] Copying jsr305-1.3.9.jar to <https://builds.apache.org/job/gora-trunk/ws/trunk./gora-tutorial/lib/jsr305-1.3.9.jar>
[INFO] Copying mysql-connector-java-5.1.18.jar to <https://builds.apache.org/job/gora-trunk/ws/trunk./gora-tutorial/lib/mysql-connector-java-5.1.18.jar>
[INFO] Copying gora-core-0.2.jar to <https://builds.apache.org/job/gora-trunk/ws/trunk./gora-tutorial/lib/gora-core-0.2.jar>
[INFO] Copying servlet-api-2.5-6.1.14.jar to <https://builds.apache.org/job/gora-trunk/ws/trunk./gora-tutorial/lib/servlet-api-2.5-6.1.14.jar>
[INFO] Copying paranamer-ant-2.2.jar to <https://builds.apache.org/job/gora-trunk/ws/trunk./gora-tutorial/lib/paranamer-ant-2.2.jar>
[INFO] Copying spring-core-3.0.6.RELEASE.jar to <https://builds.apache.org/job/gora-trunk/ws/trunk./gora-tutorial/lib/spring-core-3.0.6.RELEASE.jar>
[INFO] Copying ftplet-api-1.0.0.jar to <https://builds.apache.org/job/gora-trunk/ws/trunk./gora-tutorial/lib/ftplet-api-1.0.0.jar>
[INFO] Copying jaxen-1.1.3.jar to <https://builds.apache.org/job/gora-trunk/ws/trunk./gora-tutorial/lib/jaxen-1.1.3.jar>
[INFO] Copying jsp-api-2.1-6.1.14.jar to <https://builds.apache.org/job/gora-trunk/ws/trunk./gora-tutorial/lib/jsp-api-2.1-6.1.14.jar>
[INFO] Copying commons-collections-3.2.1.jar to <https://builds.apache.org/job/gora-trunk/ws/trunk./gora-tutorial/lib/commons-collections-3.2.1.jar>
[INFO] Copying xercesImpl-2.9.1.jar to <https://builds.apache.org/job/gora-trunk/ws/trunk./gora-tutorial/lib/xercesImpl-2.9.1.jar>
[INFO] Copying jackson-mapper-asl-1.4.2.jar to <https://builds.apache.org/job/gora-trunk/ws/trunk./gora-tutorial/lib/jackson-mapper-asl-1.4.2.jar>
[INFO] Copying qdox-1.10.1.jar to <https://builds.apache.org/job/gora-trunk/ws/trunk./gora-tutorial/lib/qdox-1.10.1.jar>
[INFO] Copying ant-launcher-1.7.1.jar to <https://builds.apache.org/job/gora-trunk/ws/trunk./gora-tutorial/lib/ant-launcher-1.7.1.jar>
[INFO] Copying paranamer-generator-2.2.jar to <https://builds.apache.org/job/gora-trunk/ws/trunk./gora-tutorial/lib/paranamer-generator-2.2.jar>
[INFO] Copying cxf-common-utilities-2.5.2.jar to <https://builds.apache.org/job/gora-trunk/ws/trunk./gora-tutorial/lib/cxf-common-utilities-2.5.2.jar>
[INFO] Copying commons-configuration-1.6.jar to <https://builds.apache.org/job/gora-trunk/ws/trunk./gora-tutorial/lib/commons-configuration-1.6.jar>
[INFO] Copying jackson-core-asl-1.4.2.jar to <https://builds.apache.org/job/gora-trunk/ws/trunk./gora-tutorial/lib/jackson-core-asl-1.4.2.jar>
[INFO] Copying slf4j-simple-1.5.8.jar to <https://builds.apache.org/job/gora-trunk/ws/trunk./gora-tutorial/lib/slf4j-simple-1.5.8.jar>
[INFO] Copying commons-math-2.1.jar to <https://builds.apache.org/job/gora-trunk/ws/trunk./gora-tutorial/lib/commons-math-2.1.jar>
[INFO] Copying jasper-runtime-5.5.23.jar to <https://builds.apache.org/job/gora-trunk/ws/trunk./gora-tutorial/lib/jasper-runtime-5.5.23.jar>
[INFO] Copying jdom-1.0.jar to <https://builds.apache.org/job/gora-trunk/ws/trunk./gora-tutorial/lib/jdom-1.0.jar>
[INFO] Copying jruby-complete-1.6.0.jar to <https://builds.apache.org/job/gora-trunk/ws/trunk./gora-tutorial/lib/jruby-complete-1.6.0.jar>
[INFO] Copying wsdl4j-1.6.2.jar to <https://builds.apache.org/job/gora-trunk/ws/trunk./gora-tutorial/lib/wsdl4j-1.6.2.jar>
[INFO] Copying jetty-6.1.26.jar to <https://builds.apache.org/job/gora-trunk/ws/trunk./gora-tutorial/lib/jetty-6.1.26.jar>
[INFO] Copying protobuf-java-2.3.0.jar to <https://builds.apache.org/job/gora-trunk/ws/trunk./gora-tutorial/lib/protobuf-java-2.3.0.jar>
[INFO] 
[INFO] --- maven-jar-plugin:2.4:jar (default) @ gora-tutorial ---
[INFO] [INFO] Building jar: <https://builds.apache.org/job/gora-trunk/ws/trunk./gora-tutorial/target/gora-tutorial-0.2-tests.jar>

[INFO] --- maven-jar-plugin:2.4:test-jar (default) @ gora-tutorial ---
[INFO] [INFO] Installing <https://builds.apache.org/job/gora-trunk/ws/trunk./gora-tutorial/target/gora-tutorial-0.2.jar>
to /home/jenkins/jenkins-slave/maven-repositories/0/org/apache/gora/gora-tutorial/0.2/gora-tutorial-0.2.jar
[INFO] Installing <https://builds.apache.org/job/gora-trunk/ws/trunk./gora-tutorial/pom.xml>
to /home/jenkins/jenkins-slave/maven-repositories/0/org/apache/gora/gora-tutorial/0.2/gora-tutorial-0.2.pom
[INFO] Installing <https://builds.apache.org/job/gora-trunk/ws/trunk./gora-tutorial/target/gora-tutorial-0.2-tests.jar>
to /home/jenkins/jenkins-slave/maven-repositories/0/org/apache/gora/gora-tutorial/0.2/gora-tutorial-0.2-tests.jar

[INFO] --- maven-install-plugin:2.3.1:install (default-install) @ gora-tutorial ---
[JENKINS] Archiving <https://builds.apache.org/job/gora-trunk/ws/trunk./gora-tutorial/pom.xml>
to /home/hudson/hudson/jobs/gora-trunk/modules/org.apache.gora$gora-tutorial/builds/2012-04-08_13-01-24/archive/org.apache.gora/gora-tutorial/0.2/gora-tutorial-0.2.pom
[JENKINS] Archiving <https://builds.apache.org/job/gora-trunk/ws/trunk./gora-tutorial/target/gora-tutorial-0.2.jar>
to /home/hudson/hudson/jobs/gora-trunk/modules/org.apache.gora$gora-tutorial/builds/2012-04-08_13-01-24/archive/org.apache.gora/gora-tutorial/0.2/gora-tutorial-0.2.jar
[JENKINS] Archiving <https://builds.apache.org/job/gora-trunk/ws/trunk./gora-tutorial/target/gora-tutorial-0.2-tests.jar>
to /home/hudson/hudson/jobs/gora-trunk/modules/org.apache.gora$gora-tutorial/builds/2012-04-08_13-01-24/archive/org.apache.gora/gora-tutorial/0.2/gora-tutorial-0.2-tests.jar
[INFO] ------------------------------------------------------------------------
[INFO] Reactor Summary:
[INFO] 
[INFO] Apache Gora ....................................... SUCCESS [20.147s]
[INFO] Apache Gora :: Core ............................... SUCCESS [1:44.535s]
[INFO] Apache Gora :: Hbase .............................. SUCCESS [31:38.251s]
[INFO] Apache Gora :: Accumulo ........................... SUCCESS [8.379s]
[INFO] Apache Gora :: Cassandra .......................... SUCCESS [5.770s]
[INFO] Apache Gora :: SQL ................................ SUCCESS [6.178s]
[INFO] Apache Gora :: Tutorial ........................... SUCCESS [4.503s]
[INFO] ------------------------------------------------------------------------
[INFO] BUILD SUCCESS
[INFO] ------------------------------------------------------------------------
[INFO] Total time: 34:21.920s
[INFO] Finished at: Sun Apr 08 13:36:01 UTC 2012
[INFO] Final Memory: 67M/360M
[INFO] ------------------------------------------------------------------------
Waiting for Jenkins to finish collecting data
channel stopped
Maven RedeployPublished use remote ubuntu1 maven settings from : /home/jenkins/.m2/settings.xml
[ERROR] uniqueVersion == false is not anymore supported in maven 3
[INFO] Deployment in https://repository.apache.org/content/repositories/snapshots (id=apache.snapshots.https,uniqueVersion=false)
Deploying the main artifact gora-0.2.pom
Uploading: https://repository.apache.org/content/repositories/snapshots/org/apache/gora/gora/0.2/gora-0.2.pom
Uploading: https://repository.apache.org/content/repositories/snapshots/org/apache/gora/gora/0.2/gora-0.2.pom
ERROR: Failed to deploy artifacts: Could not transfer artifact org.apache.gora:gora:pom:0.2
from/to apache.snapshots.https (https://repository.apache.org/content/repositories/snapshots):
Failed to transfer file: https://repository.apache.org/content/repositories/snapshots/org/apache/gora/gora/0.2/gora-0.2.pom.
Return code is: 400, ReasonPhrase:Bad Request.
org.apache.maven.artifact.deployer.ArtifactDeploymentException: Failed to deploy artifacts:
Could not transfer artifact org.apache.gora:gora:pom:0.2 from/to apache.snapshots.https (https://repository.apache.org/content/repositories/snapshots):
Failed to transfer file: https://repository.apache.org/content/repositories/snapshots/org/apache/gora/gora/0.2/gora-0.2.pom.
Return code is: 400, ReasonPhrase:Bad Request.
	at org.apache.maven.artifact.deployer.DefaultArtifactDeployer.deploy(DefaultArtifactDeployer.java:141)
	at hudson.maven.reporters.MavenArtifactRecord.deploy(MavenArtifactRecord.java:182)
	at hudson.maven.RedeployPublisher.perform(RedeployPublisher.java:174)
	at hudson.tasks.BuildStepMonitor$1.perform(BuildStepMonitor.java:19)
	at hudson.model.AbstractBuild$AbstractRunner.perform(AbstractBuild.java:703)
	at hudson.model.AbstractBuild$AbstractRunner.performAllBuildSteps(AbstractBuild.java:678)
	at hudson.maven.MavenModuleSetBuild$RunnerImpl.post2(MavenModuleSetBuild.java:996)
	at hudson.model.AbstractBuild$AbstractRunner.post(AbstractBuild.java:625)
	at hudson.model.Run.run(Run.java:1438)
	at hudson.maven.MavenModuleSetBuild.run(MavenModuleSetBuild.java:479)
	at hudson.model.ResourceController.execute(ResourceController.java:88)
	at hudson.model.Executor.run(Executor.java:238)
Caused by: org.sonatype.aether.deployment.DeploymentException: Failed to deploy artifacts:
Could not transfer artifact org.apache.gora:gora:pom:0.2 from/to apache.snapshots.https (https://repository.apache.org/content/repositories/snapshots):
Failed to transfer file: https://repository.apache.org/content/repositories/snapshots/org/apache/gora/gora/0.2/gora-0.2.pom.
Return code is: 400, ReasonPhrase:Bad Request.
	at org.sonatype.aether.impl.internal.DefaultDeployer.deploy(DefaultDeployer.java:280)
	at org.sonatype.aether.impl.internal.DefaultDeployer.deploy(DefaultDeployer.java:211)
	at org.sonatype.aether.impl.internal.DefaultRepositorySystem.deploy(DefaultRepositorySystem.java:443)
	at org.apache.maven.artifact.deployer.DefaultArtifactDeployer.deploy(DefaultArtifactDeployer.java:137)
	... 11 more
Caused by: org.sonatype.aether.transfer.ArtifactTransferException: Could not transfer artifact
org.apache.gora:gora:pom:0.2 from/to apache.snapshots.https (https://repository.apache.org/content/repositories/snapshots):
Failed to transfer file: https://repository.apache.org/content/repositories/snapshots/org/apache/gora/gora/0.2/gora-0.2.pom.
Return code is: 400, ReasonPhrase:Bad Request.
	at org.sonatype.aether.connector.wagon.WagonRepositoryConnector$4.wrap(WagonRepositoryConnector.java:951)
	at org.sonatype.aether.connector.wagon.WagonRepositoryConnector$4.wrap(WagonRepositoryConnector.java:941)
	at org.sonatype.aether.connector.wagon.WagonRepositoryConnector$PutTask.run(WagonRepositoryConnector.java:837)
	at org.sonatype.aether.connector.wagon.WagonRepositoryConnector.put(WagonRepositoryConnector.java:467)
	at org.sonatype.aether.impl.internal.DefaultDeployer.deploy(DefaultDeployer.java:274)
	... 14 more
Caused by: org.apache.maven.wagon.TransferFailedException: Failed to transfer file: https://repository.apache.org/content/repositories/snapshots/org/apache/gora/gora/0.2/gora-0.2.pom.
Return code is: 400, ReasonPhrase:Bad Request.
	at org.apache.maven.wagon.shared.http4.AbstractHttpClientWagon.put(AbstractHttpClientWagon.java:562)
	at org.apache.maven.wagon.shared.http4.AbstractHttpClientWagon.put(AbstractHttpClientWagon.java:471)
	at org.apache.maven.wagon.shared.http4.AbstractHttpClientWagon.put(AbstractHttpClientWagon.java:451)
	at org.sonatype.aether.connector.wagon.WagonRepositoryConnector$PutTask.run(WagonRepositoryConnector.java:811)
	... 16 more
[INFO] Deployment failed after 0.61 sec
Build step 'Deploy artifacts to Maven repository' changed build result to FAILURE

Mime
View raw message