gora-dev mailing list archives

Site index · List index
Message view « Date » · « Thread »
Top « Date » · « Thread »
From Apache Jenkins Server <jenk...@builds.apache.org>
Subject Build failed in Jenkins: goraamazon_branch #105
Date Mon, 01 Oct 2012 05:39:35 GMT
See <https://builds.apache.org/job/goraamazon_branch/105/>

------------------------------------------
[...truncated 14782 lines...]
location: class org.apache.gora.dynamodb.TestDynamoDBStore
[ERROR] <https://builds.apache.org/job/goraamazon_branch/ws/branches/goraamazon/gora-dynamodb/src/test/java/org/apache/gora/dynamodb/TestDynamoDBStore.java>:[97,1]
method does not override or implement a method from a supertype
[ERROR] <https://builds.apache.org/job/goraamazon_branch/ws/branches/goraamazon/gora-dynamodb/src/test/java/org/apache/gora/dynamodb/TestDynamoDBStore.java>:[103,3]
cannot find symbol
symbol  : variable log
location: class org.apache.gora.dynamodb.TestDynamoDBStore
[ERROR] <https://builds.apache.org/job/goraamazon_branch/ws/branches/goraamazon/gora-dynamodb/src/test/java/org/apache/gora/dynamodb/TestDynamoDBStore.java>:[101,1]
method does not override or implement a method from a supertype
[ERROR] <https://builds.apache.org/job/goraamazon_branch/ws/branches/goraamazon/gora-dynamodb/src/test/java/org/apache/gora/dynamodb/TestDynamoDBStore.java>:[107,3]
cannot find symbol
symbol  : variable log
location: class org.apache.gora.dynamodb.TestDynamoDBStore
[ERROR] <https://builds.apache.org/job/goraamazon_branch/ws/branches/goraamazon/gora-dynamodb/src/test/java/org/apache/gora/dynamodb/TestDynamoDBStore.java>:[105,1]
method does not override or implement a method from a supertype
[ERROR] <https://builds.apache.org/job/goraamazon_branch/ws/branches/goraamazon/gora-dynamodb/src/test/java/org/apache/gora/dynamodb/TestDynamoDBStore.java>:[111,3]
cannot find symbol
symbol  : variable log
location: class org.apache.gora.dynamodb.TestDynamoDBStore
[ERROR] <https://builds.apache.org/job/goraamazon_branch/ws/branches/goraamazon/gora-dynamodb/src/test/java/org/apache/gora/dynamodb/TestDynamoDBStore.java>:[109,1]
method does not override or implement a method from a supertype
[ERROR] <https://builds.apache.org/job/goraamazon_branch/ws/branches/goraamazon/gora-dynamodb/src/test/java/org/apache/gora/dynamodb/TestDynamoDBStore.java>:[115,3]
cannot find symbol
symbol  : variable log
location: class org.apache.gora.dynamodb.TestDynamoDBStore
[ERROR] <https://builds.apache.org/job/goraamazon_branch/ws/branches/goraamazon/gora-dynamodb/src/test/java/org/apache/gora/dynamodb/TestDynamoDBStore.java>:[113,1]
method does not override or implement a method from a supertype
[ERROR] <https://builds.apache.org/job/goraamazon_branch/ws/branches/goraamazon/gora-dynamodb/src/test/java/org/apache/gora/dynamodb/TestDynamoDBStore.java>:[125,6]
cannot find symbol
symbol  : variable log
location: class org.apache.gora.dynamodb.TestDynamoDBStore
[ERROR] <https://builds.apache.org/job/goraamazon_branch/ws/branches/goraamazon/gora-dynamodb/src/test/java/org/apache/gora/dynamodb/TestDynamoDBStore.java>:[130,6]
cannot find symbol
symbol  : variable dataStore
location: class org.apache.gora.dynamodb.TestDynamoDBStore
[ERROR] <https://builds.apache.org/job/goraamazon_branch/ws/branches/goraamazon/gora-dynamodb/src/test/java/org/apache/gora/dynamodb/TestDynamoDBStore.java>:[133,6]
cannot find symbol
symbol  : variable dataStore
location: class org.apache.gora.dynamodb.TestDynamoDBStore
[ERROR] <https://builds.apache.org/job/goraamazon_branch/ws/branches/goraamazon/gora-dynamodb/src/test/java/org/apache/gora/dynamodb/TestDynamoDBStore.java>:[138,46]
cannot find symbol
symbol  : variable dataStore
location: class org.apache.gora.dynamodb.TestDynamoDBStore
[ERROR] <https://builds.apache.org/job/goraamazon_branch/ws/branches/goraamazon/gora-dynamodb/src/test/java/org/apache/gora/dynamodb/TestDynamoDBStore.java>:[138,6]
cannot find symbol
symbol  : variable log
location: class org.apache.gora.dynamodb.TestDynamoDBStore
[ERROR] <https://builds.apache.org/job/goraamazon_branch/ws/branches/goraamazon/gora-dynamodb/src/test/java/org/apache/gora/dynamodb/TestDynamoDBStore.java>:[140,6]
cannot find symbol
symbol  : variable log
location: class org.apache.gora.dynamodb.TestDynamoDBStore
[ERROR] <https://builds.apache.org/job/goraamazon_branch/ws/branches/goraamazon/gora-dynamodb/src/test/java/org/apache/gora/dynamodb/TestDynamoDBStore.java>:[122,2]
method does not override or implement a method from a supertype
[ERROR] <https://builds.apache.org/job/goraamazon_branch/ws/branches/goraamazon/gora-dynamodb/src/test/java/org/apache/gora/dynamodb/TestDynamoDBStore.java>:[151,6]
cannot find symbol
symbol  : variable log
location: class org.apache.gora.dynamodb.TestDynamoDBStore
[ERROR] <https://builds.apache.org/job/goraamazon_branch/ws/branches/goraamazon/gora-dynamodb/src/test/java/org/apache/gora/dynamodb/TestDynamoDBStore.java>:[156,6]
cannot find symbol
symbol  : variable dataStore
location: class org.apache.gora.dynamodb.TestDynamoDBStore
[ERROR] <https://builds.apache.org/job/goraamazon_branch/ws/branches/goraamazon/gora-dynamodb/src/test/java/org/apache/gora/dynamodb/TestDynamoDBStore.java>:[158,6]
cannot find symbol
symbol  : variable dataStore
location: class org.apache.gora.dynamodb.TestDynamoDBStore
[ERROR] <https://builds.apache.org/job/goraamazon_branch/ws/branches/goraamazon/gora-dynamodb/src/test/java/org/apache/gora/dynamodb/TestDynamoDBStore.java>:[160,6]
cannot find symbol
symbol  : variable log
location: class org.apache.gora.dynamodb.TestDynamoDBStore
[ERROR] <https://builds.apache.org/job/goraamazon_branch/ws/branches/goraamazon/gora-dynamodb/src/test/java/org/apache/gora/dynamodb/TestDynamoDBStore.java>:[148,2]
method does not override or implement a method from a supertype
[ERROR] <https://builds.apache.org/job/goraamazon_branch/ws/branches/goraamazon/gora-dynamodb/src/test/java/org/apache/gora/dynamodb/TestDynamoDBStore.java>:[184,1]
cannot find symbol
symbol  : variable log
location: class org.apache.gora.dynamodb.TestDynamoDBStore
[ERROR] <https://builds.apache.org/job/goraamazon_branch/ws/branches/goraamazon/gora-dynamodb/src/test/java/org/apache/gora/dynamodb/TestDynamoDBStore.java>:[185,22]
cannot find symbol
symbol  : variable dataStore
location: class org.apache.gora.dynamodb.TestDynamoDBStore
[ERROR] <https://builds.apache.org/job/goraamazon_branch/ws/branches/goraamazon/gora-dynamodb/src/test/java/org/apache/gora/dynamodb/TestDynamoDBStore.java>:[182,2]
method does not override or implement a method from a supertype
[ERROR] <https://builds.apache.org/job/goraamazon_branch/ws/branches/goraamazon/gora-dynamodb/src/test/java/org/apache/gora/dynamodb/TestDynamoDBStore.java>:[194,6]
cannot find symbol
symbol  : variable log
location: class org.apache.gora.dynamodb.TestDynamoDBStore
[ERROR] <https://builds.apache.org/job/goraamazon_branch/ws/branches/goraamazon/gora-dynamodb/src/test/java/org/apache/gora/dynamodb/TestDynamoDBStore.java>:[199,6]
cannot find symbol
symbol  : variable dataStore
location: class org.apache.gora.dynamodb.TestDynamoDBStore
[ERROR] <https://builds.apache.org/job/goraamazon_branch/ws/branches/goraamazon/gora-dynamodb/src/test/java/org/apache/gora/dynamodb/TestDynamoDBStore.java>:[202,6]
cannot find symbol
symbol  : variable dataStore
location: class org.apache.gora.dynamodb.TestDynamoDBStore
[ERROR] <https://builds.apache.org/job/goraamazon_branch/ws/branches/goraamazon/gora-dynamodb/src/test/java/org/apache/gora/dynamodb/TestDynamoDBStore.java>:[204,6]
cannot find symbol
symbol  : variable log
location: class org.apache.gora.dynamodb.TestDynamoDBStore
[ERROR] <https://builds.apache.org/job/goraamazon_branch/ws/branches/goraamazon/gora-dynamodb/src/test/java/org/apache/gora/dynamodb/TestDynamoDBStore.java>:[191,2]
method does not override or implement a method from a supertype
[ERROR] <https://builds.apache.org/job/goraamazon_branch/ws/branches/goraamazon/gora-dynamodb/src/test/java/org/apache/gora/dynamodb/TestDynamoDBStore.java>:[214,4]
cannot find symbol
symbol  : variable log
location: class org.apache.gora.dynamodb.TestDynamoDBStore
[ERROR] <https://builds.apache.org/job/goraamazon_branch/ws/branches/goraamazon/gora-dynamodb/src/test/java/org/apache/gora/dynamodb/TestDynamoDBStore.java>:[222,48]
cannot find symbol
symbol  : variable dataStore
location: class org.apache.gora.dynamodb.TestDynamoDBStore
[ERROR] <https://builds.apache.org/job/goraamazon_branch/ws/branches/goraamazon/gora-dynamodb/src/test/java/org/apache/gora/dynamodb/TestDynamoDBStore.java>:[225,3]
cannot find symbol
symbol  : variable log
location: class org.apache.gora.dynamodb.TestDynamoDBStore
[ERROR] <https://builds.apache.org/job/goraamazon_branch/ws/branches/goraamazon/gora-dynamodb/src/test/java/org/apache/gora/dynamodb/TestDynamoDBStore.java>:[212,2]
method does not override or implement a method from a supertype
[ERROR] <https://builds.apache.org/job/goraamazon_branch/ws/branches/goraamazon/gora-dynamodb/src/test/java/org/apache/gora/dynamodb/TestDynamoDBStore.java>:[235,1]
cannot find symbol
symbol  : variable log
location: class org.apache.gora.dynamodb.TestDynamoDBStore
[ERROR] <https://builds.apache.org/job/goraamazon_branch/ws/branches/goraamazon/gora-dynamodb/src/test/java/org/apache/gora/dynamodb/TestDynamoDBStore.java>:[249,45]
cannot find symbol
symbol  : variable dataStore
location: class org.apache.gora.dynamodb.TestDynamoDBStore
[ERROR] <https://builds.apache.org/job/goraamazon_branch/ws/branches/goraamazon/gora-dynamodb/src/test/java/org/apache/gora/dynamodb/TestDynamoDBStore.java>:[252,3]
cannot find symbol
symbol  : variable log
location: class org.apache.gora.dynamodb.TestDynamoDBStore
[ERROR] <https://builds.apache.org/job/goraamazon_branch/ws/branches/goraamazon/gora-dynamodb/src/test/java/org/apache/gora/dynamodb/TestDynamoDBStore.java>:[233,2]
method does not override or implement a method from a supertype
[ERROR] <https://builds.apache.org/job/goraamazon_branch/ws/branches/goraamazon/gora-dynamodb/src/test/java/org/apache/gora/dynamodb/TestDynamoDBStore.java>:[262,1]
cannot find symbol
symbol  : variable log
location: class org.apache.gora.dynamodb.TestDynamoDBStore
[ERROR] <https://builds.apache.org/job/goraamazon_branch/ws/branches/goraamazon/gora-dynamodb/src/test/java/org/apache/gora/dynamodb/TestDynamoDBStore.java>:[269,3]
cannot find symbol
symbol  : variable dataStore
location: class org.apache.gora.dynamodb.TestDynamoDBStore
[ERROR] <https://builds.apache.org/job/goraamazon_branch/ws/branches/goraamazon/gora-dynamodb/src/test/java/org/apache/gora/dynamodb/TestDynamoDBStore.java>:[271,15]
cannot find symbol
symbol  : variable dataStore
location: class org.apache.gora.dynamodb.TestDynamoDBStore
[ERROR] <https://builds.apache.org/job/goraamazon_branch/ws/branches/goraamazon/gora-dynamodb/src/test/java/org/apache/gora/dynamodb/TestDynamoDBStore.java>:[274,3]
cannot find symbol
symbol  : variable log
location: class org.apache.gora.dynamodb.TestDynamoDBStore
[ERROR] <https://builds.apache.org/job/goraamazon_branch/ws/branches/goraamazon/gora-dynamodb/src/test/java/org/apache/gora/dynamodb/TestDynamoDBStore.java>:[260,2]
method does not override or implement a method from a supertype
[ERROR] <https://builds.apache.org/job/goraamazon_branch/ws/branches/goraamazon/gora-dynamodb/src/test/java/org/apache/gora/dynamodb/TestDynamoDBStore.java>:[284,1]
cannot find symbol
symbol  : variable log
location: class org.apache.gora.dynamodb.TestDynamoDBStore
[ERROR] <https://builds.apache.org/job/goraamazon_branch/ws/branches/goraamazon/gora-dynamodb/src/test/java/org/apache/gora/dynamodb/TestDynamoDBStore.java>:[294,6]
cannot find symbol
symbol  : variable dataStore
location: class org.apache.gora.dynamodb.TestDynamoDBStore
[ERROR] <https://builds.apache.org/job/goraamazon_branch/ws/branches/goraamazon/gora-dynamodb/src/test/java/org/apache/gora/dynamodb/TestDynamoDBStore.java>:[295,24]
cannot find symbol
symbol  : variable dataStore
location: class org.apache.gora.dynamodb.TestDynamoDBStore
[ERROR] <https://builds.apache.org/job/goraamazon_branch/ws/branches/goraamazon/gora-dynamodb/src/test/java/org/apache/gora/dynamodb/TestDynamoDBStore.java>:[297,25]
cannot find symbol
symbol  : variable dataStore
location: class org.apache.gora.dynamodb.TestDynamoDBStore
[ERROR] <https://builds.apache.org/job/goraamazon_branch/ws/branches/goraamazon/gora-dynamodb/src/test/java/org/apache/gora/dynamodb/TestDynamoDBStore.java>:[299,6]
cannot find symbol
symbol  : variable log
location: class org.apache.gora.dynamodb.TestDynamoDBStore
[ERROR] <https://builds.apache.org/job/goraamazon_branch/ws/branches/goraamazon/gora-dynamodb/src/test/java/org/apache/gora/dynamodb/TestDynamoDBStore.java>:[282,2]
method does not override or implement a method from a supertype
[ERROR] <https://builds.apache.org/job/goraamazon_branch/ws/branches/goraamazon/gora-dynamodb/src/test/java/org/apache/gora/dynamodb/TestDynamoDBStore.java>:[309,3]
cannot find symbol
symbol  : variable log
location: class org.apache.gora.dynamodb.TestDynamoDBStore
[ERROR] <https://builds.apache.org/job/goraamazon_branch/ws/branches/goraamazon/gora-dynamodb/src/test/java/org/apache/gora/dynamodb/TestDynamoDBStore.java>:[311,6]
cannot find symbol
symbol  : variable dataStore
location: class org.apache.gora.dynamodb.TestDynamoDBStore
[ERROR] <https://builds.apache.org/job/goraamazon_branch/ws/branches/goraamazon/gora-dynamodb/src/test/java/org/apache/gora/dynamodb/TestDynamoDBStore.java>:[312,6]
cannot find symbol
symbol  : variable dataStore
location: class org.apache.gora.dynamodb.TestDynamoDBStore
[ERROR] <https://builds.apache.org/job/goraamazon_branch/ws/branches/goraamazon/gora-dynamodb/src/test/java/org/apache/gora/dynamodb/TestDynamoDBStore.java>:[314,6]
cannot find symbol
symbol  : variable log
location: class org.apache.gora.dynamodb.TestDynamoDBStore
[ERROR] <https://builds.apache.org/job/goraamazon_branch/ws/branches/goraamazon/gora-dynamodb/src/test/java/org/apache/gora/dynamodb/TestDynamoDBStore.java>:[317,11]
cannot find symbol
symbol  : variable dataStore
location: class org.apache.gora.dynamodb.TestDynamoDBStore
[ERROR] <https://builds.apache.org/job/goraamazon_branch/ws/branches/goraamazon/gora-dynamodb/src/test/java/org/apache/gora/dynamodb/TestDynamoDBStore.java>:[307,2]
method does not override or implement a method from a supertype
[ERROR] <https://builds.apache.org/job/goraamazon_branch/ws/branches/goraamazon/gora-dynamodb/src/test/java/org/apache/gora/dynamodb/TestDynamoDBStore.java>:[326,6]
cannot find symbol
symbol  : variable log
location: class org.apache.gora.dynamodb.TestDynamoDBStore
[ERROR] <https://builds.apache.org/job/goraamazon_branch/ws/branches/goraamazon/gora-dynamodb/src/test/java/org/apache/gora/dynamodb/TestDynamoDBStore.java>:[330,6]
cannot find symbol
symbol  : variable log
location: class org.apache.gora.dynamodb.TestDynamoDBStore
[ERROR] <https://builds.apache.org/job/goraamazon_branch/ws/branches/goraamazon/gora-dynamodb/src/test/java/org/apache/gora/dynamodb/TestDynamoDBStore.java>:[333,6]
cannot find symbol
symbol  : variable log
location: class org.apache.gora.dynamodb.TestDynamoDBStore
[ERROR] <https://builds.apache.org/job/goraamazon_branch/ws/branches/goraamazon/gora-dynamodb/src/test/java/org/apache/gora/dynamodb/TestDynamoDBStore.java>:[376,10]
cannot find symbol
symbol  : method setPersistentKeyClass(java.lang.Class<org.apache.gora.dynamodb.query.DynamoDBKey>)
location: class org.apache.gora.dynamodb.TestDynamoDBStore
[ERROR] <https://builds.apache.org/job/goraamazon_branch/ws/branches/goraamazon/gora-dynamodb/src/test/java/org/apache/gora/dynamodb/TestDynamoDBStore.java>:[377,10]
cannot find symbol
symbol  : method setPersistentValClass(java.lang.Class<org.apache.gora.examples.generated.person>)
location: class org.apache.gora.dynamodb.TestDynamoDBStore
[ERROR] <https://builds.apache.org/job/goraamazon_branch/ws/branches/goraamazon/gora-dynamodb/src/test/java/org/apache/gora/dynamodb/TestDynamoDBStore.java>:[378,23]
cannot find symbol
symbol  : method setUpClass()
location: class org.apache.gora.dynamodb.TestDynamoDBStore
[ERROR] <https://builds.apache.org/job/goraamazon_branch/ws/branches/goraamazon/gora-dynamodb/src/test/java/org/apache/gora/dynamodb/TestDynamoDBStore.java>:[380,10]
cannot find symbol
symbol  : method testPut()
location: class org.apache.gora.dynamodb.TestDynamoDBStore
[ERROR] <https://builds.apache.org/job/goraamazon_branch/ws/branches/goraamazon/gora-dynamodb/src/test/java/org/apache/gora/dynamodb/TestDynamoDBStore.java>:[388,6]
cannot find symbol
symbol  : variable log
location: class org.apache.gora.dynamodb.TestDynamoDBStore
[ERROR] <https://builds.apache.org/job/goraamazon_branch/ws/branches/goraamazon/gora-dynamodb/src/test/java/org/apache/gora/dynamodb/TestDynamoDBStore.java>:[390,10]
cannot find symbol
symbol  : method tearDown()
location: class org.apache.gora.dynamodb.TestDynamoDBStore
[ERROR] <https://builds.apache.org/job/goraamazon_branch/ws/branches/goraamazon/gora-dynamodb/src/test/java/org/apache/gora/dynamodb/TestDynamoDBStore.java>:[391,23]
cannot find symbol
symbol  : method tearDownClass()
location: class org.apache.gora.dynamodb.TestDynamoDBStore
[INFO] 88 errors 
[INFO] -------------------------------------------------------------
mojoFailed org.apache.maven.plugins:maven-compiler-plugin:2.3.2(default-testCompile)
projectFailed org.apache.gora:gora-dynamodb:0.3-SNAPSHOT
sessionEnded
[INFO] ------------------------------------------------------------------------
[INFO] Reactor Summary:
[INFO] 
[INFO] Apache Gora ....................................... SUCCESS [21.190s]
[INFO] Apache Gora :: Core ............................... SUCCESS [1:00.957s]
[INFO] Apache Gora :: Hbase .............................. SUCCESS [31:19.982s]
[INFO] Apache Gora :: Accumulo ........................... SUCCESS [10.103s]
[INFO] Apache Gora :: Cassandra .......................... SUCCESS [19.769s]
[INFO] Apache Gora :: Dynamodb ........................... FAILURE [4.190s]
[INFO] Apache Gora :: SQL ................................ SKIPPED
[INFO] Apache Gora :: Tutorial ........................... SKIPPED
[INFO] Apache Gora :: Sources-Dist ....................... SKIPPED
[INFO] ------------------------------------------------------------------------
[INFO] BUILD FAILURE
[INFO] ------------------------------------------------------------------------
[INFO] Total time: 33:20.080s
[INFO] Finished at: Mon Oct 01 05:39:22 UTC 2012
[INFO] Final Memory: 62M/419M
[INFO] ------------------------------------------------------------------------
Projects to build: [MavenProject: org.apache.gora:gora:0.3-SNAPSHOT @ <https://builds.apache.org/job/goraamazon_branch/ws/branches/goraamazon/pom.xml,>
MavenProject: org.apache.gora:gora-core:0.3-SNAPSHOT @ <https://builds.apache.org/job/goraamazon_branch/ws/branches/goraamazon/gora-core/pom.xml,>
MavenProject: org.apache.gora:gora-hbase:0.3-SNAPSHOT @ <https://builds.apache.org/job/goraamazon_branch/ws/branches/goraamazon/gora-hbase/pom.xml,>
MavenProject: org.apache.gora:gora-accumulo:0.3-SNAPSHOT @ <https://builds.apache.org/job/goraamazon_branch/ws/branches/goraamazon/gora-accumulo/pom.xml,>
MavenProject: org.apache.gora:gora-cassandra:0.3-SNAPSHOT @ <https://builds.apache.org/job/goraamazon_branch/ws/branches/goraamazon/gora-cassandra/pom.xml,>
MavenProject: org.apache.gora:gora-dynamodb:0.3-SNAPSHOT @ <https://builds.apache.org/job/goraamazon_branch/ws/branches/goraamazon/gora-dynamodb/pom.xml,>
MavenProject: org.apache.gora:gora-sql:0.3-SNAPSHOT @ <https://builds.apache.org/job/goraamazon_branch/ws/branches/goraamazon/gora-sql/pom.xml,>
MavenProject: org.apache.gora:gora-tutorial:0.3-SNAPSHOT @ <https://builds.apache.org/job/goraamazon_branch/ws/branches/goraamazon/gora-tutorial/pom.xml,>
MavenProject: org.apache.gora:sources-dist:0.3-SNAPSHOT @ <https://builds.apache.org/job/goraamazon_branch/ws/branches/goraamazon/sources-dist/pom.xml]>
[JENKINS] Archiving <https://builds.apache.org/job/goraamazon_branch/ws/branches/goraamazon/gora-core/pom.xml>
to /home/hudson/hudson/jobs/goraamazon_branch/modules/org.apache.gora$gora-core/builds/2012-10-01_05-05-46/archive/org.apache.gora/gora-core/0.3-SNAPSHOT/gora-core-0.3-SNAPSHOT.pom
[JENKINS] Archiving <https://builds.apache.org/job/goraamazon_branch/ws/branches/goraamazon/gora-core/target/gora-core-0.3-SNAPSHOT.jar>
to /home/hudson/hudson/jobs/goraamazon_branch/modules/org.apache.gora$gora-core/builds/2012-10-01_05-05-46/archive/org.apache.gora/gora-core/0.3-SNAPSHOT/gora-core-0.3-SNAPSHOT.jar
[JENKINS] Archiving <https://builds.apache.org/job/goraamazon_branch/ws/branches/goraamazon/sources-dist/pom.xml>
to /home/hudson/hudson/jobs/goraamazon_branch/modules/org.apache.gora$sources-dist/builds/2012-10-01_05-05-46/archive/org.apache.gora/sources-dist/0.3-SNAPSHOT/sources-dist-0.3-SNAPSHOT.pom
[JENKINS] Archiving <https://builds.apache.org/job/goraamazon_branch/ws/branches/goraamazon/gora-cassandra/pom.xml>
to /home/hudson/hudson/jobs/goraamazon_branch/modules/org.apache.gora$gora-cassandra/builds/2012-10-01_05-05-46/archive/org.apache.gora/gora-cassandra/0.3-SNAPSHOT/gora-cassandra-0.3-SNAPSHOT.pom
[JENKINS] Archiving <https://builds.apache.org/job/goraamazon_branch/ws/branches/goraamazon/gora-cassandra/target/gora-cassandra-0.3-SNAPSHOT.jar>
to /home/hudson/hudson/jobs/goraamazon_branch/modules/org.apache.gora$gora-cassandra/builds/2012-10-01_05-05-46/archive/org.apache.gora/gora-cassandra/0.3-SNAPSHOT/gora-cassandra-0.3-SNAPSHOT.jar
[JENKINS] Archiving <https://builds.apache.org/job/goraamazon_branch/ws/branches/goraamazon/gora-hbase/pom.xml>
to /home/hudson/hudson/jobs/goraamazon_branch/modules/org.apache.gora$gora-hbase/builds/2012-10-01_05-05-46/archive/org.apache.gora/gora-hbase/0.3-SNAPSHOT/gora-hbase-0.3-SNAPSHOT.pom
[JENKINS] Archiving <https://builds.apache.org/job/goraamazon_branch/ws/branches/goraamazon/gora-hbase/target/gora-hbase-0.3-SNAPSHOT.jar>
to /home/hudson/hudson/jobs/goraamazon_branch/modules/org.apache.gora$gora-hbase/builds/2012-10-01_05-05-46/archive/org.apache.gora/gora-hbase/0.3-SNAPSHOT/gora-hbase-0.3-SNAPSHOT.jar
[JENKINS] Archiving <https://builds.apache.org/job/goraamazon_branch/ws/branches/goraamazon/gora-sql/pom.xml>
to /home/hudson/hudson/jobs/goraamazon_branch/modules/org.apache.gora$gora-sql/builds/2012-10-01_05-05-46/archive/org.apache.gora/gora-sql/0.3-SNAPSHOT/gora-sql-0.3-SNAPSHOT.pom
[JENKINS] Archiving <https://builds.apache.org/job/goraamazon_branch/ws/branches/goraamazon/pom.xml>
to /home/hudson/hudson/jobs/goraamazon_branch/modules/org.apache.gora$gora/builds/2012-10-01_05-05-46/archive/org.apache.gora/gora/0.3-SNAPSHOT/gora-0.3-SNAPSHOT.pom
[JENKINS] Archiving <https://builds.apache.org/job/goraamazon_branch/ws/branches/goraamazon/gora-accumulo/pom.xml>
to /home/hudson/hudson/jobs/goraamazon_branch/modules/org.apache.gora$gora-accumulo/builds/2012-10-01_05-05-46/archive/org.apache.gora/gora-accumulo/0.3-SNAPSHOT/gora-accumulo-0.3-SNAPSHOT.pom
[JENKINS] Archiving <https://builds.apache.org/job/goraamazon_branch/ws/branches/goraamazon/gora-accumulo/target/gora-accumulo-0.3-SNAPSHOT.jar>
to /home/hudson/hudson/jobs/goraamazon_branch/modules/org.apache.gora$gora-accumulo/builds/2012-10-01_05-05-46/archive/org.apache.gora/gora-accumulo/0.3-SNAPSHOT/gora-accumulo-0.3-SNAPSHOT.jar
[JENKINS] Archiving <https://builds.apache.org/job/goraamazon_branch/ws/branches/goraamazon/gora-tutorial/pom.xml>
to /home/hudson/hudson/jobs/goraamazon_branch/modules/org.apache.gora$gora-tutorial/builds/2012-10-01_05-05-46/archive/org.apache.gora/gora-tutorial/0.3-SNAPSHOT/gora-tutorial-0.3-SNAPSHOT.pom
[JENKINS] Archiving <https://builds.apache.org/job/goraamazon_branch/ws/branches/goraamazon/gora-dynamodb/pom.xml>
to /home/hudson/hudson/jobs/goraamazon_branch/modules/org.apache.gora$gora-dynamodb/builds/2012-10-01_05-05-46/archive/org.apache.gora/gora-dynamodb/0.3-SNAPSHOT/gora-dynamodb-0.3-SNAPSHOT.pom
Waiting for Jenkins to finish collecting data
mavenExecutionResult exceptions not empty
message : Failed to execute goal org.apache.maven.plugins:maven-compiler-plugin:2.3.2:testCompile
(default-testCompile) on project gora-dynamodb: Compilation failure
cause : Compilation failure
Stack trace : 
org.apache.maven.lifecycle.LifecycleExecutionException: Failed to execute goal org.apache.maven.plugins:maven-compiler-plugin:2.3.2:testCompile
(default-testCompile) on project gora-dynamodb: Compilation failure
	at org.apache.maven.lifecycle.internal.MojoExecutor.execute(MojoExecutor.java:213)
	at org.apache.maven.lifecycle.internal.MojoExecutor.execute(MojoExecutor.java:153)
	at org.apache.maven.lifecycle.internal.MojoExecutor.execute(MojoExecutor.java:145)
	at org.apache.maven.lifecycle.internal.LifecycleModuleBuilder.buildProject(LifecycleModuleBuilder.java:84)
	at org.apache.maven.lifecycle.internal.LifecycleModuleBuilder.buildProject(LifecycleModuleBuilder.java:59)
	at org.apache.maven.lifecycle.internal.LifecycleStarter.singleThreadedBuild(LifecycleStarter.java:183)
	at org.apache.maven.lifecycle.internal.LifecycleStarter.execute(LifecycleStarter.java:161)
	at org.apache.maven.DefaultMaven.doExecute(DefaultMaven.java:319)
	at org.apache.maven.DefaultMaven.execute(DefaultMaven.java:156)
	at org.jvnet.hudson.maven3.launcher.Maven3Launcher.main(Maven3Launcher.java:79)
	at sun.reflect.NativeMethodAccessorImpl.invoke0(Native Method)
	at sun.reflect.NativeMethodAccessorImpl.invoke(NativeMethodAccessorImpl.java:39)
	at sun.reflect.DelegatingMethodAccessorImpl.invoke(DelegatingMethodAccessorImpl.java:25)
	at java.lang.reflect.Method.invoke(Method.java:597)
	at org.codehaus.plexus.classworlds.launcher.Launcher.launchStandard(Launcher.java:329)
	at org.codehaus.plexus.classworlds.launcher.Launcher.launch(Launcher.java:239)
	at org.jvnet.hudson.maven3.agent.Maven3Main.launch(Maven3Main.java:158)
	at hudson.maven.Maven3Builder.call(Maven3Builder.java:98)
	at hudson.maven.Maven3Builder.call(Maven3Builder.java:64)
	at hudson.remoting.UserRequest.perform(UserRequest.java:118)
	at hudson.remoting.UserRequest.perform(UserRequest.java:48)
	at hudson.remoting.Request$2.run(Request.java:326)
	at hudson.remoting.InterceptingExecutorService$1.call(InterceptingExecutorService.java:72)
	at java.util.concurrent.FutureTask$Sync.innerRun(FutureTask.java:303)
	at java.util.concurrent.FutureTask.run(FutureTask.java:138)
	at java.util.concurrent.ThreadPoolExecutor$Worker.runTask(ThreadPoolExecutor.java:886)
	at java.util.concurrent.ThreadPoolExecutor$Worker.run(ThreadPoolExecutor.java:908)
	at java.lang.Thread.run(Thread.java:662)
Caused by: org.apache.maven.plugin.CompilationFailureException: Compilation failure
	at org.apache.maven.plugin.AbstractCompilerMojo.execute(AbstractCompilerMojo.java:656)
	at org.apache.maven.plugin.TestCompilerMojo.execute(TestCompilerMojo.java:161)
	at org.apache.maven.plugin.DefaultBuildPluginManager.executeMojo(DefaultBuildPluginManager.java:101)
	at org.apache.maven.lifecycle.internal.MojoExecutor.execute(MojoExecutor.java:209)
	... 27 more
Maven failed with error.
Sending e-mails to: dev@gora.apache.org
Sending e-mails to: dev@gora.apache.org
Sending e-mails to: dev@gora.apache.org
Sending e-mails to: dev@gora.apache.org
channel stopped

Mime
View raw message