gora-dev mailing list archives

Site index · List index
Message view « Date » · « Thread »
Top « Date » · « Thread »
From Apache Jenkins Server <jenk...@builds.apache.org>
Subject Build failed in Jenkins: goraamazon_branch » Apache Gora :: Dynamodb #142
Date Mon, 05 Nov 2012 05:42:36 GMT
See <https://builds.apache.org/job/goraamazon_branch/org.apache.gora$gora-dynamodb/142/>

------------------------------------------
projectStarted org.apache.gora:gora-dynamodb:0.3-SNAPSHOT
[INFO]                                                                         
[INFO] ------------------------------------------------------------------------
[INFO] Building Apache Gora :: Dynamodb 0.3-SNAPSHOT
[INFO] ------------------------------------------------------------------------
mojoStarted org.codehaus.mojo:build-helper-maven-plugin:1.7(default)[INFO] Source directory:
<https://builds.apache.org/job/goraamazon_branch/org.apache.gora$gora-dynamodb/ws/src/examples/java>
added.

[INFO] 
[INFO] --- build-helper-maven-plugin:1.7:add-source (default) @ gora-dynamodb ---
mojoSucceeded org.codehaus.mojo:build-helper-maven-plugin:1.7(default)
mojoStarted org.apache.maven.plugins:maven-remote-resources-plugin:1.2.1(default)
[INFO] 
[INFO] --- maven-remote-resources-plugin:1.2.1:process (default) @ gora-dynamodb ---
mojoSucceeded org.apache.maven.plugins:maven-remote-resources-plugin:1.2.1(default)
[debug] execute contextualize
mojoStarted org.apache.maven.plugins:maven-resources-plugin:2.5(default-resources)[INFO] Using
'UTF-8' encoding to copy filtered resources.
[INFO] skip non existing resourceDirectory <https://builds.apache.org/job/goraamazon_branch/org.apache.gora$gora-dynamodb/ws/src/main/resources>
[INFO] Copying 0 resource
[INFO] Copying 3 resources

[INFO] 
[INFO] --- maven-resources-plugin:2.5:resources (default-resources) @ gora-dynamodb ---
mojoSucceeded org.apache.maven.plugins:maven-resources-plugin:2.5(default-resources)
mojoStarted org.apache.maven.plugins:maven-compiler-plugin:2.3.2(default-compile)
[INFO] 
[INFO] --- maven-compiler-plugin:2.3.2:compile (default-compile) @ gora-dynamodb ---
[INFO] Compiling 7 source files to <https://builds.apache.org/job/goraamazon_branch/org.apache.gora$gora-dynamodb/ws/target/classes>
mojoSucceeded org.apache.maven.plugins:maven-compiler-plugin:2.3.2(default-compile)
[debug] execute contextualize
mojoStarted org.apache.maven.plugins:maven-resources-plugin:2.5(default-testResources)[INFO]
Using 'UTF-8' encoding to copy filtered resources.
[INFO] Copying 3 resources
[INFO] Copying 3 resources

[INFO] 
[INFO] --- maven-resources-plugin:2.5:testResources (default-testResources) @ gora-dynamodb
---
mojoSucceeded org.apache.maven.plugins:maven-resources-plugin:2.5(default-testResources)
mojoStarted org.apache.maven.plugins:maven-compiler-plugin:2.3.2(default-testCompile)[INFO]
Compiling 2 source files to <https://builds.apache.org/job/goraamazon_branch/org.apache.gora$gora-dynamodb/ws/target/test-classes>

[INFO] 
[INFO] --- maven-compiler-plugin:2.3.2:testCompile (default-testCompile) @ gora-dynamodb ---
[INFO] -------------------------------------------------------------
[ERROR] COMPILATION ERROR : 
[INFO] -------------------------------------------------------------
[ERROR] <https://builds.apache.org/job/goraamazon_branch/org.apache.gora$gora-dynamodb/ws/src/test/java/org/apache/gora/dynamodb/TestDynamoDBStore.java>:[32,28]
cannot find symbol
symbol  : class WSDataStoreTestBase
location: package org.apache.gora.store
[ERROR] <https://builds.apache.org/job/goraamazon_branch/org.apache.gora$gora-dynamodb/ws/src/test/java/org/apache/gora/dynamodb/TestDynamoDBStore.java>:[46,39]
cannot find symbol
symbol: class WSDataStoreTestBase
public class TestDynamoDBStore extends WSDataStoreTestBase<DynamoDBKey, person> {
[ERROR] <https://builds.apache.org/job/goraamazon_branch/org.apache.gora$gora-dynamodb/ws/src/test/java/org/apache/gora/dynamodb/TestDynamoDBStore.java>:[51,4]
cannot find symbol
symbol  : method setTestDriver(org.apache.gora.dynamodb.GoraDynamoDBTestDriver)
location: class org.apache.gora.dynamodb.TestDynamoDBStore
[ERROR] <https://builds.apache.org/job/goraamazon_branch/org.apache.gora$gora-dynamodb/ws/src/test/java/org/apache/gora/dynamodb/TestDynamoDBStore.java>:[56,4]
cannot find symbol
symbol  : method setPersistentKeyClass(java.lang.Class<org.apache.gora.dynamodb.query.DynamoDBKey>)
location: class org.apache.gora.dynamodb.TestDynamoDBStore
[ERROR] <https://builds.apache.org/job/goraamazon_branch/org.apache.gora$gora-dynamodb/ws/src/test/java/org/apache/gora/dynamodb/TestDynamoDBStore.java>:[57,4]
cannot find symbol
symbol  : method setPersistentValClass(java.lang.Class<org.apache.gora.examples.generated.person>)
location: class org.apache.gora.dynamodb.TestDynamoDBStore
[ERROR] <https://builds.apache.org/job/goraamazon_branch/org.apache.gora$gora-dynamodb/ws/src/test/java/org/apache/gora/dynamodb/TestDynamoDBStore.java>:[58,4]
cannot find symbol
symbol  : variable super
location: class org.apache.gora.dynamodb.TestDynamoDBStore
[ERROR] <https://builds.apache.org/job/goraamazon_branch/org.apache.gora$gora-dynamodb/ws/src/test/java/org/apache/gora/dynamodb/TestDynamoDBStore.java>:[62,36]
cannot find symbol
symbol  : variable testDriver
location: class org.apache.gora.dynamodb.TestDynamoDBStore
[ERROR] <https://builds.apache.org/job/goraamazon_branch/org.apache.gora$gora-dynamodb/ws/src/test/java/org/apache/gora/dynamodb/TestDynamoDBStore.java>:[67,2]
method does not override or implement a method from a supertype
[ERROR] <https://builds.apache.org/job/goraamazon_branch/org.apache.gora$gora-dynamodb/ws/src/test/java/org/apache/gora/dynamodb/TestDynamoDBStore.java>:[71,2]
method does not override or implement a method from a supertype
[ERROR] <https://builds.apache.org/job/goraamazon_branch/org.apache.gora$gora-dynamodb/ws/src/test/java/org/apache/gora/dynamodb/TestDynamoDBStore.java>:[75,2]
method does not override or implement a method from a supertype
[ERROR] <https://builds.apache.org/job/goraamazon_branch/org.apache.gora$gora-dynamodb/ws/src/test/java/org/apache/gora/dynamodb/TestDynamoDBStore.java>:[79,2]
method does not override or implement a method from a supertype
[ERROR] <https://builds.apache.org/job/goraamazon_branch/org.apache.gora$gora-dynamodb/ws/src/test/java/org/apache/gora/dynamodb/TestDynamoDBStore.java>:[83,2]
method does not override or implement a method from a supertype
[ERROR] <https://builds.apache.org/job/goraamazon_branch/org.apache.gora$gora-dynamodb/ws/src/test/java/org/apache/gora/dynamodb/TestDynamoDBStore.java>:[87,2]
method does not override or implement a method from a supertype
[ERROR] <https://builds.apache.org/job/goraamazon_branch/org.apache.gora$gora-dynamodb/ws/src/test/java/org/apache/gora/dynamodb/TestDynamoDBStore.java>:[91,2]
method does not override or implement a method from a supertype
[ERROR] <https://builds.apache.org/job/goraamazon_branch/org.apache.gora$gora-dynamodb/ws/src/test/java/org/apache/gora/dynamodb/TestDynamoDBStore.java>:[95,2]
method does not override or implement a method from a supertype
[ERROR] <https://builds.apache.org/job/goraamazon_branch/org.apache.gora$gora-dynamodb/ws/src/test/java/org/apache/gora/dynamodb/TestDynamoDBStore.java>:[99,2]
method does not override or implement a method from a supertype
[ERROR] <https://builds.apache.org/job/goraamazon_branch/org.apache.gora$gora-dynamodb/ws/src/test/java/org/apache/gora/dynamodb/TestDynamoDBStore.java>:[103,2]
method does not override or implement a method from a supertype
[ERROR] <https://builds.apache.org/job/goraamazon_branch/org.apache.gora$gora-dynamodb/ws/src/test/java/org/apache/gora/dynamodb/TestDynamoDBStore.java>:[107,2]
method does not override or implement a method from a supertype
[ERROR] <https://builds.apache.org/job/goraamazon_branch/org.apache.gora$gora-dynamodb/ws/src/test/java/org/apache/gora/dynamodb/TestDynamoDBStore.java>:[111,2]
method does not override or implement a method from a supertype
[ERROR] <https://builds.apache.org/job/goraamazon_branch/org.apache.gora$gora-dynamodb/ws/src/test/java/org/apache/gora/dynamodb/TestDynamoDBStore.java>:[115,2]
method does not override or implement a method from a supertype
[ERROR] <https://builds.apache.org/job/goraamazon_branch/org.apache.gora$gora-dynamodb/ws/src/test/java/org/apache/gora/dynamodb/TestDynamoDBStore.java>:[132,6]
cannot find symbol
symbol  : variable dataStore
location: class org.apache.gora.dynamodb.TestDynamoDBStore
[ERROR] <https://builds.apache.org/job/goraamazon_branch/org.apache.gora$gora-dynamodb/ws/src/test/java/org/apache/gora/dynamodb/TestDynamoDBStore.java>:[135,6]
cannot find symbol
symbol  : variable dataStore
location: class org.apache.gora.dynamodb.TestDynamoDBStore
[ERROR] <https://builds.apache.org/job/goraamazon_branch/org.apache.gora$gora-dynamodb/ws/src/test/java/org/apache/gora/dynamodb/TestDynamoDBStore.java>:[140,46]
cannot find symbol
symbol  : variable dataStore
location: class org.apache.gora.dynamodb.TestDynamoDBStore
[ERROR] <https://builds.apache.org/job/goraamazon_branch/org.apache.gora$gora-dynamodb/ws/src/test/java/org/apache/gora/dynamodb/TestDynamoDBStore.java>:[124,2]
method does not override or implement a method from a supertype
[ERROR] <https://builds.apache.org/job/goraamazon_branch/org.apache.gora$gora-dynamodb/ws/src/test/java/org/apache/gora/dynamodb/TestDynamoDBStore.java>:[158,6]
cannot find symbol
symbol  : variable dataStore
location: class org.apache.gora.dynamodb.TestDynamoDBStore
[ERROR] <https://builds.apache.org/job/goraamazon_branch/org.apache.gora$gora-dynamodb/ws/src/test/java/org/apache/gora/dynamodb/TestDynamoDBStore.java>:[160,6]
cannot find symbol
symbol  : variable dataStore
location: class org.apache.gora.dynamodb.TestDynamoDBStore
[ERROR] <https://builds.apache.org/job/goraamazon_branch/org.apache.gora$gora-dynamodb/ws/src/test/java/org/apache/gora/dynamodb/TestDynamoDBStore.java>:[150,2]
method does not override or implement a method from a supertype
[ERROR] <https://builds.apache.org/job/goraamazon_branch/org.apache.gora$gora-dynamodb/ws/src/test/java/org/apache/gora/dynamodb/TestDynamoDBStore.java>:[187,22]
cannot find symbol
symbol  : variable dataStore
location: class org.apache.gora.dynamodb.TestDynamoDBStore
[ERROR] <https://builds.apache.org/job/goraamazon_branch/org.apache.gora$gora-dynamodb/ws/src/test/java/org/apache/gora/dynamodb/TestDynamoDBStore.java>:[184,2]
method does not override or implement a method from a supertype
[ERROR] <https://builds.apache.org/job/goraamazon_branch/org.apache.gora$gora-dynamodb/ws/src/test/java/org/apache/gora/dynamodb/TestDynamoDBStore.java>:[201,6]
cannot find symbol
symbol  : variable dataStore
location: class org.apache.gora.dynamodb.TestDynamoDBStore
[ERROR] <https://builds.apache.org/job/goraamazon_branch/org.apache.gora$gora-dynamodb/ws/src/test/java/org/apache/gora/dynamodb/TestDynamoDBStore.java>:[204,6]
cannot find symbol
symbol  : variable dataStore
location: class org.apache.gora.dynamodb.TestDynamoDBStore
[ERROR] <https://builds.apache.org/job/goraamazon_branch/org.apache.gora$gora-dynamodb/ws/src/test/java/org/apache/gora/dynamodb/TestDynamoDBStore.java>:[193,2]
method does not override or implement a method from a supertype
[ERROR] <https://builds.apache.org/job/goraamazon_branch/org.apache.gora$gora-dynamodb/ws/src/test/java/org/apache/gora/dynamodb/TestDynamoDBStore.java>:[224,48]
cannot find symbol
symbol  : variable dataStore
location: class org.apache.gora.dynamodb.TestDynamoDBStore
[ERROR] <https://builds.apache.org/job/goraamazon_branch/org.apache.gora$gora-dynamodb/ws/src/test/java/org/apache/gora/dynamodb/TestDynamoDBStore.java>:[214,2]
method does not override or implement a method from a supertype
[ERROR] <https://builds.apache.org/job/goraamazon_branch/org.apache.gora$gora-dynamodb/ws/src/test/java/org/apache/gora/dynamodb/TestDynamoDBStore.java>:[251,48]
cannot find symbol
symbol  : variable dataStore
location: class org.apache.gora.dynamodb.TestDynamoDBStore
[ERROR] <https://builds.apache.org/job/goraamazon_branch/org.apache.gora$gora-dynamodb/ws/src/test/java/org/apache/gora/dynamodb/TestDynamoDBStore.java>:[235,2]
method does not override or implement a method from a supertype
[ERROR] <https://builds.apache.org/job/goraamazon_branch/org.apache.gora$gora-dynamodb/ws/src/test/java/org/apache/gora/dynamodb/TestDynamoDBStore.java>:[271,6]
cannot find symbol
symbol  : variable dataStore
location: class org.apache.gora.dynamodb.TestDynamoDBStore
[ERROR] <https://builds.apache.org/job/goraamazon_branch/org.apache.gora$gora-dynamodb/ws/src/test/java/org/apache/gora/dynamodb/TestDynamoDBStore.java>:[273,18]
cannot find symbol
symbol  : variable dataStore
location: class org.apache.gora.dynamodb.TestDynamoDBStore
[ERROR] <https://builds.apache.org/job/goraamazon_branch/org.apache.gora$gora-dynamodb/ws/src/test/java/org/apache/gora/dynamodb/TestDynamoDBStore.java>:[262,2]
method does not override or implement a method from a supertype
[ERROR] <https://builds.apache.org/job/goraamazon_branch/org.apache.gora$gora-dynamodb/ws/src/test/java/org/apache/gora/dynamodb/TestDynamoDBStore.java>:[296,6]
cannot find symbol
symbol  : variable dataStore
location: class org.apache.gora.dynamodb.TestDynamoDBStore
[ERROR] <https://builds.apache.org/job/goraamazon_branch/org.apache.gora$gora-dynamodb/ws/src/test/java/org/apache/gora/dynamodb/TestDynamoDBStore.java>:[297,24]
cannot find symbol
symbol  : variable dataStore
location: class org.apache.gora.dynamodb.TestDynamoDBStore
[ERROR] <https://builds.apache.org/job/goraamazon_branch/org.apache.gora$gora-dynamodb/ws/src/test/java/org/apache/gora/dynamodb/TestDynamoDBStore.java>:[299,25]
cannot find symbol
symbol  : variable dataStore
location: class org.apache.gora.dynamodb.TestDynamoDBStore
[ERROR] <https://builds.apache.org/job/goraamazon_branch/org.apache.gora$gora-dynamodb/ws/src/test/java/org/apache/gora/dynamodb/TestDynamoDBStore.java>:[284,2]
method does not override or implement a method from a supertype
[ERROR] <https://builds.apache.org/job/goraamazon_branch/org.apache.gora$gora-dynamodb/ws/src/test/java/org/apache/gora/dynamodb/TestDynamoDBStore.java>:[313,6]
cannot find symbol
symbol  : variable dataStore
location: class org.apache.gora.dynamodb.TestDynamoDBStore
[ERROR] <https://builds.apache.org/job/goraamazon_branch/org.apache.gora$gora-dynamodb/ws/src/test/java/org/apache/gora/dynamodb/TestDynamoDBStore.java>:[314,6]
cannot find symbol
symbol  : variable dataStore
location: class org.apache.gora.dynamodb.TestDynamoDBStore
[ERROR] <https://builds.apache.org/job/goraamazon_branch/org.apache.gora$gora-dynamodb/ws/src/test/java/org/apache/gora/dynamodb/TestDynamoDBStore.java>:[319,11]
cannot find symbol
symbol  : variable dataStore
location: class org.apache.gora.dynamodb.TestDynamoDBStore
[ERROR] <https://builds.apache.org/job/goraamazon_branch/org.apache.gora$gora-dynamodb/ws/src/test/java/org/apache/gora/dynamodb/TestDynamoDBStore.java>:[309,2]
method does not override or implement a method from a supertype
[ERROR] <https://builds.apache.org/job/goraamazon_branch/org.apache.gora$gora-dynamodb/ws/src/test/java/org/apache/gora/dynamodb/TestDynamoDBStore.java>:[378,10]
cannot find symbol
symbol  : method setPersistentKeyClass(java.lang.Class<org.apache.gora.dynamodb.query.DynamoDBKey>)
location: class org.apache.gora.dynamodb.TestDynamoDBStore
[ERROR] <https://builds.apache.org/job/goraamazon_branch/org.apache.gora$gora-dynamodb/ws/src/test/java/org/apache/gora/dynamodb/TestDynamoDBStore.java>:[379,10]
cannot find symbol
symbol  : method setPersistentValClass(java.lang.Class<org.apache.gora.examples.generated.person>)
location: class org.apache.gora.dynamodb.TestDynamoDBStore
[ERROR] <https://builds.apache.org/job/goraamazon_branch/org.apache.gora$gora-dynamodb/ws/src/test/java/org/apache/gora/dynamodb/TestDynamoDBStore.java>:[380,23]
cannot find symbol
symbol  : method setUpClass()
location: class org.apache.gora.dynamodb.TestDynamoDBStore
[ERROR] <https://builds.apache.org/job/goraamazon_branch/org.apache.gora$gora-dynamodb/ws/src/test/java/org/apache/gora/dynamodb/TestDynamoDBStore.java>:[382,10]
cannot find symbol
symbol  : method testPut()
location: class org.apache.gora.dynamodb.TestDynamoDBStore
[ERROR] <https://builds.apache.org/job/goraamazon_branch/org.apache.gora$gora-dynamodb/ws/src/test/java/org/apache/gora/dynamodb/TestDynamoDBStore.java>:[392,10]
cannot find symbol
symbol  : method tearDown()
location: class org.apache.gora.dynamodb.TestDynamoDBStore
mojoFailed org.apache.maven.plugins:maven-compiler-plugin:2.3.2(default-testCompile)[ERROR]
<https://builds.apache.org/job/goraamazon_branch/org.apache.gora$gora-dynamodb/ws/src/test/java/org/apache/gora/dynamodb/TestDynamoDBStore.java>:[393,23]
cannot find symbol
symbol  : method tearDownClass()
location: class org.apache.gora.dynamodb.TestDynamoDBStore
[INFO] 53 errors 
[INFO] -------------------------------------------------------------

projectFailed org.apache.gora:gora-dynamodb:0.3-SNAPSHOT

Mime
View raw message