gora-dev mailing list archives

Site index · List index
Message view « Date » · « Thread »
Top « Date » · « Thread »
From Apache Jenkins Server <jenk...@builds.apache.org>
Subject Build failed in Jenkins: goraamazon_branch » Apache Gora :: Dynamodb #137
Date Thu, 01 Nov 2012 05:47:09 GMT
See <https://builds.apache.org/job/goraamazon_branch/org.apache.gora$gora-dynamodb/137/>

------------------------------------------
projectStarted org.apache.gora:gora-dynamodb:0.3-SNAPSHOT
[INFO]                                                                         
[INFO] ------------------------------------------------------------------------
[INFO] Building Apache Gora :: Dynamodb 0.3-SNAPSHOT
[INFO] ------------------------------------------------------------------------
mojoStarted org.codehaus.mojo:build-helper-maven-plugin:1.7(default)[INFO] Source directory:
<https://builds.apache.org/job/goraamazon_branch/org.apache.gora$gora-dynamodb/ws/src/examples/java>
added.

[INFO] 
[INFO] --- build-helper-maven-plugin:1.7:add-source (default) @ gora-dynamodb ---
mojoSucceeded org.codehaus.mojo:build-helper-maven-plugin:1.7(default)
mojoStarted org.apache.maven.plugins:maven-remote-resources-plugin:1.2.1(default)
[INFO] 
[INFO] --- maven-remote-resources-plugin:1.2.1:process (default) @ gora-dynamodb ---
mojoSucceeded org.apache.maven.plugins:maven-remote-resources-plugin:1.2.1(default)
mojoStarted org.apache.maven.plugins:maven-resources-plugin:2.5(default-resources)[debug]
execute contextualize
[INFO] Using 'UTF-8' encoding to copy filtered resources.
[INFO] skip non existing resourceDirectory <https://builds.apache.org/job/goraamazon_branch/org.apache.gora$gora-dynamodb/ws/src/main/resources>
[INFO] Copying 0 resource
[INFO] Copying 3 resources

[INFO] 
[INFO] --- maven-resources-plugin:2.5:resources (default-resources) @ gora-dynamodb ---
mojoSucceeded org.apache.maven.plugins:maven-resources-plugin:2.5(default-resources)
mojoStarted org.apache.maven.plugins:maven-compiler-plugin:2.3.2(default-compile)[INFO] Compiling
7 source files to <https://builds.apache.org/job/goraamazon_branch/org.apache.gora$gora-dynamodb/ws/target/classes>

[INFO] 
[INFO] --- maven-compiler-plugin:2.3.2:compile (default-compile) @ gora-dynamodb ---
mojoSucceeded org.apache.maven.plugins:maven-compiler-plugin:2.3.2(default-compile)
[debug] execute contextualize
mojoStarted org.apache.maven.plugins:maven-resources-plugin:2.5(default-testResources)[INFO]
Using 'UTF-8' encoding to copy filtered resources.
[INFO] Copying 3 resources
[INFO] Copying 3 resources

[INFO] 
[INFO] --- maven-resources-plugin:2.5:testResources (default-testResources) @ gora-dynamodb
---
mojoSucceeded org.apache.maven.plugins:maven-resources-plugin:2.5(default-testResources)
mojoStarted org.apache.maven.plugins:maven-compiler-plugin:2.3.2(default-testCompile)[INFO]
Compiling 2 source files to <https://builds.apache.org/job/goraamazon_branch/org.apache.gora$gora-dynamodb/ws/target/test-classes>

[INFO] 
[INFO] --- maven-compiler-plugin:2.3.2:testCompile (default-testCompile) @ gora-dynamodb ---
[INFO] -------------------------------------------------------------
[ERROR] COMPILATION ERROR : 
[INFO] -------------------------------------------------------------
[ERROR] <https://builds.apache.org/job/goraamazon_branch/org.apache.gora$gora-dynamodb/ws/src/test/java/org/apache/gora/dynamodb/TestDynamoDBStore.java>:[35,28]
cannot find symbol
symbol  : class WSDataStoreTestBase
location: package org.apache.gora.store
[ERROR] <https://builds.apache.org/job/goraamazon_branch/org.apache.gora$gora-dynamodb/ws/src/test/java/org/apache/gora/dynamodb/TestDynamoDBStore.java>:[49,39]
cannot find symbol
symbol: class WSDataStoreTestBase
public class TestDynamoDBStore extends WSDataStoreTestBase<DynamoDBKey, person> {
[ERROR] <https://builds.apache.org/job/goraamazon_branch/org.apache.gora$gora-dynamodb/ws/src/test/java/org/apache/gora/dynamodb/TestDynamoDBStore.java>:[54,4]
cannot find symbol
symbol  : method setTestDriver(org.apache.gora.dynamodb.GoraDynamoDBTestDriver)
location: class org.apache.gora.dynamodb.TestDynamoDBStore
[ERROR] <https://builds.apache.org/job/goraamazon_branch/org.apache.gora$gora-dynamodb/ws/src/test/java/org/apache/gora/dynamodb/TestDynamoDBStore.java>:[59,4]
cannot find symbol
symbol  : method setPersistentKeyClass(java.lang.Class<org.apache.gora.dynamodb.query.DynamoDBKey>)
location: class org.apache.gora.dynamodb.TestDynamoDBStore
[ERROR] <https://builds.apache.org/job/goraamazon_branch/org.apache.gora$gora-dynamodb/ws/src/test/java/org/apache/gora/dynamodb/TestDynamoDBStore.java>:[60,4]
cannot find symbol
symbol  : method setPersistentValClass(java.lang.Class<org.apache.gora.examples.generated.person>)
location: class org.apache.gora.dynamodb.TestDynamoDBStore
[ERROR] <https://builds.apache.org/job/goraamazon_branch/org.apache.gora$gora-dynamodb/ws/src/test/java/org/apache/gora/dynamodb/TestDynamoDBStore.java>:[61,4]
cannot find symbol
symbol  : variable super
location: class org.apache.gora.dynamodb.TestDynamoDBStore
[ERROR] <https://builds.apache.org/job/goraamazon_branch/org.apache.gora$gora-dynamodb/ws/src/test/java/org/apache/gora/dynamodb/TestDynamoDBStore.java>:[65,36]
cannot find symbol
symbol  : variable testDriver
location: class org.apache.gora.dynamodb.TestDynamoDBStore
[ERROR] <https://builds.apache.org/job/goraamazon_branch/org.apache.gora$gora-dynamodb/ws/src/test/java/org/apache/gora/dynamodb/TestDynamoDBStore.java>:[70,2]
method does not override or implement a method from a supertype
[ERROR] <https://builds.apache.org/job/goraamazon_branch/org.apache.gora$gora-dynamodb/ws/src/test/java/org/apache/gora/dynamodb/TestDynamoDBStore.java>:[74,2]
method does not override or implement a method from a supertype
[ERROR] <https://builds.apache.org/job/goraamazon_branch/org.apache.gora$gora-dynamodb/ws/src/test/java/org/apache/gora/dynamodb/TestDynamoDBStore.java>:[78,2]
method does not override or implement a method from a supertype
[ERROR] <https://builds.apache.org/job/goraamazon_branch/org.apache.gora$gora-dynamodb/ws/src/test/java/org/apache/gora/dynamodb/TestDynamoDBStore.java>:[82,2]
method does not override or implement a method from a supertype
[ERROR] <https://builds.apache.org/job/goraamazon_branch/org.apache.gora$gora-dynamodb/ws/src/test/java/org/apache/gora/dynamodb/TestDynamoDBStore.java>:[86,2]
method does not override or implement a method from a supertype
[ERROR] <https://builds.apache.org/job/goraamazon_branch/org.apache.gora$gora-dynamodb/ws/src/test/java/org/apache/gora/dynamodb/TestDynamoDBStore.java>:[90,2]
method does not override or implement a method from a supertype
[ERROR] <https://builds.apache.org/job/goraamazon_branch/org.apache.gora$gora-dynamodb/ws/src/test/java/org/apache/gora/dynamodb/TestDynamoDBStore.java>:[94,2]
method does not override or implement a method from a supertype
[ERROR] <https://builds.apache.org/job/goraamazon_branch/org.apache.gora$gora-dynamodb/ws/src/test/java/org/apache/gora/dynamodb/TestDynamoDBStore.java>:[98,2]
method does not override or implement a method from a supertype
[ERROR] <https://builds.apache.org/job/goraamazon_branch/org.apache.gora$gora-dynamodb/ws/src/test/java/org/apache/gora/dynamodb/TestDynamoDBStore.java>:[102,2]
method does not override or implement a method from a supertype
[ERROR] <https://builds.apache.org/job/goraamazon_branch/org.apache.gora$gora-dynamodb/ws/src/test/java/org/apache/gora/dynamodb/TestDynamoDBStore.java>:[106,2]
method does not override or implement a method from a supertype
[ERROR] <https://builds.apache.org/job/goraamazon_branch/org.apache.gora$gora-dynamodb/ws/src/test/java/org/apache/gora/dynamodb/TestDynamoDBStore.java>:[110,2]
method does not override or implement a method from a supertype
[ERROR] <https://builds.apache.org/job/goraamazon_branch/org.apache.gora$gora-dynamodb/ws/src/test/java/org/apache/gora/dynamodb/TestDynamoDBStore.java>:[114,2]
method does not override or implement a method from a supertype
[ERROR] <https://builds.apache.org/job/goraamazon_branch/org.apache.gora$gora-dynamodb/ws/src/test/java/org/apache/gora/dynamodb/TestDynamoDBStore.java>:[118,2]
method does not override or implement a method from a supertype
[ERROR] <https://builds.apache.org/job/goraamazon_branch/org.apache.gora$gora-dynamodb/ws/src/test/java/org/apache/gora/dynamodb/TestDynamoDBStore.java>:[135,6]
cannot find symbol
symbol  : variable dataStore
location: class org.apache.gora.dynamodb.TestDynamoDBStore
[ERROR] <https://builds.apache.org/job/goraamazon_branch/org.apache.gora$gora-dynamodb/ws/src/test/java/org/apache/gora/dynamodb/TestDynamoDBStore.java>:[138,6]
cannot find symbol
symbol  : variable dataStore
location: class org.apache.gora.dynamodb.TestDynamoDBStore
[ERROR] <https://builds.apache.org/job/goraamazon_branch/org.apache.gora$gora-dynamodb/ws/src/test/java/org/apache/gora/dynamodb/TestDynamoDBStore.java>:[143,46]
cannot find symbol
symbol  : variable dataStore
location: class org.apache.gora.dynamodb.TestDynamoDBStore
[ERROR] <https://builds.apache.org/job/goraamazon_branch/org.apache.gora$gora-dynamodb/ws/src/test/java/org/apache/gora/dynamodb/TestDynamoDBStore.java>:[127,2]
method does not override or implement a method from a supertype
[ERROR] <https://builds.apache.org/job/goraamazon_branch/org.apache.gora$gora-dynamodb/ws/src/test/java/org/apache/gora/dynamodb/TestDynamoDBStore.java>:[161,6]
cannot find symbol
symbol  : variable dataStore
location: class org.apache.gora.dynamodb.TestDynamoDBStore
[ERROR] <https://builds.apache.org/job/goraamazon_branch/org.apache.gora$gora-dynamodb/ws/src/test/java/org/apache/gora/dynamodb/TestDynamoDBStore.java>:[163,6]
cannot find symbol
symbol  : variable dataStore
location: class org.apache.gora.dynamodb.TestDynamoDBStore
[ERROR] <https://builds.apache.org/job/goraamazon_branch/org.apache.gora$gora-dynamodb/ws/src/test/java/org/apache/gora/dynamodb/TestDynamoDBStore.java>:[153,2]
method does not override or implement a method from a supertype
[ERROR] <https://builds.apache.org/job/goraamazon_branch/org.apache.gora$gora-dynamodb/ws/src/test/java/org/apache/gora/dynamodb/TestDynamoDBStore.java>:[190,22]
cannot find symbol
symbol  : variable dataStore
location: class org.apache.gora.dynamodb.TestDynamoDBStore
[ERROR] <https://builds.apache.org/job/goraamazon_branch/org.apache.gora$gora-dynamodb/ws/src/test/java/org/apache/gora/dynamodb/TestDynamoDBStore.java>:[187,2]
method does not override or implement a method from a supertype
[ERROR] <https://builds.apache.org/job/goraamazon_branch/org.apache.gora$gora-dynamodb/ws/src/test/java/org/apache/gora/dynamodb/TestDynamoDBStore.java>:[204,6]
cannot find symbol
symbol  : variable dataStore
location: class org.apache.gora.dynamodb.TestDynamoDBStore
[ERROR] <https://builds.apache.org/job/goraamazon_branch/org.apache.gora$gora-dynamodb/ws/src/test/java/org/apache/gora/dynamodb/TestDynamoDBStore.java>:[207,6]
cannot find symbol
symbol  : variable dataStore
location: class org.apache.gora.dynamodb.TestDynamoDBStore
[ERROR] <https://builds.apache.org/job/goraamazon_branch/org.apache.gora$gora-dynamodb/ws/src/test/java/org/apache/gora/dynamodb/TestDynamoDBStore.java>:[196,2]
method does not override or implement a method from a supertype
[ERROR] <https://builds.apache.org/job/goraamazon_branch/org.apache.gora$gora-dynamodb/ws/src/test/java/org/apache/gora/dynamodb/TestDynamoDBStore.java>:[227,48]
cannot find symbol
symbol  : variable dataStore
location: class org.apache.gora.dynamodb.TestDynamoDBStore
[ERROR] <https://builds.apache.org/job/goraamazon_branch/org.apache.gora$gora-dynamodb/ws/src/test/java/org/apache/gora/dynamodb/TestDynamoDBStore.java>:[217,2]
method does not override or implement a method from a supertype
[ERROR] <https://builds.apache.org/job/goraamazon_branch/org.apache.gora$gora-dynamodb/ws/src/test/java/org/apache/gora/dynamodb/TestDynamoDBStore.java>:[254,48]
cannot find symbol
symbol  : variable dataStore
location: class org.apache.gora.dynamodb.TestDynamoDBStore
[ERROR] <https://builds.apache.org/job/goraamazon_branch/org.apache.gora$gora-dynamodb/ws/src/test/java/org/apache/gora/dynamodb/TestDynamoDBStore.java>:[238,2]
method does not override or implement a method from a supertype
[ERROR] <https://builds.apache.org/job/goraamazon_branch/org.apache.gora$gora-dynamodb/ws/src/test/java/org/apache/gora/dynamodb/TestDynamoDBStore.java>:[274,6]
cannot find symbol
symbol  : variable dataStore
location: class org.apache.gora.dynamodb.TestDynamoDBStore
[ERROR] <https://builds.apache.org/job/goraamazon_branch/org.apache.gora$gora-dynamodb/ws/src/test/java/org/apache/gora/dynamodb/TestDynamoDBStore.java>:[276,18]
cannot find symbol
symbol  : variable dataStore
location: class org.apache.gora.dynamodb.TestDynamoDBStore
[ERROR] <https://builds.apache.org/job/goraamazon_branch/org.apache.gora$gora-dynamodb/ws/src/test/java/org/apache/gora/dynamodb/TestDynamoDBStore.java>:[265,2]
method does not override or implement a method from a supertype
[ERROR] <https://builds.apache.org/job/goraamazon_branch/org.apache.gora$gora-dynamodb/ws/src/test/java/org/apache/gora/dynamodb/TestDynamoDBStore.java>:[299,6]
cannot find symbol
symbol  : variable dataStore
location: class org.apache.gora.dynamodb.TestDynamoDBStore
[ERROR] <https://builds.apache.org/job/goraamazon_branch/org.apache.gora$gora-dynamodb/ws/src/test/java/org/apache/gora/dynamodb/TestDynamoDBStore.java>:[300,24]
cannot find symbol
symbol  : variable dataStore
location: class org.apache.gora.dynamodb.TestDynamoDBStore
[ERROR] <https://builds.apache.org/job/goraamazon_branch/org.apache.gora$gora-dynamodb/ws/src/test/java/org/apache/gora/dynamodb/TestDynamoDBStore.java>:[302,25]
cannot find symbol
symbol  : variable dataStore
location: class org.apache.gora.dynamodb.TestDynamoDBStore
[ERROR] <https://builds.apache.org/job/goraamazon_branch/org.apache.gora$gora-dynamodb/ws/src/test/java/org/apache/gora/dynamodb/TestDynamoDBStore.java>:[287,2]
method does not override or implement a method from a supertype
[ERROR] <https://builds.apache.org/job/goraamazon_branch/org.apache.gora$gora-dynamodb/ws/src/test/java/org/apache/gora/dynamodb/TestDynamoDBStore.java>:[316,6]
cannot find symbol
symbol  : variable dataStore
location: class org.apache.gora.dynamodb.TestDynamoDBStore
[ERROR] <https://builds.apache.org/job/goraamazon_branch/org.apache.gora$gora-dynamodb/ws/src/test/java/org/apache/gora/dynamodb/TestDynamoDBStore.java>:[317,6]
cannot find symbol
symbol  : variable dataStore
location: class org.apache.gora.dynamodb.TestDynamoDBStore
[ERROR] <https://builds.apache.org/job/goraamazon_branch/org.apache.gora$gora-dynamodb/ws/src/test/java/org/apache/gora/dynamodb/TestDynamoDBStore.java>:[322,11]
cannot find symbol
symbol  : variable dataStore
location: class org.apache.gora.dynamodb.TestDynamoDBStore
[ERROR] <https://builds.apache.org/job/goraamazon_branch/org.apache.gora$gora-dynamodb/ws/src/test/java/org/apache/gora/dynamodb/TestDynamoDBStore.java>:[312,2]
method does not override or implement a method from a supertype
[ERROR] <https://builds.apache.org/job/goraamazon_branch/org.apache.gora$gora-dynamodb/ws/src/test/java/org/apache/gora/dynamodb/TestDynamoDBStore.java>:[381,10]
cannot find symbol
symbol  : method setPersistentKeyClass(java.lang.Class<org.apache.gora.dynamodb.query.DynamoDBKey>)
location: class org.apache.gora.dynamodb.TestDynamoDBStore
[ERROR] <https://builds.apache.org/job/goraamazon_branch/org.apache.gora$gora-dynamodb/ws/src/test/java/org/apache/gora/dynamodb/TestDynamoDBStore.java>:[382,10]
cannot find symbol
symbol  : method setPersistentValClass(java.lang.Class<org.apache.gora.examples.generated.person>)
location: class org.apache.gora.dynamodb.TestDynamoDBStore
[ERROR] <https://builds.apache.org/job/goraamazon_branch/org.apache.gora$gora-dynamodb/ws/src/test/java/org/apache/gora/dynamodb/TestDynamoDBStore.java>:[383,23]
cannot find symbol
symbol  : method setUpClass()
location: class org.apache.gora.dynamodb.TestDynamoDBStore
[ERROR] <https://builds.apache.org/job/goraamazon_branch/org.apache.gora$gora-dynamodb/ws/src/test/java/org/apache/gora/dynamodb/TestDynamoDBStore.java>:[385,10]
cannot find symbol
symbol  : method testPut()
location: class org.apache.gora.dynamodb.TestDynamoDBStore
[ERROR] <https://builds.apache.org/job/goraamazon_branch/org.apache.gora$gora-dynamodb/ws/src/test/java/org/apache/gora/dynamodb/TestDynamoDBStore.java>:[395,10]
cannot find symbol
symbol  : method tearDown()
location: class org.apache.gora.dynamodb.TestDynamoDBStore
[ERROR] <https://builds.apache.org/job/goraamazon_branch/org.apache.gora$gora-dynamodb/ws/src/test/java/org/apache/gora/dynamodb/TestDynamoDBStore.java>:[396,23]
cannot find symbol
symbol  : method tearDownClass()
location: class org.apache.gora.dynamodb.TestDynamoDBStore
[INFO] 53 errors 
[INFO] -------------------------------------------------------------
mojoFailed org.apache.maven.plugins:maven-compiler-plugin:2.3.2(default-testCompile)
projectFailed org.apache.gora:gora-dynamodb:0.3-SNAPSHOT

Mime
View raw message