gora-dev mailing list archives

Site index · List index
Message view « Date » · « Thread »
Top « Date » · « Thread »
From Henry Saputra <henry.sapu...@gmail.com>
Subject Re: Build failed in Jenkins: goraamazon_branch #136
Date Fri, 16 Nov 2012 16:59:39 GMT
Hi Guys,

I am still seeing the "cannot find symbol" error in the gora-dynamo module
when building from trunk.

Is there a bug to trace this issue?

- Henry


On Wed, Oct 31, 2012 at 10:37 AM, Lewis John Mcgibbney <
lewis.mcgibbney@gmail.com> wrote:

> Hi Renato,
>
> Its OK. I can confirm that things work fine when I run locally as well.
> The problem relates to the restructuring of the core modules and the
> fact that the goraamazon build pulls the 0.3-SNAPSHOT dependency
> (generated from trunk) which doesn't contain the new restructuring.
>
> You can see these errors here
>
>
> https://builds.apache.org/view/G-L/view/Gora/job/goraamazon_branch/136/org.apache.gora$gora-dynamodb/console
>
> Please check them out and we can either discuss here or offline to
> confirm that they would be resolved once the changes are ported to
> trunk.
>
> On Wed, Oct 31, 2012 at 5:27 PM, Renato MarroquĂ­n Mogrovejo
> <renatoj.marroquin@gmail.com> wrote:
> > Hi,
> >
> > I don't know what breaks things in here. I tested locally and it worked
> fine.
> > Lewis I remember you talking about this a while ago, do you have any
> > clue on this? Or a place where I could start digging? If anybody has
> > an idea of where to start on digging please let me know.
> > Thanks in advance!
> >
> >
> > Renato M.
> >
> > 2012/10/31 Apache Jenkins Server <jenkins@builds.apache.org>:
> >> See <https://builds.apache.org/job/goraamazon_branch/136/changes>
> >>
> >> Changes:
> >>
> >> [rmarroquin] Committing new patch for changes in the way exception were
> being handled.
> >>
> >> ------------------------------------------
> >> [...truncated 19900 lines...]
> >> [INFO] Installing <
> https://builds.apache.org/job/goraamazon_branch/ws/branches/goraamazon/gora-cassandra/pom.xml>
> to
> /home/jenkins/jenkins-slave/maven-repositories/0/org/apache/gora/gora-cassandra/0.3-SNAPSHOT/gora-cassandra-0.3-SNAPSHOT.pom
> >> mojoSucceeded
> org.apache.maven.plugins:maven-install-plugin:2.3.1(default-install)
> >> mojoStarted org.apache.felix:maven-bundle-plugin:2.3.7(default-install)
> >> [INFO]
> >> [INFO] --- maven-bundle-plugin:2.3.7:install (default-install) @
> gora-cassandra ---
> >> [INFO] Installing
> org/apache/gora/gora-cassandra/0.3-SNAPSHOT/gora-cassandra-0.3-SNAPSHOT.jar
> >> [INFO] Writing OBR metadata
> >> mojoSucceeded
> org.apache.felix:maven-bundle-plugin:2.3.7(default-install)
> >> projectSucceeded org.apache.gora:gora-cassandra:0.3-SNAPSHOT
> >> projectStarted org.apache.gora:gora-dynamodb:0.3-SNAPSHOT
> >> [INFO]
> >> [INFO]
> ------------------------------------------------------------------------
> >> [INFO] Building Apache Gora :: Dynamodb 0.3-SNAPSHOT
> >> [INFO]
> ------------------------------------------------------------------------
> >> [INFO] Source directory: <
> https://builds.apache.org/job/goraamazon_branch/ws/branches/goraamazon/gora-dynamodb/src/examples/java>
> added.
> >> mojoStarted org.codehaus.mojo:build-helper-maven-plugin:1.7(default)
> >> [INFO]
> >> [INFO] --- build-helper-maven-plugin:1.7:add-source (default) @
> gora-dynamodb ---
> >> mojoSucceeded org.codehaus.mojo:build-helper-maven-plugin:1.7(default)
> >> mojoStarted
> org.apache.maven.plugins:maven-remote-resources-plugin:1.2.1(default)
> >> [INFO]
> >> [INFO] --- maven-remote-resources-plugin:1.2.1:process (default) @
> gora-dynamodb ---
> >> mojoSucceeded
> org.apache.maven.plugins:maven-remote-resources-plugin:1.2.1(default)
> >> [debug] execute contextualize
> >> mojoStarted
> org.apache.maven.plugins:maven-resources-plugin:2.5(default-resources)[INFO]
> Using 'UTF-8' encoding to copy filtered resources.
> >> [INFO] skip non existing resourceDirectory <
> https://builds.apache.org/job/goraamazon_branch/ws/branches/goraamazon/gora-dynamodb/src/main/resources
> >
> >> [INFO] Copying 0 resource
> >> [INFO] Copying 3 resources
> >>
> >> [INFO]
> >> [INFO] --- maven-resources-plugin:2.5:resources (default-resources) @
> gora-dynamodb ---
> >> mojoSucceeded
> org.apache.maven.plugins:maven-resources-plugin:2.5(default-resources)
> >> mojoStarted
> org.apache.maven.plugins:maven-compiler-plugin:2.3.2(default-compile)
> >> [INFO]
> >> [INFO] --- maven-compiler-plugin:2.3.2:compile (default-compile) @
> gora-dynamodb ---
> >> [INFO] Compiling 7 source files to <
> https://builds.apache.org/job/goraamazon_branch/ws/branches/goraamazon/gora-dynamodb/target/classes
> >
> >> mojoSucceeded
> org.apache.maven.plugins:maven-compiler-plugin:2.3.2(default-compile)
> >> [debug] execute contextualize
> >> mojoStarted
> org.apache.maven.plugins:maven-resources-plugin:2.5(default-testResources)[INFO]
> Using 'UTF-8' encoding to copy filtered resources.
> >> [INFO] Copying 3 resources
> >> [INFO] Copying 3 resources
> >>
> >> [INFO]
> >> [INFO] --- maven-resources-plugin:2.5:testResources
> (default-testResources) @ gora-dynamodb ---
> >> mojoSucceeded
> org.apache.maven.plugins:maven-resources-plugin:2.5(default-testResources)
> >> mojoStarted
> org.apache.maven.plugins:maven-compiler-plugin:2.3.2(default-testCompile)
> >> [INFO]
> >> [INFO] --- maven-compiler-plugin:2.3.2:testCompile
> (default-testCompile) @ gora-dynamodb ---
> >> [INFO] Compiling 2 source files to <
> https://builds.apache.org/job/goraamazon_branch/ws/branches/goraamazon/gora-dynamodb/target/test-classes
> >
> >> [INFO] -------------------------------------------------------------
> >> [ERROR] COMPILATION ERROR :
> >> [INFO] -------------------------------------------------------------
> >> [ERROR] <
> https://builds.apache.org/job/goraamazon_branch/ws/branches/goraamazon/gora-dynamodb/src/test/java/org/apache/gora/dynamodb/TestDynamoDBStore.java>:[35,28]
> cannot find symbol
> >> symbol  : class WSDataStoreTestBase
> >> location: package org.apache.gora.store
> >> [ERROR] <
> https://builds.apache.org/job/goraamazon_branch/ws/branches/goraamazon/gora-dynamodb/src/test/java/org/apache/gora/dynamodb/TestDynamoDBStore.java>:[49,39]
> cannot find symbol
> >> symbol: class WSDataStoreTestBase
> >> public class TestDynamoDBStore extends WSDataStoreTestBase<DynamoDBKey,
> person> {
> >> [ERROR] <
> https://builds.apache.org/job/goraamazon_branch/ws/branches/goraamazon/gora-dynamodb/src/test/java/org/apache/gora/dynamodb/TestDynamoDBStore.java>:[54,4]
> cannot find symbol
> >> symbol  : method
> setTestDriver(org.apache.gora.dynamodb.GoraDynamoDBTestDriver)
> >> location: class org.apache.gora.dynamodb.TestDynamoDBStore
> >> [ERROR] <
> https://builds.apache.org/job/goraamazon_branch/ws/branches/goraamazon/gora-dynamodb/src/test/java/org/apache/gora/dynamodb/TestDynamoDBStore.java>:[59,4]
> cannot find symbol
> >> symbol  : method
> setPersistentKeyClass(java.lang.Class<org.apache.gora.dynamodb.query.DynamoDBKey>)
> >> location: class org.apache.gora.dynamodb.TestDynamoDBStore
> >> [ERROR] <
> https://builds.apache.org/job/goraamazon_branch/ws/branches/goraamazon/gora-dynamodb/src/test/java/org/apache/gora/dynamodb/TestDynamoDBStore.java>:[60,4]
> cannot find symbol
> >> symbol  : method
> setPersistentValClass(java.lang.Class<org.apache.gora.examples.generated.person>)
> >> location: class org.apache.gora.dynamodb.TestDynamoDBStore
> >> [ERROR] <
> https://builds.apache.org/job/goraamazon_branch/ws/branches/goraamazon/gora-dynamodb/src/test/java/org/apache/gora/dynamodb/TestDynamoDBStore.java>:[61,4]
> cannot find symbol
> >> symbol  : variable super
> >> location: class org.apache.gora.dynamodb.TestDynamoDBStore
> >> [ERROR] <
> https://builds.apache.org/job/goraamazon_branch/ws/branches/goraamazon/gora-dynamodb/src/test/java/org/apache/gora/dynamodb/TestDynamoDBStore.java>:[65,36]
> cannot find symbol
> >> symbol  : variable testDriver
> >> location: class org.apache.gora.dynamodb.TestDynamoDBStore
> >> [ERROR] <
> https://builds.apache.org/job/goraamazon_branch/ws/branches/goraamazon/gora-dynamodb/src/test/java/org/apache/gora/dynamodb/TestDynamoDBStore.java>:[70,2]
> method does not override or implement a method from a supertype
> >> [ERROR] <
> https://builds.apache.org/job/goraamazon_branch/ws/branches/goraamazon/gora-dynamodb/src/test/java/org/apache/gora/dynamodb/TestDynamoDBStore.java>:[74,2]
> method does not override or implement a method from a supertype
> >> [ERROR] <
> https://builds.apache.org/job/goraamazon_branch/ws/branches/goraamazon/gora-dynamodb/src/test/java/org/apache/gora/dynamodb/TestDynamoDBStore.java>:[78,2]
> method does not override or implement a method from a supertype
> >> [ERROR] <
> https://builds.apache.org/job/goraamazon_branch/ws/branches/goraamazon/gora-dynamodb/src/test/java/org/apache/gora/dynamodb/TestDynamoDBStore.java>:[82,2]
> method does not override or implement a method from a supertype
> >> [ERROR] <
> https://builds.apache.org/job/goraamazon_branch/ws/branches/goraamazon/gora-dynamodb/src/test/java/org/apache/gora/dynamodb/TestDynamoDBStore.java>:[86,2]
> method does not override or implement a method from a supertype
> >> [ERROR] <
> https://builds.apache.org/job/goraamazon_branch/ws/branches/goraamazon/gora-dynamodb/src/test/java/org/apache/gora/dynamodb/TestDynamoDBStore.java>:[90,2]
> method does not override or implement a method from a supertype
> >> [ERROR] <
> https://builds.apache.org/job/goraamazon_branch/ws/branches/goraamazon/gora-dynamodb/src/test/java/org/apache/gora/dynamodb/TestDynamoDBStore.java>:[94,2]
> method does not override or implement a method from a supertype
> >> [ERROR] <
> https://builds.apache.org/job/goraamazon_branch/ws/branches/goraamazon/gora-dynamodb/src/test/java/org/apache/gora/dynamodb/TestDynamoDBStore.java>:[98,2]
> method does not override or implement a method from a supertype
> >> [ERROR] <
> https://builds.apache.org/job/goraamazon_branch/ws/branches/goraamazon/gora-dynamodb/src/test/java/org/apache/gora/dynamodb/TestDynamoDBStore.java>:[102,2]
> method does not override or implement a method from a supertype
> >> [ERROR] <
> https://builds.apache.org/job/goraamazon_branch/ws/branches/goraamazon/gora-dynamodb/src/test/java/org/apache/gora/dynamodb/TestDynamoDBStore.java>:[106,2]
> method does not override or implement a method from a supertype
> >> [ERROR] <
> https://builds.apache.org/job/goraamazon_branch/ws/branches/goraamazon/gora-dynamodb/src/test/java/org/apache/gora/dynamodb/TestDynamoDBStore.java>:[110,2]
> method does not override or implement a method from a supertype
> >> [ERROR] <
> https://builds.apache.org/job/goraamazon_branch/ws/branches/goraamazon/gora-dynamodb/src/test/java/org/apache/gora/dynamodb/TestDynamoDBStore.java>:[114,2]
> method does not override or implement a method from a supertype
> >> [ERROR] <
> https://builds.apache.org/job/goraamazon_branch/ws/branches/goraamazon/gora-dynamodb/src/test/java/org/apache/gora/dynamodb/TestDynamoDBStore.java>:[118,2]
> method does not override or implement a method from a supertype
> >> [ERROR] <
> https://builds.apache.org/job/goraamazon_branch/ws/branches/goraamazon/gora-dynamodb/src/test/java/org/apache/gora/dynamodb/TestDynamoDBStore.java>:[135,6]
> cannot find symbol
> >> symbol  : variable dataStore
> >> location: class org.apache.gora.dynamodb.TestDynamoDBStore
> >> [ERROR] <
> https://builds.apache.org/job/goraamazon_branch/ws/branches/goraamazon/gora-dynamodb/src/test/java/org/apache/gora/dynamodb/TestDynamoDBStore.java>:[138,6]
> cannot find symbol
> >> symbol  : variable dataStore
> >> location: class org.apache.gora.dynamodb.TestDynamoDBStore
> >> [ERROR] <
> https://builds.apache.org/job/goraamazon_branch/ws/branches/goraamazon/gora-dynamodb/src/test/java/org/apache/gora/dynamodb/TestDynamoDBStore.java>:[143,46]
> cannot find symbol
> >> symbol  : variable dataStore
> >> location: class org.apache.gora.dynamodb.TestDynamoDBStore
> >> [ERROR] <
> https://builds.apache.org/job/goraamazon_branch/ws/branches/goraamazon/gora-dynamodb/src/test/java/org/apache/gora/dynamodb/TestDynamoDBStore.java>:[127,2]
> method does not override or implement a method from a supertype
> >> [ERROR] <
> https://builds.apache.org/job/goraamazon_branch/ws/branches/goraamazon/gora-dynamodb/src/test/java/org/apache/gora/dynamodb/TestDynamoDBStore.java>:[161,6]
> cannot find symbol
> >> symbol  : variable dataStore
> >> location: class org.apache.gora.dynamodb.TestDynamoDBStore
> >> [ERROR] <
> https://builds.apache.org/job/goraamazon_branch/ws/branches/goraamazon/gora-dynamodb/src/test/java/org/apache/gora/dynamodb/TestDynamoDBStore.java>:[163,6]
> cannot find symbol
> >> symbol  : variable dataStore
> >> location: class org.apache.gora.dynamodb.TestDynamoDBStore
> >> [ERROR] <
> https://builds.apache.org/job/goraamazon_branch/ws/branches/goraamazon/gora-dynamodb/src/test/java/org/apache/gora/dynamodb/TestDynamoDBStore.java>:[153,2]
> method does not override or implement a method from a supertype
> >> [ERROR] <
> https://builds.apache.org/job/goraamazon_branch/ws/branches/goraamazon/gora-dynamodb/src/test/java/org/apache/gora/dynamodb/TestDynamoDBStore.java>:[190,22]
> cannot find symbol
> >> symbol  : variable dataStore
> >> location: class org.apache.gora.dynamodb.TestDynamoDBStore
> >> [ERROR] <
> https://builds.apache.org/job/goraamazon_branch/ws/branches/goraamazon/gora-dynamodb/src/test/java/org/apache/gora/dynamodb/TestDynamoDBStore.java>:[187,2]
> method does not override or implement a method from a supertype
> >> [ERROR] <
> https://builds.apache.org/job/goraamazon_branch/ws/branches/goraamazon/gora-dynamodb/src/test/java/org/apache/gora/dynamodb/TestDynamoDBStore.java>:[204,6]
> cannot find symbol
> >> symbol  : variable dataStore
> >> location: class org.apache.gora.dynamodb.TestDynamoDBStore
> >> [ERROR] <
> https://builds.apache.org/job/goraamazon_branch/ws/branches/goraamazon/gora-dynamodb/src/test/java/org/apache/gora/dynamodb/TestDynamoDBStore.java>:[207,6]
> cannot find symbol
> >> symbol  : variable dataStore
> >> location: class org.apache.gora.dynamodb.TestDynamoDBStore
> >> [ERROR] <
> https://builds.apache.org/job/goraamazon_branch/ws/branches/goraamazon/gora-dynamodb/src/test/java/org/apache/gora/dynamodb/TestDynamoDBStore.java>:[196,2]
> method does not override or implement a method from a supertype
> >> [ERROR] <
> https://builds.apache.org/job/goraamazon_branch/ws/branches/goraamazon/gora-dynamodb/src/test/java/org/apache/gora/dynamodb/TestDynamoDBStore.java>:[227,48]
> cannot find symbol
> >> symbol  : variable dataStore
> >> location: class org.apache.gora.dynamodb.TestDynamoDBStore
> >> [ERROR] <
> https://builds.apache.org/job/goraamazon_branch/ws/branches/goraamazon/gora-dynamodb/src/test/java/org/apache/gora/dynamodb/TestDynamoDBStore.java>:[217,2]
> method does not override or implement a method from a supertype
> >> [ERROR] <
> https://builds.apache.org/job/goraamazon_branch/ws/branches/goraamazon/gora-dynamodb/src/test/java/org/apache/gora/dynamodb/TestDynamoDBStore.java>:[254,48]
> cannot find symbol
> >> symbol  : variable dataStore
> >> location: class org.apache.gora.dynamodb.TestDynamoDBStore
> >> [ERROR] <
> https://builds.apache.org/job/goraamazon_branch/ws/branches/goraamazon/gora-dynamodb/src/test/java/org/apache/gora/dynamodb/TestDynamoDBStore.java>:[238,2]
> method does not override or implement a method from a supertype
> >> [ERROR] <
> https://builds.apache.org/job/goraamazon_branch/ws/branches/goraamazon/gora-dynamodb/src/test/java/org/apache/gora/dynamodb/TestDynamoDBStore.java>:[274,6]
> cannot find symbol
> >> symbol  : variable dataStore
> >> location: class org.apache.gora.dynamodb.TestDynamoDBStore
> >> [ERROR] <
> https://builds.apache.org/job/goraamazon_branch/ws/branches/goraamazon/gora-dynamodb/src/test/java/org/apache/gora/dynamodb/TestDynamoDBStore.java>:[276,18]
> cannot find symbol
> >> symbol  : variable dataStore
> >> location: class org.apache.gora.dynamodb.TestDynamoDBStore
> >> [ERROR] <
> https://builds.apache.org/job/goraamazon_branch/ws/branches/goraamazon/gora-dynamodb/src/test/java/org/apache/gora/dynamodb/TestDynamoDBStore.java>:[265,2]
> method does not override or implement a method from a supertype
> >> [ERROR] <
> https://builds.apache.org/job/goraamazon_branch/ws/branches/goraamazon/gora-dynamodb/src/test/java/org/apache/gora/dynamodb/TestDynamoDBStore.java>:[299,6]
> cannot find symbol
> >> symbol  : variable dataStore
> >> location: class org.apache.gora.dynamodb.TestDynamoDBStore
> >> [ERROR] <
> https://builds.apache.org/job/goraamazon_branch/ws/branches/goraamazon/gora-dynamodb/src/test/java/org/apache/gora/dynamodb/TestDynamoDBStore.java>:[300,24]
> cannot find symbol
> >> symbol  : variable dataStore
> >> location: class org.apache.gora.dynamodb.TestDynamoDBStore
> >> [ERROR] <
> https://builds.apache.org/job/goraamazon_branch/ws/branches/goraamazon/gora-dynamodb/src/test/java/org/apache/gora/dynamodb/TestDynamoDBStore.java>:[302,25]
> cannot find symbol
> >> symbol  : variable dataStore
> >> location: class org.apache.gora.dynamodb.TestDynamoDBStore
> >> [ERROR] <
> https://builds.apache.org/job/goraamazon_branch/ws/branches/goraamazon/gora-dynamodb/src/test/java/org/apache/gora/dynamodb/TestDynamoDBStore.java>:[287,2]
> method does not override or implement a method from a supertype
> >> [ERROR] <
> https://builds.apache.org/job/goraamazon_branch/ws/branches/goraamazon/gora-dynamodb/src/test/java/org/apache/gora/dynamodb/TestDynamoDBStore.java>:[316,6]
> cannot find symbol
> >> symbol  : variable dataStore
> >> location: class org.apache.gora.dynamodb.TestDynamoDBStore
> >> [ERROR] <
> https://builds.apache.org/job/goraamazon_branch/ws/branches/goraamazon/gora-dynamodb/src/test/java/org/apache/gora/dynamodb/TestDynamoDBStore.java>:[317,6]
> cannot find symbol
> >> symbol  : variable dataStore
> >> location: class org.apache.gora.dynamodb.TestDynamoDBStore
> >> [ERROR] <
> https://builds.apache.org/job/goraamazon_branch/ws/branches/goraamazon/gora-dynamodb/src/test/java/org/apache/gora/dynamodb/TestDynamoDBStore.java>:[322,11]
> cannot find symbol
> >> symbol  : variable dataStore
> >> location: class org.apache.gora.dynamodb.TestDynamoDBStore
> >> [ERROR] <
> https://builds.apache.org/job/goraamazon_branch/ws/branches/goraamazon/gora-dynamodb/src/test/java/org/apache/gora/dynamodb/TestDynamoDBStore.java>:[312,2]
> method does not override or implement a method from a supertype
> >> [ERROR] <
> https://builds.apache.org/job/goraamazon_branch/ws/branches/goraamazon/gora-dynamodb/src/test/java/org/apache/gora/dynamodb/TestDynamoDBStore.java>:[381,10]
> cannot find symbol
> >> symbol  : method
> setPersistentKeyClass(java.lang.Class<org.apache.gora.dynamodb.query.DynamoDBKey>)
> >> location: class org.apache.gora.dynamodb.TestDynamoDBStore
> >> [ERROR] <
> https://builds.apache.org/job/goraamazon_branch/ws/branches/goraamazon/gora-dynamodb/src/test/java/org/apache/gora/dynamodb/TestDynamoDBStore.java>:[382,10]
> cannot find symbol
> >> symbol  : method
> setPersistentValClass(java.lang.Class<org.apache.gora.examples.generated.person>)
> >> location: class org.apache.gora.dynamodb.TestDynamoDBStore
> >> [ERROR] <
> https://builds.apache.org/job/goraamazon_branch/ws/branches/goraamazon/gora-dynamodb/src/test/java/org/apache/gora/dynamodb/TestDynamoDBStore.java>:[383,23]
> cannot find symbol
> >> symbol  : method setUpClass()
> >> location: class org.apache.gora.dynamodb.TestDynamoDBStore
> >> [ERROR] <
> https://builds.apache.org/job/goraamazon_branch/ws/branches/goraamazon/gora-dynamodb/src/test/java/org/apache/gora/dynamodb/TestDynamoDBStore.java>:[385,10]
> cannot find symbol
> >> symbol  : method testPut()
> >> location: class org.apache.gora.dynamodb.TestDynamoDBStore
> >> [ERROR] <
> https://builds.apache.org/job/goraamazon_branch/ws/branches/goraamazon/gora-dynamodb/src/test/java/org/apache/gora/dynamodb/TestDynamoDBStore.java>:[395,10]
> cannot find symbol
> >> symbol  : method tearDown()
> >> location: class org.apache.gora.dynamodb.TestDynamoDBStore
> >> [ERROR] <
> https://builds.apache.org/job/goraamazon_branch/ws/branches/goraamazon/gora-dynamodb/src/test/java/org/apache/gora/dynamodb/TestDynamoDBStore.java>:[396,23]
> cannot find symbol
> >> symbol  : method tearDownClass()
> >> location: class org.apache.gora.dynamodb.TestDynamoDBStore
> >> [INFO] 53 errors
> >> [INFO] -------------------------------------------------------------
> >> mojoFailed
> org.apache.maven.plugins:maven-compiler-plugin:2.3.2(default-testCompile)
> >> projectFailed org.apache.gora:gora-dynamodb:0.3-SNAPSHOT
> >> sessionEnded
> >> [INFO]
> ------------------------------------------------------------------------
> >> [INFO] Reactor Summary:
> >> [INFO]
> >> [INFO] Apache Gora ....................................... SUCCESS
> [28.620s]
> >> [INFO] Apache Gora :: Core ............................... SUCCESS
> [1:25.413s]
> >> [INFO] Apache Gora :: Hbase .............................. SUCCESS
> [34:34.437s]
> >> [INFO] Apache Gora :: Accumulo ........................... SUCCESS
> [13.656s]
> >> [INFO] Apache Gora :: Cassandra .......................... SUCCESS
> [9:59.802s]
> >> [INFO] Apache Gora :: Dynamodb ........................... FAILURE
> [5.931s]
> >> [INFO] Apache Gora :: SQL ................................ SKIPPED
> >> [INFO] Apache Gora :: Tutorial ........................... SKIPPED
> >> [INFO] Apache Gora :: Sources-Dist ....................... SKIPPED
> >> [INFO]
> ------------------------------------------------------------------------
> >> [INFO] BUILD FAILURE
> >> [INFO]
> ------------------------------------------------------------------------
> >> [INFO] Total time: 46:54.335s
> >> [INFO] Finished at: Wed Oct 31 08:12:19 UTC 2012
> >> [INFO] Final Memory: 67M/425M
> >> [INFO]
> ------------------------------------------------------------------------
> >> Projects to build: [MavenProject: org.apache.gora:gora:0.3-SNAPSHOT @ <
> https://builds.apache.org/job/goraamazon_branch/ws/branches/goraamazon/pom.xml,>
> MavenProject: org.apache.gora:gora-core:0.3-SNAPSHOT @ <
> https://builds.apache.org/job/goraamazon_branch/ws/branches/goraamazon/gora-core/pom.xml,>
> MavenProject: org.apache.gora:gora-hbase:0.3-SNAPSHOT @ <
> https://builds.apache.org/job/goraamazon_branch/ws/branches/goraamazon/gora-hbase/pom.xml,>
> MavenProject: org.apache.gora:gora-accumulo:0.3-SNAPSHOT @ <
> https://builds.apache.org/job/goraamazon_branch/ws/branches/goraamazon/gora-accumulo/pom.xml,>
> MavenProject: org.apache.gora:gora-cassandra:0.3-SNAPSHOT @ <
> https://builds.apache.org/job/goraamazon_branch/ws/branches/goraamazon/gora-cassandra/pom.xml,>
> MavenProject: org.apache.gora:gora-dynamodb:0.3-SNAPSHOT @ <
> https://builds.apache.org/job/goraamazon_branch/ws/branches/goraamazon/gora-dynamodb/pom.xml,>
> MavenProject: org.apache.gora:gora-sql:0.3-SNAPSHOT @ <
> https://builds.apache.org/job/goraamazon_branch/ws/branches/goraamazon/gora-sql/pom.xml,>
> MavenProject: org.apache.gora:gora-tutorial:0.3-SNAPSHOT @ <
> https://builds.apache.org/job/goraamazon_branch/ws/branches/goraamazon/gora-tutorial/pom.xml,>
> MavenProject: org.apache.gora:sources-dist:0.3-SNAPSHOT @ <
> https://builds.apache.org/job/goraamazon_branch/ws/branches/goraamazon/sources-dist/pom.xml
> ]>
> >> [JENKINS] Archiving <
> https://builds.apache.org/job/goraamazon_branch/ws/branches/goraamazon/gora-core/pom.xml>
> to
> /home/hudson/hudson/jobs/goraamazon_branch/modules/org.apache.gora$gora-core/builds/2012-10-31_07-24-58/archive/org.apache.gora/gora-core/0.3-SNAPSHOT/gora-core-0.3-SNAPSHOT.pom
> >> [JENKINS] Archiving <
> https://builds.apache.org/job/goraamazon_branch/ws/branches/goraamazon/gora-core/target/gora-core-0.3-SNAPSHOT.jar>
> to
> /home/hudson/hudson/jobs/goraamazon_branch/modules/org.apache.gora$gora-core/builds/2012-10-31_07-24-58/archive/org.apache.gora/gora-core/0.3-SNAPSHOT/gora-core-0.3-SNAPSHOT.jar
> >> [JENKINS] Archiving <
> https://builds.apache.org/job/goraamazon_branch/ws/branches/goraamazon/sources-dist/pom.xml>
> to
> /home/hudson/hudson/jobs/goraamazon_branch/modules/org.apache.gora$sources-dist/builds/2012-10-31_07-24-58/archive/org.apache.gora/sources-dist/0.3-SNAPSHOT/sources-dist-0.3-SNAPSHOT.pom
> >> [JENKINS] Archiving <
> https://builds.apache.org/job/goraamazon_branch/ws/branches/goraamazon/gora-cassandra/pom.xml>
> to
> /home/hudson/hudson/jobs/goraamazon_branch/modules/org.apache.gora$gora-cassandra/builds/2012-10-31_07-24-58/archive/org.apache.gora/gora-cassandra/0.3-SNAPSHOT/gora-cassandra-0.3-SNAPSHOT.pom
> >> [JENKINS] Archiving <
> https://builds.apache.org/job/goraamazon_branch/ws/branches/goraamazon/gora-cassandra/target/gora-cassandra-0.3-SNAPSHOT.jar>
> to
> /home/hudson/hudson/jobs/goraamazon_branch/modules/org.apache.gora$gora-cassandra/builds/2012-10-31_07-24-58/archive/org.apache.gora/gora-cassandra/0.3-SNAPSHOT/gora-cassandra-0.3-SNAPSHOT.jar
> >> [JENKINS] Archiving <
> https://builds.apache.org/job/goraamazon_branch/ws/branches/goraamazon/gora-hbase/pom.xml>
> to
> /home/hudson/hudson/jobs/goraamazon_branch/modules/org.apache.gora$gora-hbase/builds/2012-10-31_07-24-58/archive/org.apache.gora/gora-hbase/0.3-SNAPSHOT/gora-hbase-0.3-SNAPSHOT.pom
> >> [JENKINS] Archiving <
> https://builds.apache.org/job/goraamazon_branch/ws/branches/goraamazon/gora-hbase/target/gora-hbase-0.3-SNAPSHOT.jar>
> to
> /home/hudson/hudson/jobs/goraamazon_branch/modules/org.apache.gora$gora-hbase/builds/2012-10-31_07-24-58/archive/org.apache.gora/gora-hbase/0.3-SNAPSHOT/gora-hbase-0.3-SNAPSHOT.jar
> >> [JENKINS] Archiving <
> https://builds.apache.org/job/goraamazon_branch/ws/branches/goraamazon/gora-sql/pom.xml>
> to
> /home/hudson/hudson/jobs/goraamazon_branch/modules/org.apache.gora$gora-sql/builds/2012-10-31_07-24-58/archive/org.apache.gora/gora-sql/0.3-SNAPSHOT/gora-sql-0.3-SNAPSHOT.pom
> >> [JENKINS] Archiving <
> https://builds.apache.org/job/goraamazon_branch/ws/branches/goraamazon/pom.xml>
> to
> /home/hudson/hudson/jobs/goraamazon_branch/modules/org.apache.gora$gora/builds/2012-10-31_07-24-58/archive/org.apache.gora/gora/0.3-SNAPSHOT/gora-0.3-SNAPSHOT.pom
> >> [JENKINS] Archiving <
> https://builds.apache.org/job/goraamazon_branch/ws/branches/goraamazon/gora-accumulo/pom.xml>
> to
> /home/hudson/hudson/jobs/goraamazon_branch/modules/org.apache.gora$gora-accumulo/builds/2012-10-31_07-24-58/archive/org.apache.gora/gora-accumulo/0.3-SNAPSHOT/gora-accumulo-0.3-SNAPSHOT.pom
> >> [JENKINS] Archiving <
> https://builds.apache.org/job/goraamazon_branch/ws/branches/goraamazon/gora-accumulo/target/gora-accumulo-0.3-SNAPSHOT.jar>
> to
> /home/hudson/hudson/jobs/goraamazon_branch/modules/org.apache.gora$gora-accumulo/builds/2012-10-31_07-24-58/archive/org.apache.gora/gora-accumulo/0.3-SNAPSHOT/gora-accumulo-0.3-SNAPSHOT.jar
> >> [JENKINS] Archiving <
> https://builds.apache.org/job/goraamazon_branch/ws/branches/goraamazon/gora-tutorial/pom.xml>
> to
> /home/hudson/hudson/jobs/goraamazon_branch/modules/org.apache.gora$gora-tutorial/builds/2012-10-31_07-24-58/archive/org.apache.gora/gora-tutorial/0.3-SNAPSHOT/gora-tutorial-0.3-SNAPSHOT.pom
> >> [JENKINS] Archiving <
> https://builds.apache.org/job/goraamazon_branch/ws/branches/goraamazon/gora-dynamodb/pom.xml>
> to
> /home/hudson/hudson/jobs/goraamazon_branch/modules/org.apache.gora$gora-dynamodb/builds/2012-10-31_07-24-58/archive/org.apache.gora/gora-dynamodb/0.3-SNAPSHOT/gora-dynamodb-0.3-SNAPSHOT.pom
> >> Waiting for Jenkins to finish collecting data
> >> mavenExecutionResult exceptions not empty
> >> message : Failed to execute goal
> org.apache.maven.plugins:maven-compiler-plugin:2.3.2:testCompile
> (default-testCompile) on project gora-dynamodb: Compilation failure
> >> cause : Compilation failure
> >> Stack trace :
> >> org.apache.maven.lifecycle.LifecycleExecutionException: Failed to
> execute goal
> org.apache.maven.plugins:maven-compiler-plugin:2.3.2:testCompile
> (default-testCompile) on project gora-dynamodb: Compilation failure
> >>         at
> org.apache.maven.lifecycle.internal.MojoExecutor.execute(MojoExecutor.java:213)
> >>         at
> org.apache.maven.lifecycle.internal.MojoExecutor.execute(MojoExecutor.java:153)
> >>         at
> org.apache.maven.lifecycle.internal.MojoExecutor.execute(MojoExecutor.java:145)
> >>         at
> org.apache.maven.lifecycle.internal.LifecycleModuleBuilder.buildProject(LifecycleModuleBuilder.java:84)
> >>         at
> org.apache.maven.lifecycle.internal.LifecycleModuleBuilder.buildProject(LifecycleModuleBuilder.java:59)
> >>         at
> org.apache.maven.lifecycle.internal.LifecycleStarter.singleThreadedBuild(LifecycleStarter.java:183)
> >>         at
> org.apache.maven.lifecycle.internal.LifecycleStarter.execute(LifecycleStarter.java:161)
> >>         at
> org.apache.maven.DefaultMaven.doExecute(DefaultMaven.java:319)
> >>         at org.apache.maven.DefaultMaven.execute(DefaultMaven.java:156)
> >>         at
> org.jvnet.hudson.maven3.launcher.Maven3Launcher.main(Maven3Launcher.java:79)
> >>         at sun.reflect.NativeMethodAccessorImpl.invoke0(Native Method)
> >>         at
> sun.reflect.NativeMethodAccessorImpl.invoke(NativeMethodAccessorImpl.java:39)
> >>         at
> sun.reflect.DelegatingMethodAccessorImpl.invoke(DelegatingMethodAccessorImpl.java:25)
> >>         at java.lang.reflect.Method.invoke(Method.java:597)
> >>         at
> org.codehaus.plexus.classworlds.launcher.Launcher.launchStandard(Launcher.java:329)
> >>         at
> org.codehaus.plexus.classworlds.launcher.Launcher.launch(Launcher.java:239)
> >>         at
> org.jvnet.hudson.maven3.agent.Maven3Main.launch(Maven3Main.java:158)
> >>         at hudson.maven.Maven3Builder.call(Maven3Builder.java:98)
> >>         at hudson.maven.Maven3Builder.call(Maven3Builder.java:64)
> >>         at hudson.remoting.UserRequest.perform(UserRequest.java:118)
> >>         at hudson.remoting.UserRequest.perform(UserRequest.java:48)
> >>         at hudson.remoting.Request$2.run(Request.java:326)
> >>         at
> hudson.remoting.InterceptingExecutorService$1.call(InterceptingExecutorService.java:72)
> >>         at
> java.util.concurrent.FutureTask$Sync.innerRun(FutureTask.java:303)
> >>         at java.util.concurrent.FutureTask.run(FutureTask.java:138)
> >>         at
> java.util.concurrent.ThreadPoolExecutor$Worker.runTask(ThreadPoolExecutor.java:886)
> >>         at
> java.util.concurrent.ThreadPoolExecutor$Worker.run(ThreadPoolExecutor.java:908)
> >>         at java.lang.Thread.run(Thread.java:662)
> >> Caused by: org.apache.maven.plugin.CompilationFailureException:
> Compilation failure
> >>         at
> org.apache.maven.plugin.AbstractCompilerMojo.execute(AbstractCompilerMojo.java:656)
> >>         at
> org.apache.maven.plugin.TestCompilerMojo.execute(TestCompilerMojo.java:161)
> >>         at
> org.apache.maven.plugin.DefaultBuildPluginManager.executeMojo(DefaultBuildPluginManager.java:101)
> >>         at
> org.apache.maven.lifecycle.internal.MojoExecutor.execute(MojoExecutor.java:209)
> >>         ... 27 more
> >> Maven failed with error.
> >> Sending e-mails to: dev@gora.apache.org renatoj.marroquin@gmail.com
> >> Sending e-mails to: dev@gora.apache.org renatoj.marroquin@gmail.com
> >> channel stopped
>
>
>
> --
> Lewis
>

Mime
  • Unnamed multipart/alternative (inline, None, 0 bytes)
View raw message