gora-dev mailing list archives

Site index · List index
Message view « Date » · « Thread »
Top « Date » · « Thread »
From "ASF GitHub Bot (JIRA)" <j...@apache.org>
Subject [jira] [Commented] (GORA-445) Review extent of transative dependencies post GORA-386
Date Tue, 17 May 2016 05:46:13 GMT

    [ https://issues.apache.org/jira/browse/GORA-445?page=com.atlassian.jira.plugin.system.issuetabpanels:comment-tabpanel&focusedCommentId=15286091#comment-15286091
] 

ASF GitHub Bot commented on GORA-445:
-------------------------------------

GitHub user lewismc opened a pull request:

    https://github.com/apache/gora/pull/63

    GORA-445 Review extent of transative dependencies post GORA-386

    This issue brings in a provided scope for the spark dependency.
    It also begins to implement Javadoc corrections for the entire codebase. The Javadoc corrections
needs to be completed. This happens when building mvn javadoc:aggregate with JDK1.8
    ```
    [INFO] ------------------------------------------------------------------------
    [INFO] BUILD FAILURE
    [INFO] ------------------------------------------------------------------------
    [INFO] Total time: 22.519 s
    [INFO] Finished at: 2016-05-16T22:11:26-07:00
    [INFO] Final Memory: 51M/304M
    [INFO] ------------------------------------------------------------------------
    [ERROR] Failed to execute goal org.apache.maven.plugins:maven-javadoc-plugin:2.8:aggregate
(default-cli) on project gora: An error has occurred in JavaDocs report generation:
    [ERROR] Exit code: 1 - /usr/local/gora-dev/gora-core/src/main/java/org/apache/gora/store/impl/FileBackedDataStoreBase.java:120:
warning: no @return
    [ERROR] protected InputStream createInputStream() throws IOException {
    [ERROR] ^
    [ERROR] /usr/local/gora-dev/gora-core/src/main/java/org/apache/gora/store/impl/FileBackedDataStoreBase.java:120:
warning: no @throws for java.io.IOException
    [ERROR] protected InputStream createInputStream() throws IOException {
    [ERROR] ^
    [ERROR] /usr/local/gora-dev/gora-core/src/main/java/org/apache/gora/store/impl/FileBackedDataStoreBase.java:130:
warning: no @return
    [ERROR] protected OutputStream createOutputStream() {
    [ERROR] ^
    [ERROR] /usr/local/gora-dev/gora-core/src/main/java/org/apache/gora/store/impl/FileBackedDataStoreBase.java:196:
warning: no @param for query
    [ERROR] protected abstract Result<K,T> executeQuery(Query<K,T> query)
    [ERROR] ^
    [ERROR] /usr/local/gora-dev/gora-core/src/main/java/org/apache/gora/store/impl/FileBackedDataStoreBase.java:196:
warning: no @return
    [ERROR] protected abstract Result<K,T> executeQuery(Query<K,T> query)
    [ERROR] ^
    [ERROR] /usr/local/gora-dev/gora-core/src/main/java/org/apache/gora/store/impl/FileBackedDataStoreBase.java:196:
warning: no @throws for java.io.IOException
    [ERROR] protected abstract Result<K,T> executeQuery(Query<K,T> query)
    [ERROR] ^
    [ERROR] /usr/local/gora-dev/gora-core/src/main/java/org/apache/gora/store/impl/FileBackedDataStoreBase.java:202:
warning: no @param for query
    [ERROR] protected abstract Result<K,T> executePartial(FileSplitPartitionQuery<K,T>
query)
    [ERROR] ^
    [ERROR] /usr/local/gora-dev/gora-core/src/main/java/org/apache/gora/store/impl/FileBackedDataStoreBase.java:202:
warning: no @return
    [ERROR] protected abstract Result<K,T> executePartial(FileSplitPartitionQuery<K,T>
query)
    [ERROR] ^
    [ERROR] /usr/local/gora-dev/gora-core/src/main/java/org/apache/gora/store/impl/FileBackedDataStoreBase.java:202:
warning: no @throws for java.io.IOException
    [ERROR] protected abstract Result<K,T> executePartial(FileSplitPartitionQuery<K,T>
query)
    [ERROR] ^
    [ERROR] /usr/local/gora-dev/gora-core/src/main/java/org/apache/gora/store/DataStore.java:148:
warning: no @param for key
    [ERROR] void put(K key, T obj);
    [ERROR] ^
    [ERROR] /usr/local/gora-dev/gora-core/src/main/java/org/apache/gora/store/DataStore.java:148:
warning: no @param for obj
    [ERROR] void put(K key, T obj);
    [ERROR] ^
    [ERROR] /usr/local/gora-dev/gora-core/src/main/java/org/apache/gora/store/DataStore.java:185:
warning: no description for @throws
    [ERROR] * @throws IOException
    [ERROR] ^
    [ERROR] /usr/local/gora-dev/gora-core/src/main/java/org/apache/gora/store/impl/DataStoreBase.java:164:
warning: no @param for fields
    [ERROR] protected String[] getFieldsToQuery(String[] fields) {
    [ERROR] ^
    [ERROR] /usr/local/gora-dev/gora-core/src/main/java/org/apache/gora/store/impl/DataStoreBase.java:164:
warning: no @return
    [ERROR] protected String[] getFieldsToQuery(String[] fields) {
    [ERROR] ^
    [ERROR] /usr/local/gora-dev/gora-core/src/main/java/org/apache/gora/store/impl/DataStoreBase.java:259:
warning: no @return
    [ERROR] protected String getSchemaName(String mappingSchemaName, Class<?> persistentClass)
{
    [ERROR] ^
    [ERROR] /usr/local/gora-dev/gora-core/src/main/java/org/apache/gora/avro/store/AvroStore.java:52:
warning: no description for @param
    [ERROR] * @param <T>
    [ERROR] ^
    [ERROR] /usr/local/gora-dev/gora-core/src/main/java/org/apache/gora/filter/Filter.java:36:
warning: no description for @param
    [ERROR] * @param key
    [ERROR] ^
    [ERROR] /usr/local/gora-dev/gora-core/src/main/java/org/apache/gora/filter/Filter.java:37:
warning: no description for @param
    [ERROR] * @param persistent
    [ERROR] ^
    [ERROR] /usr/local/gora-dev/gora-core/src/main/java/org/apache/gora/filter/Filter.java:28:
warning: no description for @param
    [ERROR] * @param <K>
    [ERROR] ^
    [ERROR] /usr/local/gora-dev/gora-core/src/main/java/org/apache/gora/filter/Filter.java:29:
warning: no description for @param
    [ERROR] * @param <T>
    [ERROR] ^
    [ERROR] /usr/local/gora-dev/gora-core/src/main/java/org/apache/gora/filter/FilterList.java:36:
warning: no description for @param
    [ERROR] * @param <K>
    [ERROR] ^
    [ERROR] /usr/local/gora-dev/gora-core/src/main/java/org/apache/gora/filter/FilterList.java:37:
warning: no description for @param
    [ERROR] * @param <T>
    [ERROR] ^
    [ERROR] /usr/local/gora-dev/gora-core/src/main/java/org/apache/gora/filter/MapFieldValueFilter.java:37:
warning: no description for @param
    [ERROR] * @param <K>
    [ERROR] ^
    [ERROR] /usr/local/gora-dev/gora-core/src/main/java/org/apache/gora/filter/MapFieldValueFilter.java:38:
warning: no description for @param
    [ERROR] * @param <T>
    [ERROR] ^
    [ERROR] /usr/local/gora-dev/gora-core/src/main/java/org/apache/gora/filter/SingleFieldValueFilter.java:36:
warning: no description for @param
    [ERROR] * @param <K>
    [ERROR] ^
    [ERROR] /usr/local/gora-dev/gora-core/src/main/java/org/apache/gora/filter/SingleFieldValueFilter.java:37:
warning: no description for @param
    [ERROR] * @param <T>
    [ERROR] ^
    [ERROR] /usr/local/gora-dev/gora-core/src/main/java/org/apache/gora/mapreduce/GoraInputFormat.java:133:
warning: no description for @throws
    [ERROR] * @throws IOException
    [ERROR] ^
    [ERROR] /usr/local/gora-dev/gora-core/src/main/java/org/apache/gora/mapreduce/GoraInputFormat.java:135:
warning: no @param for <K1>
    [ERROR] public static <K1, V1 extends Persistent> void setInput(Job job
    [ERROR] ^
    [ERROR] /usr/local/gora-dev/gora-core/src/main/java/org/apache/gora/mapreduce/GoraInputFormat.java:135:
warning: no @param for <V1>
    [ERROR] public static <K1, V1 extends Persistent> void setInput(Job job
    [ERROR] ^
    [ERROR] /usr/local/gora-dev/gora-core/src/main/java/org/apache/gora/mapreduce/GoraInputFormat.java:154:
warning: no description for @throws
    [ERROR] * @throws IOException
    [ERROR] ^
    [ERROR] /usr/local/gora-dev/gora-core/src/main/java/org/apache/gora/mapreduce/GoraInputFormat.java:156:
warning: no @param for <K1>
    [ERROR] public static <K1, V1 extends Persistent> void setInput(
    [ERROR] ^
    [ERROR] /usr/local/gora-dev/gora-core/src/main/java/org/apache/gora/mapreduce/GoraInputFormat.java:156:
warning: no @param for <V1>
    [ERROR] public static <K1, V1 extends Persistent> void setInput(
    [ERROR] ^
    [ERROR] /usr/local/gora-dev/gora-core/src/main/java/org/apache/gora/mapreduce/GoraMapper.java:50:
warning: no @param for <K1>
    [ERROR] public static <K1, V1 extends Persistent, K2, V2> void initMapperJob(
    [ERROR] ^
    [ERROR] /usr/local/gora-dev/gora-core/src/main/java/org/apache/gora/mapreduce/GoraMapper.java:50:
warning: no @param for <V1>
    [ERROR] public static <K1, V1 extends Persistent, K2, V2> void initMapperJob(
    [ERROR] ^
    [ERROR] /usr/local/gora-dev/gora-core/src/main/java/org/apache/gora/mapreduce/GoraMapper.java:50:
warning: no @param for <K2>
    [ERROR] public static <K1, V1 extends Persistent, K2, V2> void initMapperJob(
    [ERROR] ^
    [ERROR] /usr/local/gora-dev/gora-core/src/main/java/org/apache/gora/mapreduce/GoraMapper.java:50:
warning: no @param for <V2>
    [ERROR] public static <K1, V1 extends Persistent, K2, V2> void initMapperJob(
    [ERROR] ^
    [ERROR] /usr/local/gora-dev/gora-core/src/main/java/org/apache/gora/mapreduce/GoraMapper.java:50:
warning: no @throws for java.io.IOException
    [ERROR] public static <K1, V1 extends Persistent, K2, V2> void initMapperJob(
    [ERROR] ^
    [ERROR] /usr/local/gora-dev/gora-core/src/main/java/org/apache/gora/mapreduce/GoraMapper.java:88:
warning: no @param for <K1>
    [ERROR] public static <K1, V1 extends Persistent, K2, V2> void initMapperJob(
    [ERROR] ^
    [ERROR] /usr/local/gora-dev/gora-core/src/main/java/org/apache/gora/mapreduce/GoraMapper.java:88:
warning: no @param for <V1>
    [ERROR] public static <K1, V1 extends Persistent, K2, V2> void initMapperJob(
    [ERROR] ^
    [ERROR] /usr/local/gora-dev/gora-core/src/main/java/org/apache/gora/mapreduce/GoraMapper.java:88:
warning: no @param for <K2>
    [ERROR] public static <K1, V1 extends Persistent, K2, V2> void initMapperJob(
    [ERROR] ^
    [ERROR] /usr/local/gora-dev/gora-core/src/main/java/org/apache/gora/mapreduce/GoraMapper.java:88:
warning: no @param for <V2>
    [ERROR] public static <K1, V1 extends Persistent, K2, V2> void initMapperJob(
    [ERROR] ^
    [ERROR] /usr/local/gora-dev/gora-core/src/main/java/org/apache/gora/mapreduce/GoraMapper.java:88:
warning: no @throws for java.io.IOException
    [ERROR] public static <K1, V1 extends Persistent, K2, V2> void initMapperJob(
    [ERROR] ^
    [ERROR] /usr/local/gora-dev/gora-core/src/main/java/org/apache/gora/mapreduce/GoraMapper.java:112:
warning: no @param for <K1>
    [ERROR] public static <K1, V1 extends Persistent, K2, V2> void initMapperJob(
    [ERROR] ^
    [ERROR] /usr/local/gora-dev/gora-core/src/main/java/org/apache/gora/mapreduce/GoraMapper.java:112:
warning: no @param for <V1>
    [ERROR] public static <K1, V1 extends Persistent, K2, V2> void initMapperJob(
    [ERROR] ^
    [ERROR] /usr/local/gora-dev/gora-core/src/main/java/org/apache/gora/mapreduce/GoraMapper.java:112:
warning: no @param for <K2>
    [ERROR] public static <K1, V1 extends Persistent, K2, V2> void initMapperJob(
    [ERROR] ^
    [ERROR] /usr/local/gora-dev/gora-core/src/main/java/org/apache/gora/mapreduce/GoraMapper.java:112:
warning: no @param for <V2>
    [ERROR] public static <K1, V1 extends Persistent, K2, V2> void initMapperJob(
    [ERROR] ^
    [ERROR] /usr/local/gora-dev/gora-core/src/main/java/org/apache/gora/mapreduce/GoraMapper.java:112:
warning: no @throws for java.io.IOException
    [ERROR] public static <K1, V1 extends Persistent, K2, V2> void initMapperJob(
    [ERROR] ^
    [ERROR] /usr/local/gora-dev/gora-core/src/main/java/org/apache/gora/mapreduce/GoraMapper.java:142:
warning: no @param for <K1>
    [ERROR] public static <K1, V1 extends Persistent, K2, V2> void initMapperJob(
    [ERROR] ^
    [ERROR] /usr/local/gora-dev/gora-core/src/main/java/org/apache/gora/mapreduce/GoraMapper.java:142:
warning: no @param for <V1>
    [ERROR] public static <K1, V1 extends Persistent, K2, V2> void initMapperJob(
    [ERROR] ^
    [ERROR] /usr/local/gora-dev/gora-core/src/main/java/org/apache/gora/mapreduce/GoraMapper.java:142:
warning: no @param for <K2>
    [ERROR] public static <K1, V1 extends Persistent, K2, V2> void initMapperJob(
    [ERROR] ^
    [ERROR] /usr/local/gora-dev/gora-core/src/main/java/org/apache/gora/mapreduce/GoraMapper.java:142:
warning: no @param for <V2>
    [ERROR] public static <K1, V1 extends Persistent, K2, V2> void initMapperJob(
    [ERROR] ^
    [ERROR] /usr/local/gora-dev/gora-core/src/main/java/org/apache/gora/mapreduce/GoraMapper.java:142:
warning: no @throws for java.io.IOException
    [ERROR] public static <K1, V1 extends Persistent, K2, V2> void initMapperJob(
    [ERROR] ^
    [ERROR] /usr/local/gora-dev/gora-core/src/main/java/org/apache/gora/mapreduce/GoraMapper.java:163:
warning: no @param for <K1>
    [ERROR] public static <K1, V1 extends Persistent, K2, V2> void initMapperJob(
    [ERROR] ^
    [ERROR] /usr/local/gora-dev/gora-core/src/main/java/org/apache/gora/mapreduce/GoraMapper.java:163:
warning: no @param for <V1>
    [ERROR] public static <K1, V1 extends Persistent, K2, V2> void initMapperJob(
    [ERROR] ^
    [ERROR] /usr/local/gora-dev/gora-core/src/main/java/org/apache/gora/mapreduce/GoraMapper.java:163:
warning: no @param for <K2>
    [ERROR] public static <K1, V1 extends Persistent, K2, V2> void initMapperJob(
    [ERROR] ^
    [ERROR] /usr/local/gora-dev/gora-core/src/main/java/org/apache/gora/mapreduce/GoraMapper.java:163:
warning: no @param for <V2>
    [ERROR] public static <K1, V1 extends Persistent, K2, V2> void initMapperJob(
    [ERROR] ^
    [ERROR] /usr/local/gora-dev/gora-core/src/main/java/org/apache/gora/mapreduce/GoraMapper.java:163:
warning: no @throws for java.io.IOException
    [ERROR] public static <K1, V1 extends Persistent, K2, V2> void initMapperJob(
    [ERROR] ^
    [ERROR] /usr/local/gora-dev/gora-core/src/main/java/org/apache/gora/mapreduce/GoraOutputFormat.java:102:
warning: no @param for <K>
    [ERROR] public static <K, V extends Persistent> void setOutput(Job job,
    [ERROR] ^
    [ERROR] /usr/local/gora-dev/gora-core/src/main/java/org/apache/gora/mapreduce/GoraOutputFormat.java:102:
warning: no @param for <V>
    [ERROR] public static <K, V extends Persistent> void setOutput(Job job,
    [ERROR] ^
    [ERROR] /usr/local/gora-dev/gora-core/src/main/java/org/apache/gora/mapreduce/GoraOutputFormat.java:117:
warning: no @param for <K>
    [ERROR] public static <K, V extends Persistent> void setOutput(Job job,
    [ERROR] ^
    [ERROR] /usr/local/gora-dev/gora-core/src/main/java/org/apache/gora/mapreduce/GoraOutputFormat.java:117:
warning: no @param for <V>
    [ERROR] public static <K, V extends Persistent> void setOutput(Job job,
    [ERROR] ^
    [ERROR] /usr/local/gora-dev/gora-core/src/main/java/org/apache/gora/mapreduce/GoraReducer.java:41:
warning: no @param for <K1>
    [ERROR] void initReducerJob(
    [ERROR] ^
    [ERROR] /usr/local/gora-dev/gora-core/src/main/java/org/apache/gora/mapreduce/GoraReducer.java:41:
warning: no @param for <V1>
    [ERROR] void initReducerJob(
    [ERROR] ^
    [ERROR] /usr/local/gora-dev/gora-core/src/main/java/org/apache/gora/mapreduce/GoraReducer.java:41:
warning: no @param for <K2>
    [ERROR] void initReducerJob(
    [ERROR] ^
    [ERROR] /usr/local/gora-dev/gora-core/src/main/java/org/apache/gora/mapreduce/GoraReducer.java:41:
warning: no @param for <V2>
    [ERROR] void initReducerJob(
    [ERROR] ^
    [ERROR] /usr/local/gora-dev/gora-core/src/main/java/org/apache/gora/mapreduce/GoraReducer.java:61:
warning: no @param for <K1>
    [ERROR] void initReducerJob(
    [ERROR] ^
    [ERROR] /usr/local/gora-dev/gora-core/src/main/java/org/apache/gora/mapreduce/GoraReducer.java:61:
warning: no @param for <V1>
    [ERROR] void initReducerJob(
    [ERROR] ^
    [ERROR] /usr/local/gora-dev/gora-core/src/main/java/org/apache/gora/mapreduce/GoraReducer.java:61:
warning: no @param for <K2>
    [ERROR] void initReducerJob(
    [ERROR] ^
    [ERROR] /usr/local/gora-dev/gora-core/src/main/java/org/apache/gora/mapreduce/GoraReducer.java:61:
warning: no @param for <V2>
    [ERROR] void initReducerJob(
    [ERROR] ^
    [ERROR] /usr/local/gora-dev/gora-core/src/main/java/org/apache/gora/mapreduce/GoraReducer.java:77:
warning: no @param for <K1>
    [ERROR] void initReducerJob(
    [ERROR] ^
    [ERROR] /usr/local/gora-dev/gora-core/src/main/java/org/apache/gora/mapreduce/GoraReducer.java:77:
warning: no @param for <V1>
    [ERROR] void initReducerJob(
    [ERROR] ^
    [ERROR] /usr/local/gora-dev/gora-core/src/main/java/org/apache/gora/mapreduce/GoraReducer.java:77:
warning: no @param for <K2>
    [ERROR] void initReducerJob(
    [ERROR] ^
    [ERROR] /usr/local/gora-dev/gora-core/src/main/java/org/apache/gora/mapreduce/GoraReducer.java:77:
warning: no @param for <V2>
    [ERROR] void initReducerJob(
    [ERROR] ^
    [ERROR] /usr/local/gora-dev/gora-core/src/main/java/org/apache/gora/mapreduce/PersistentSerializer.java:58:
error: reference not found
    [ERROR] * Do the serialization of the {@link Persistent} object
    [ERROR] ^
    [ERROR] /usr/local/gora-dev/gora-core/src/main/java/org/apache/gora/persistency/BeanFactory.java:30:
warning: no @throws for java.lang.Exception
    [ERROR] K newKey() throws Exception;
    [ERROR] ^
    [ERROR] /usr/local/gora-dev/gora-core/src/main/java/org/apache/gora/persistency/impl/BeanFactoryImpl.java:30:
error: reference not found
    [ERROR] * {@link Persistent#newInstance(org.apache.gora.persistency.StateManager)}.
    [ERROR] ^
    [ERROR] /usr/local/gora-dev/gora-core/src/main/java/org/apache/gora/persistency/impl/BeanFactoryImpl.java:32:
warning - Tag @link: can't find newInstance(org.apache.gora.persistency.StateManager) in org.apache.gora.persistency.Persistent
    [ERROR] /usr/local/gora-dev/gora-core/src/main/java/org/apache/gora/persistency/impl/BeanFactoryImpl.java:55:
warning: no description for @param
    [ERROR] * @param persistentClass
    [ERROR] ^
    [ERROR] /usr/local/gora-dev/gora-core/src/main/java/org/apache/gora/persistency/ws/impl/BeanFactoryWSImpl.java:33:
error: reference not found
    [ERROR] * {@link Persistent#newInstance(org.apache.gora.persistency.StateManager)}.
    [ERROR] ^
    [ERROR] /usr/local/gora-dev/gora-core/src/main/java/org/apache/gora/persistency/ws/impl/BeanFactoryWSImpl.java:35:
warning - Tag @link: can't find newInstance(org.apache.gora.persistency.StateManager) in org.apache.gora.persistency.Persistent
    [ERROR] /usr/local/gora-dev/gora-core/src/main/java/org/apache/gora/persistency/ws/impl/BeanFactoryWSImpl.java:71:
warning: no description for @param
    [ERROR] * @param keyClass
    [ERROR] ^
    [ERROR] /usr/local/gora-dev/gora-core/src/main/java/org/apache/gora/persistency/ws/impl/BeanFactoryWSImpl.java:72:
warning: no description for @param
    [ERROR] * @param persistentClass
    [ERROR] ^
    [ERROR] /usr/local/gora-dev/gora-core/src/main/java/org/apache/gora/persistency/ws/impl/PersistentWSBase.java:65:
warning: no @return
    [ERROR] public String[] getFields() {
    [ERROR] ^
    [ERROR] /usr/local/gora-dev/gora-core/src/main/java/org/apache/gora/persistency/ws/impl/PersistentWSBase.java:72:
warning: no @param for index
    [ERROR] public String getField(int index) {
    [ERROR] ^
    [ERROR] /usr/local/gora-dev/gora-core/src/main/java/org/apache/gora/persistency/ws/impl/PersistentWSBase.java:72:
warning: no @return
    [ERROR] public String getField(int index) {
    [ERROR] ^
    [ERROR] /usr/local/gora-dev/gora-core/src/main/java/org/apache/gora/persistency/ws/impl/PersistentWSBase.java:79:
warning: no @param for field
    [ERROR] public int getFieldIndex(String field) {
    [ERROR] ^
    [ERROR] /usr/local/gora-dev/gora-core/src/main/java/org/apache/gora/persistency/ws/impl/PersistentWSBase.java:79:
warning: no @return
    [ERROR] public int getFieldIndex(String field) {
    [ERROR] ^
    [ERROR] /usr/local/gora-dev/gora-core/src/main/java/org/apache/gora/persistency/ws/impl/PersistentWSBase.java:174:
warning: no description for @param
    [ERROR] * @param index
    [ERROR] ^
    [ERROR] /usr/local/gora-dev/gora-core/src/main/java/org/apache/gora/persistency/ws/impl/PersistentWSBase.java:175:
warning: no description for @param
    [ERROR] * @param value
    [ERROR] ^
    [ERROR] /usr/local/gora-dev/gora-core/src/main/java/org/apache/gora/persistency/ws/impl/PersistentWSBase.java:176:
warning: no description for @return
    [ERROR] * @return
    [ERROR] ^
    [ERROR] /usr/local/gora-dev/gora-core/src/main/java/org/apache/gora/query/ws/impl/PartitionWSQueryImpl.java:84:
warning: no description for @return
    [ERROR] * @return
    [ERROR] ^
    [ERROR] /usr/local/gora-dev/gora-core/src/main/java/org/apache/gora/query/ws/impl/QueryWSBase.java:261:
warning: no description for @return
    [ERROR] * @return
    [ERROR] ^
    [ERROR] /usr/local/gora-dev/gora-core/src/main/java/org/apache/gora/query/ws/impl/QueryWSBase.java:269:
warning: no description for @param
    [ERROR] * @param auth
    [ERROR] ^
    [ERROR] /usr/local/gora-dev/gora-core/src/main/java/org/apache/gora/query/ws/impl/PartitionWSQueryImpl.java:64:
warning: no @param for baseQuery
    [ERROR] public PartitionWSQueryImpl(Query<K, T> baseQuery, K startKey, K endKey,
    [ERROR] ^
    [ERROR] /usr/local/gora-dev/gora-core/src/main/java/org/apache/gora/query/ws/impl/PartitionWSQueryImpl.java:64:
warning: no @param for startKey
    [ERROR] public PartitionWSQueryImpl(Query<K, T> baseQuery, K startKey, K endKey,
    [ERROR] ^
    [ERROR] /usr/local/gora-dev/gora-core/src/main/java/org/apache/gora/query/ws/impl/PartitionWSQueryImpl.java:64:
warning: no @param for endKey
    [ERROR] public PartitionWSQueryImpl(Query<K, T> baseQuery, K startKey, K endKey,
    [ERROR] ^
    [ERROR] /usr/local/gora-dev/gora-core/src/main/java/org/apache/gora/query/ws/impl/PartitionWSQueryImpl.java:64:
warning: no @param for locations
    [ERROR] public PartitionWSQueryImpl(Query<K, T> baseQuery, K startKey, K endKey,
    [ERROR] ^
    [ERROR] /usr/local/gora-dev/gora-core/src/main/java/org/apache/gora/query/ws/impl/PartitionWSQueryImpl.java:57:
warning: no @param for baseQuery
    [ERROR] public PartitionWSQueryImpl(Query<K, T> baseQuery, String... locations)
{
    [ERROR] ^
    [ERROR] /usr/local/gora-dev/gora-core/src/main/java/org/apache/gora/query/ws/impl/PartitionWSQueryImpl.java:57:
warning: no @param for locations
    [ERROR] public PartitionWSQueryImpl(Query<K, T> baseQuery, String... locations)
{
    [ERROR] ^
    [ERROR] /usr/local/gora-dev/gora-core/src/main/java/org/apache/gora/query/ws/impl/QueryWSBase.java:79:
warning: no description for @param
    [ERROR] * @param dataStore
    [ERROR] ^
    [ERROR] /usr/local/gora-dev/gora-core/src/main/java/org/apache/gora/query/ws/impl/ResultWSBase.java:122:
warning: no @return
    [ERROR] protected boolean isLimitReached() {
    [ERROR] ^
    [ERROR] /usr/local/gora-dev/gora-core/src/main/java/org/apache/gora/query/ws/impl/ResultWSBase.java:168:
warning: no @return
    [ERROR] protected abstract boolean nextInner() throws Exception;
    [ERROR] ^
    [ERROR] /usr/local/gora-dev/gora-core/src/main/java/org/apache/gora/query/ws/impl/ResultWSBase.java:168:
warning: no @throws for java.lang.Exception
    [ERROR] protected abstract boolean nextInner() throws Exception;
    [ERROR] ^
    [ERROR] /usr/local/gora-dev/gora-core/src/main/java/org/apache/gora/store/DataStore.java:36:
error: element not closed: a
    [ERROR] * <p><a name="visibility"><b>Note:</b> Results of updates
({@link #put(Object, Persistent)},
    [ERROR] ^
    [ERROR] /usr/local/gora-dev/gora-core/src/main/java/org/apache/gora/util/AvroUtils.java:90:
error: @param name not found
    [ERROR] * @param persistent
    [ERROR] ^
    [ERROR] /usr/local/gora-dev/gora-core/src/main/java/org/apache/gora/util/ByteUtils.java:627:
error: malformed HTML
    [ERROR] * @return 0 if equal, < 0 if left is less than right, etc.
    [ERROR] ^
    [ERROR] /usr/local/gora-dev/gora-core/src/main/java/org/apache/gora/util/ByteUtils.java:640:
error: malformed HTML
    [ERROR] * @return 0 if equal, < 0 if left is less than right, etc.
    [ERROR] ^
    [ERROR] /usr/local/gora-dev/gora-cassandra/src/main/java/org/apache/gora/cassandra/store/CassandraClient.java:108:
error: reference not found
    [ERROR] * We make a quick check within {@link org.apache.gora.cassandra.store.CassandraClient#checkKeyspace(String)
    [ERROR] ^
    [ERROR] /usr/local/gora-dev/gora-cassandra/src/main/java/org/apache/gora/cassandra/store/CassandraClient.java:109:
error: unterminated inline tag
    [ERROR] * to see if our keyspace has already been invented, this simple check prevents
us from
    [ERROR] ^
    [ERROR] /usr/local/gora-dev/gora-cassandra/src/main/java/org/apache/gora/cassandra/store/CassandraClient.java:115:
error: reference not found
    [ERROR] * @param persistentClass the generated {@link org.apache.org.gora.persistency.Peristent}
bean representing the data.
    [ERROR] ^
    [ERROR] /usr/local/gora-dev/gora-cassandra/src/main/java/org/apache/gora/cassandra/store/CassandraClient.java:176:
error: unexpected text
    [ERROR] * @see http://hector-client.github.io/hector/build/html/content/consistency_level.html
    [ERROR] ^
    [ERROR] /usr/local/gora-dev/gora-cassandra/src/main/java/org/apache/gora/cassandra/store/CassandraClient.java:300:
error: @param name not found
    [ERROR] * @param fieldName
    [ERROR] ^
    [ERROR] /usr/local/gora-dev/gora-cassandra/src/main/java/org/apache/gora/cassandra/store/CassandraClient.java:71:
error: unexpected content
    [ERROR] * @see {@link org.apache.gora.cassandra.store.CassandraStore#initialize(Class,
Class, Properties)}
    [ERROR] ^
    [ERROR] /usr/local/gora-dev/gora-cassandra/src/main/java/org/apache/gora/cassandra/store/CassandraStore.java:135:
error: type arguments not allowed here
    [ERROR] * {@link org.apache.gora.store.DataStoreFactory#createDataStore(Class<D>
dataStoreClass, Class<K> keyClass, Class<T> persistent, org.apache.hadoop.conf.Configuration
conf)}
    [ERROR] ^
    [ERROR] /usr/local/gora-dev/gora-cassandra/src/main/java/org/apache/gora/cassandra/store/CassandraStore.java:137:
error: type arguments not allowed here
    [ERROR] * {@link org.apache.gora.cassandra.store.CassandraClient#initialize(Class<K>
keyClass, Class<T> persistentClass)}.
    [ERROR] ^
    [ERROR] /usr/local/gora-dev/gora-cassandra/src/main/java/org/apache/gora/cassandra/store/CassandraStore.java:406:
error: ')' missing in reference
    [ERROR] * @see org.apache.gora.store.DataStore#put(java.lang.Object,
    [ERROR] ^
    [ERROR] /usr/local/gora-dev/gora-cassandra/src/main/java/org/apache/gora/cassandra/store/HectorUtils.java:37:
error: unknown tag: CassandraClient
    [ERROR] * Take a look at {@CassandraClient} for safe usage.
    [ERROR] ^
    [ERROR] /usr/local/gora-dev/gora-goraci/src/main/java/org/apache/gora/goraci/generated/CINode.java:110:
error: @param name not found
    [ERROR] * @param value the value to set.
    [ERROR] ^
    [ERROR] /usr/local/gora-dev/gora-goraci/src/main/java/org/apache/gora/goraci/generated/CINode.java:134:
error: @param name not found
    [ERROR] * @param value the value to set.
    [ERROR] ^
    [ERROR] /usr/local/gora-dev/gora-goraci/src/main/java/org/apache/gora/goraci/generated/CINode.java:158:
error: @param name not found
    [ERROR] * @param value the value to set.
    [ERROR] ^
    [ERROR] /usr/local/gora-dev/gora-goraci/src/main/java/org/apache/gora/goraci/generated/CINode.java:357:
error: @param name not found
    [ERROR] * @param value the value to set.
    [ERROR] ^
    [ERROR] /usr/local/gora-dev/gora-goraci/src/main/java/org/apache/gora/goraci/generated/CINode.java:380:
error: @param name not found
    [ERROR] * @param value the value to set.
    [ERROR] ^
    [ERROR] /usr/local/gora-dev/gora-goraci/src/main/java/org/apache/gora/goraci/generated/CINode.java:403:
error: @param name not found
    [ERROR] * @param value the value to set.
    [ERROR] ^
    [ERROR] /usr/local/gora-dev/gora-goraci/src/main/java/org/apache/gora/goraci/generated/Flushed.java:100:
error: @param name not found
    [ERROR] * @param value the value to set.
    [ERROR] ^
    [ERROR] /usr/local/gora-dev/gora-goraci/src/main/java/org/apache/gora/goraci/generated/Flushed.java:238:
error: @param name not found
    [ERROR] * @param value the value to set.
    [ERROR] ^
    [ERROR] /usr/local/gora-dev/gora-hbase/src/main/java/org/apache/gora/hbase/store/HBaseStore.java:835:
error: bad use of '>'
    [ERROR] * @param numRows the number of rows for caching >= 0
    [ERROR] ^
    [ERROR] /usr/local/gora-dev/gora-hbase/src/main/java/org/apache/gora/hbase/util/HBaseByteInterface.java:41:
error: malformed HTML
    [ERROR] * Contains utility methods for byte[] <-> field
    [ERROR] ^
    [ERROR] /usr/local/gora-dev/gora-hbase/src/main/java/org/apache/gora/hbase/util/HBaseByteInterface.java:41:
error: bad use of '>'
    [ERROR] * Contains utility methods for byte[] <-> field
    [ERROR] ^
    [ERROR] /usr/local/gora-dev/gora-dynamodb/src/main/java/org/apache/gora/dynamodb/compiler/GoraDynamoDBCompiler.java:350:
error: @param name not found
    [ERROR] * @param argsReceives
    [ERROR] ^
    [ERROR] /usr/local/gora-dev/gora-dynamodb/src/main/java/org/apache/gora/dynamodb/compiler/GoraDynamoDBCompiler.java:352:
error: exception not thrown: java.lang.Exception
    [ERROR] * @throws Exception
    [ERROR] ^
    [ERROR] /usr/local/gora-dev/gora-dynamodb/src/main/java/org/apache/gora/dynamodb/query/DynamoDBQuery.java:224:
error: @param name not found
    [ERROR] * @param pHashAttrValueHash
    [ERROR] ^
    [ERROR] /usr/local/gora-dev/gora-dynamodb/src/main/java/org/apache/gora/dynamodb/store/DynamoDBAvroStore.java:51:
error: @param name not found
    [ERROR] * @param DynamoDBStore
    [ERROR] ^
    [ERROR] /usr/local/gora-dev/gora-dynamodb/src/main/java/org/apache/gora/dynamodb/store/IDynamoDB.java:27:
error: @param name not found
    [ERROR] * @param DynamoDBStore handler to main DynamoDB
    [ERROR] ^
    [ERROR] /usr/local/gora-dev/gora-dynamodb/src/main/java/org/apache/gora/dynamodb/store/DynamoDBMapping.java:192:
error: @param name not found
    [ERROR] * @param keyType2
    [ERROR] ^
    [ERROR] /usr/local/gora-dev/gora-dynamodb/src/main/java/org/apache/gora/dynamodb/store/DynamoDBMapping.java:252:
error: @param name not found
    [ERROR] * @param itemNumber
    [ERROR] ^
    [ERROR] /usr/local/gora-dev/gora-dynamodb/src/main/java/org/apache/gora/dynamodb/store/DynamoDBNativeStore.java:63:
error: exception not thrown: java.io.IOException
    [ERROR] * @throws IOException
    [ERROR] ^
    [ERROR] /usr/local/gora-dev/gora-dynamodb/src/main/java/org/apache/gora/dynamodb/store/DynamoDBNativeStore.java:185:
error: exception not thrown: java.io.IOException
    [ERROR] * @throws IOException
    [ERROR] ^
    [ERROR] /usr/local/gora-dev/gora-dynamodb/src/main/java/org/apache/gora/dynamodb/store/DynamoDBNativeStore.java:196:
error: exception not thrown: java.io.IOException
    [ERROR] * @throws IOException
    [ERROR] ^
    [ERROR] /usr/local/gora-dev/gora-dynamodb/src/main/java/org/apache/gora/dynamodb/store/DynamoDBNativeStore.java:216:
error: exception not thrown: java.io.IOException
    [ERROR] * @throws IOException
    [ERROR] ^
    [ERROR] /usr/local/gora-dev/gora-dynamodb/src/main/java/org/apache/gora/dynamodb/store/DynamoDBNativeStore.java:247:
error: exception not thrown: java.io.IOException
    [ERROR] * @throws IOException
    [ERROR] ^
    [ERROR] /usr/local/gora-dev/gora-dynamodb/src/main/java/org/apache/gora/dynamodb/store/DynamoDBStore.java:108:
error: exception not thrown: java.io.IOException
    [ERROR] * @throws IOException
    [ERROR] ^
    [ERROR] /usr/local/gora-dev/gora-dynamodb/src/main/java/org/apache/gora/dynamodb/store/DynamoDBStore.java:245:
error: exception not thrown: java.io.IOException
    [ERROR] * @throws IOException
    [ERROR] ^
    [ERROR] /usr/local/gora-dev/gora-dynamodb/src/main/java/org/apache/gora/dynamodb/store/DynamoDBStore.java:359:
error: @param name not found
    [ERROR] * @param tableName
    [ERROR] ^
    [ERROR] /usr/local/gora-dev/gora-dynamodb/src/main/java/org/apache/gora/dynamodb/store/DynamoDBUtils.java:126:
error: @param name not found
    [ERROR] * @param awsCredentialsProperties
    [ERROR] ^
    [ERROR] /usr/local/gora-dev/gora-dynamodb/src/main/java/org/apache/gora/dynamodb/store/DynamoDBUtils.java:127:
error: exception not thrown: java.io.FileNotFoundException
    [ERROR] * @throws FileNotFoundException
    [ERROR] ^
    [ERROR] /usr/local/gora-dev/gora-dynamodb/src/main/java/org/apache/gora/dynamodb/store/DynamoDBUtils.java:129:
error: exception not thrown: java.io.IOException
    [ERROR] * @throws IOException
    [ERROR] ^
    [ERROR] /usr/local/gora-dev/gora-mongodb/src/main/java/org/apache/gora/mongodb/store/MongoMappingBuilder.java:87:
error: invalid use of @return
    [ERROR] * @return a {@link MongoMapping} built from the file
    [ERROR] ^
    [ERROR] /usr/local/gora-dev/gora-tutorial/src/main/java/org/apache/gora/tutorial/log/generated/MetricDatum.java:109:
error: @param name not found
    [ERROR] * @param value the value to set.
    [ERROR] ^
    [ERROR] /usr/local/gora-dev/gora-tutorial/src/main/java/org/apache/gora/tutorial/log/generated/MetricDatum.java:133:
error: @param name not found
    [ERROR] * @param value the value to set.
    [ERROR] ^
    [ERROR] /usr/local/gora-dev/gora-tutorial/src/main/java/org/apache/gora/tutorial/log/generated/MetricDatum.java:157:
error: @param name not found
    [ERROR] * @param value the value to set.
    [ERROR] ^
    [ERROR] /usr/local/gora-dev/gora-tutorial/src/main/java/org/apache/gora/tutorial/log/generated/MetricDatum.java:356:
error: @param name not found
    [ERROR] * @param value the value to set.
    [ERROR] ^
    [ERROR] /usr/local/gora-dev/gora-tutorial/src/main/java/org/apache/gora/tutorial/log/generated/MetricDatum.java:379:
error: @param name not found
    [ERROR] * @param value the value to set.
    [ERROR] ^
    [ERROR] /usr/local/gora-dev/gora-tutorial/src/main/java/org/apache/gora/tutorial/log/generated/MetricDatum.java:402:
error: @param name not found
    [ERROR] * @param value the value to set.
    [ERROR] ^
    [ERROR] /usr/local/gora-dev/gora-tutorial/src/main/java/org/apache/gora/tutorial/log/generated/Pageview.java:135:
error: @param name not found
    [ERROR] * @param value the value to set.
    [ERROR] ^
    [ERROR] /usr/local/gora-dev/gora-tutorial/src/main/java/org/apache/gora/tutorial/log/generated/Pageview.java:159:
error: @param name not found
    [ERROR] * @param value the value to set.
    [ERROR] ^
    [ERROR] /usr/local/gora-dev/gora-tutorial/src/main/java/org/apache/gora/tutorial/log/generated/Pageview.java:183:
error: @param name not found
    [ERROR] * @param value the value to set.
    [ERROR] ^
    [ERROR] /usr/local/gora-dev/gora-tutorial/src/main/java/org/apache/gora/tutorial/log/generated/Pageview.java:207:
error: @param name not found
    [ERROR] * @param value the value to set.
    [ERROR] ^
    [ERROR] /usr/local/gora-dev/gora-tutorial/src/main/java/org/apache/gora/tutorial/log/generated/Pageview.java:231:
error: @param name not found
    [ERROR] * @param value the value to set.
    [ERROR] ^
    [ERROR] /usr/local/gora-dev/gora-tutorial/src/main/java/org/apache/gora/tutorial/log/generated/Pageview.java:255:
error: @param name not found
    [ERROR] * @param value the value to set.
    [ERROR] ^
    [ERROR] /usr/local/gora-dev/gora-tutorial/src/main/java/org/apache/gora/tutorial/log/generated/Pageview.java:279:
error: @param name not found
    [ERROR] * @param value the value to set.
    [ERROR] ^
    [ERROR] /usr/local/gora-dev/gora-tutorial/src/main/java/org/apache/gora/tutorial/log/generated/Pageview.java:303:
error: @param name not found
    [ERROR] * @param value the value to set.
    [ERROR] ^
    [ERROR] /usr/local/gora-dev/gora-tutorial/src/main/java/org/apache/gora/tutorial/log/generated/Pageview.java:656:
error: @param name not found
    [ERROR] * @param value the value to set.
    [ERROR] ^
    [ERROR] /usr/local/gora-dev/gora-tutorial/src/main/java/org/apache/gora/tutorial/log/generated/Pageview.java:679:
error: @param name not found
    [ERROR] * @param value the value to set.
    [ERROR] ^
    [ERROR] /usr/local/gora-dev/gora-tutorial/src/main/java/org/apache/gora/tutorial/log/generated/Pageview.java:702:
error: @param name not found
    [ERROR] * @param value the value to set.
    [ERROR] ^
    [ERROR] /usr/local/gora-dev/gora-tutorial/src/main/java/org/apache/gora/tutorial/log/generated/Pageview.java:725:
error: @param name not found
    [ERROR] * @param value the value to set.
    [ERROR] ^
    [ERROR] /usr/local/gora-dev/gora-tutorial/src/main/java/org/apache/gora/tutorial/log/generated/Pageview.java:748:
error: @param name not found
    [ERROR] * @param value the value to set.
    [ERROR] ^
    [ERROR] /usr/local/gora-dev/gora-tutorial/src/main/java/org/apache/gora/tutorial/log/generated/Pageview.java:771:
error: @param name not found
    [ERROR] * @param value the value to set.
    [ERROR] ^
    [ERROR] /usr/local/gora-dev/gora-tutorial/src/main/java/org/apache/gora/tutorial/log/generated/Pageview.java:794:
error: @param name not found
    [ERROR] * @param value the value to set.
    [ERROR] ^
    [ERROR] /usr/local/gora-dev/gora-tutorial/src/main/java/org/apache/gora/tutorial/log/generated/Pageview.java:817:
error: @param name not found
    [ERROR] * @param value the value to set.
    [ERROR] ^
    [ERROR]
    [ERROR] Command line was: /Library/Java/JavaVirtualMachines/jdk1.8.0_66.jdk/Contents/Home/bin/javadoc
@options @packages
    [ERROR]
    [ERROR] Refer to the generated Javadoc files in '/usr/local/gora-dev/target/site/apidocs'
dir.
    [ERROR] -> [Help 1]
    [ERROR]
    [ERROR] To see the full stack trace of the errors, re-run Maven with the -e switch.
    [ERROR] Re-run Maven using the -X switch to enable full debug logging.
    [ERROR]
    [ERROR] For more information about the errors and possible solutions, please read the
following articles:
    [ERROR] [Help 1] http://cwiki.apache.org/confluence/display/MAVEN/MojoExecutionException
    ```

You can merge this pull request into a Git repository by running:

    $ git pull https://github.com/lewismc/gora GORA-445

Alternatively you can review and apply these changes as the patch at:

    https://github.com/apache/gora/pull/63.patch

To close this pull request, make a commit to your master/trunk branch
with (at least) the following in the commit message:

    This closes #63
    
----
commit 7ea01ac1c33f2f53f3df7f980ed6feab2f0531b3
Author: Lewis John McGibbney <lewis.mcgibbney@gmail.com>
Date:   2016-05-17T05:48:16Z

    GORA-445 Review extent of transative dependencies post GORA-386

----


> Review extent of transative dependencies post GORA-386
> ------------------------------------------------------
>
>                 Key: GORA-445
>                 URL: https://issues.apache.org/jira/browse/GORA-445
>             Project: Apache Gora
>          Issue Type: New Feature
>          Components: build process, gora-core
>    Affects Versions: 0.6.1
>            Reporter: Lewis John McGibbney
>            Assignee: Furkan KAMACI
>            Priority: Critical
>             Fix For: 0.7
>
>         Attachments: gora-core_dependency_tree.txt, spark-core_2.10_dependeny_tree.txt
>
>
> Now that Apache Spark is included within gora-core, I've noticed a hike in the number
of transitive dependencies being pulled as a result of including gora-core in my project pom.xml.
> We should see if we can possibly <exclude> some of the transitive dependencies.



--
This message was sent by Atlassian JIRA
(v6.3.4#6332)

Mime
View raw message