gora-dev mailing list archives

Site index · List index
Message view « Date » · « Thread »
Top « Date » · « Thread »
From "ASF GitHub Bot (JIRA)" <j...@apache.org>
Subject [jira] [Commented] (GORA-445) Review extent of transative dependencies post GORA-386
Date Mon, 23 May 2016 15:34:13 GMT

    [ https://issues.apache.org/jira/browse/GORA-445?page=com.atlassian.jira.plugin.system.issuetabpanels:comment-tabpanel&focusedCommentId=15296524#comment-15296524
] 

ASF GitHub Bot commented on GORA-445:
-------------------------------------

Github user lewismc commented on the pull request:

    https://github.com/apache/gora/pull/66#issuecomment-221011950
  
    I am still not able to build the Javadoc here @cguzel 
    ```
    mvn javadoc:aggregate
    
    ...
    
    1 error
    100 warnings
    [INFO] ------------------------------------------------------------------------
    [INFO] Reactor Summary:
    [INFO]
    [INFO] Apache Gora ........................................ FAILURE [ 36.829 s]
    [INFO] Apache Gora :: Compiler ............................ SKIPPED
    [INFO] Apache Gora :: Compiler-CLI ........................ SKIPPED
    [INFO] Apache Gora :: Shims Hadoop ........................ SKIPPED
    [INFO] Apache Gora :: Shims Hadoop 1.x .................... SKIPPED
    [INFO] Apache Gora :: Shims Hadoop 2.x .................... SKIPPED
    [INFO] Apache Gora :: Shims Distribution .................. SKIPPED
    [INFO] Apache Gora :: Core ................................ SKIPPED
    [INFO] Apache Gora :: Accumulo ............................ SKIPPED
    [INFO] Apache Gora :: Cassandra ........................... SKIPPED
    [INFO] Apache Gora :: GoraCI .............................. SKIPPED
    [INFO] Apache Gora :: HBase ............................... SKIPPED
    [INFO] Apache Gora :: Infinispan .......................... SKIPPED
    [INFO] Apache Gora :: Dynamodb ............................ SKIPPED
    [INFO] Apache Gora :: Maven Plugin ........................ SKIPPED
    [INFO] Apache Gora :: MongoDB ............................. SKIPPED
    [INFO] Apache Gora :: Solr ................................ SKIPPED
    [INFO] Apache Gora :: Tutorial ............................ SKIPPED
    [INFO] Apache Gora :: Sources-Dist ........................ SKIPPED
    [INFO] ------------------------------------------------------------------------
    [INFO] BUILD FAILURE
    [INFO] ------------------------------------------------------------------------
    [INFO] Total time: 38.089 s
    [INFO] Finished at: 2016-05-23T08:38:07-07:00
    [INFO] Final Memory: 55M/292M
    [INFO] ------------------------------------------------------------------------
    [ERROR] Failed to execute goal org.apache.maven.plugins:maven-javadoc-plugin:2.8:aggregate
(default-cli) on project gora: An error has occurred in JavaDocs report generation:
    [ERROR] Exit code: 1 - /usr/local/gora-dev/gora-core/src/main/java/org/apache/gora/store/impl/FileBackedDataStoreBase.java:121:
warning: no description for @return
    [ERROR] * @return
    [ERROR] ^
    [ERROR] /usr/local/gora-dev/gora-core/src/main/java/org/apache/gora/store/impl/FileBackedDataStoreBase.java:122:
warning: no description for @throws
    [ERROR] * @throws IOException
    [ERROR] ^
    [ERROR] /usr/local/gora-dev/gora-core/src/main/java/org/apache/gora/store/impl/FileBackedDataStoreBase.java:135:
warning: no description for @return
    [ERROR] * @return
    [ERROR] ^
    [ERROR] /usr/local/gora-dev/gora-core/src/main/java/org/apache/gora/store/impl/FileBackedDataStoreBase.java:203:
warning: no description for @param
    [ERROR] * @param query
    [ERROR] ^
    [ERROR] /usr/local/gora-dev/gora-core/src/main/java/org/apache/gora/store/impl/FileBackedDataStoreBase.java:204:
warning: no description for @return
    [ERROR] * @return
    [ERROR] ^
    [ERROR] /usr/local/gora-dev/gora-core/src/main/java/org/apache/gora/store/impl/FileBackedDataStoreBase.java:205:
warning: no description for @throws
    [ERROR] * @throws IOException
    [ERROR] ^
    [ERROR] /usr/local/gora-dev/gora-core/src/main/java/org/apache/gora/store/impl/FileBackedDataStoreBase.java:213:
warning: no description for @param
    [ERROR] * @param query
    [ERROR] ^
    [ERROR] /usr/local/gora-dev/gora-core/src/main/java/org/apache/gora/store/impl/FileBackedDataStoreBase.java:214:
warning: no description for @return
    [ERROR] * @return
    [ERROR] ^
    [ERROR] /usr/local/gora-dev/gora-core/src/main/java/org/apache/gora/store/impl/FileBackedDataStoreBase.java:215:
warning: no description for @throws
    [ERROR] * @throws IOException
    [ERROR] ^
    [ERROR] /usr/local/gora-dev/gora-core/src/main/java/org/apache/gora/store/DataStore.java:150:
warning: no description for @param
    [ERROR] * @param key
    [ERROR] ^
    [ERROR] /usr/local/gora-dev/gora-core/src/main/java/org/apache/gora/store/DataStore.java:151:
warning: no description for @param
    [ERROR] * @param obj
    [ERROR] ^
    [ERROR] /usr/local/gora-dev/gora-core/src/main/java/org/apache/gora/store/DataStore.java:190:
warning: no description for @param
    [ERROR] * @param query
    [ERROR] ^
    [ERROR] /usr/local/gora-dev/gora-core/src/main/java/org/apache/gora/store/DataStore.java:192:
warning: no description for @throws
    [ERROR] * @throws IOException
    [ERROR] ^
    [ERROR] /usr/local/gora-dev/gora-core/src/main/java/org/apache/gora/store/impl/DataStoreBase.java:164:
warning: no description for @param
    [ERROR] * @param fields
    [ERROR] ^
    [ERROR] /usr/local/gora-dev/gora-core/src/main/java/org/apache/gora/avro/store/AvroStore.java:52:
warning: no description for @param
    [ERROR] * @param <T>
    [ERROR] ^
    [ERROR] /usr/local/gora-dev/gora-core/src/main/java/org/apache/gora/filter/Filter.java:36:
warning: no description for @param
    [ERROR] * @param key
    [ERROR] ^
    [ERROR] /usr/local/gora-dev/gora-core/src/main/java/org/apache/gora/filter/Filter.java:37:
warning: no description for @param
    [ERROR] * @param persistent
    [ERROR] ^
    [ERROR] /usr/local/gora-dev/gora-core/src/main/java/org/apache/gora/filter/Filter.java:28:
warning: no description for @param
    [ERROR] * @param <K>
    [ERROR] ^
    [ERROR] /usr/local/gora-dev/gora-core/src/main/java/org/apache/gora/filter/Filter.java:29:
warning: no description for @param
    [ERROR] * @param <T>
    [ERROR] ^
    [ERROR] /usr/local/gora-dev/gora-core/src/main/java/org/apache/gora/filter/FilterList.java:36:
warning: no description for @param
    [ERROR] * @param <K>
    [ERROR] ^
    [ERROR] /usr/local/gora-dev/gora-core/src/main/java/org/apache/gora/filter/FilterList.java:37:
warning: no description for @param
    [ERROR] * @param <T>
    [ERROR] ^
    [ERROR] /usr/local/gora-dev/gora-core/src/main/java/org/apache/gora/filter/MapFieldValueFilter.java:37:
warning: no description for @param
    [ERROR] * @param <K>
    [ERROR] ^
    [ERROR] /usr/local/gora-dev/gora-core/src/main/java/org/apache/gora/filter/MapFieldValueFilter.java:38:
warning: no description for @param
    [ERROR] * @param <T>
    [ERROR] ^
    [ERROR] /usr/local/gora-dev/gora-core/src/main/java/org/apache/gora/filter/SingleFieldValueFilter.java:36:
warning: no description for @param
    [ERROR] * @param <K>
    [ERROR] ^
    [ERROR] /usr/local/gora-dev/gora-core/src/main/java/org/apache/gora/filter/SingleFieldValueFilter.java:37:
warning: no description for @param
    [ERROR] * @param <T>
    [ERROR] ^
    [ERROR] /usr/local/gora-dev/gora-core/src/main/java/org/apache/gora/mapreduce/GoraInputFormat.java:134:
warning: no description for @param
    [ERROR] * @param <K1>
    [ERROR] ^
    [ERROR] /usr/local/gora-dev/gora-core/src/main/java/org/apache/gora/mapreduce/GoraInputFormat.java:135:
warning: no description for @param
    [ERROR] * @param <V1>
    [ERROR] ^
    [ERROR] /usr/local/gora-dev/gora-core/src/main/java/org/apache/gora/mapreduce/GoraInputFormat.java:136:
warning: no description for @throws
    [ERROR] * @throws IOException
    [ERROR] ^
    [ERROR] /usr/local/gora-dev/gora-core/src/main/java/org/apache/gora/mapreduce/GoraInputFormat.java:158:
warning: no description for @param
    [ERROR] * @param <K1>
    [ERROR] ^
    [ERROR] /usr/local/gora-dev/gora-core/src/main/java/org/apache/gora/mapreduce/GoraInputFormat.java:159:
warning: no description for @param
    [ERROR] * @param <V1>
    [ERROR] ^
    [ERROR] /usr/local/gora-dev/gora-core/src/main/java/org/apache/gora/mapreduce/GoraInputFormat.java:160:
warning: no description for @throws
    [ERROR] * @throws IOException
    [ERROR] ^
    [ERROR] /usr/local/gora-dev/gora-core/src/main/java/org/apache/gora/mapreduce/GoraMapper.java:49:
warning: no description for @param
    [ERROR] * @param <K1>
    [ERROR] ^
    [ERROR] /usr/local/gora-dev/gora-core/src/main/java/org/apache/gora/mapreduce/GoraMapper.java:50:
warning: no description for @param
    [ERROR] * @param <V1>
    [ERROR] ^
    [ERROR] /usr/local/gora-dev/gora-core/src/main/java/org/apache/gora/mapreduce/GoraMapper.java:51:
warning: no description for @param
    [ERROR] * @param <K2>
    [ERROR] ^
    [ERROR] /usr/local/gora-dev/gora-core/src/main/java/org/apache/gora/mapreduce/GoraMapper.java:52:
warning: no description for @param
    [ERROR] * @param <V2>
    [ERROR] ^
    [ERROR] /usr/local/gora-dev/gora-core/src/main/java/org/apache/gora/mapreduce/GoraMapper.java:53:
warning: no description for @throws
    [ERROR] * @throws IOException
    [ERROR] ^
    [ERROR] /usr/local/gora-dev/gora-core/src/main/java/org/apache/gora/mapreduce/GoraMapper.java:93:
warning: no description for @param
    [ERROR] * @param <K1>
    [ERROR] ^
    [ERROR] /usr/local/gora-dev/gora-core/src/main/java/org/apache/gora/mapreduce/GoraMapper.java:94:
warning: no description for @param
    [ERROR] * @param <V1>
    [ERROR] ^
    [ERROR] /usr/local/gora-dev/gora-core/src/main/java/org/apache/gora/mapreduce/GoraMapper.java:95:
warning: no description for @param
    [ERROR] * @param <K2>
    [ERROR] ^
    [ERROR] /usr/local/gora-dev/gora-core/src/main/java/org/apache/gora/mapreduce/GoraMapper.java:96:
warning: no description for @param
    [ERROR] * @param <V2>
    [ERROR] ^
    [ERROR] /usr/local/gora-dev/gora-core/src/main/java/org/apache/gora/mapreduce/GoraMapper.java:97:
warning: no description for @throws
    [ERROR] * @throws IOException
    [ERROR] ^
    [ERROR] /usr/local/gora-dev/gora-core/src/main/java/org/apache/gora/mapreduce/GoraMapper.java:123:
warning: no description for @param
    [ERROR] * @param <K1>
    [ERROR] ^
    [ERROR] /usr/local/gora-dev/gora-core/src/main/java/org/apache/gora/mapreduce/GoraMapper.java:124:
warning: no description for @param
    [ERROR] * @param <V1>
    [ERROR] ^
    [ERROR] /usr/local/gora-dev/gora-core/src/main/java/org/apache/gora/mapreduce/GoraMapper.java:125:
warning: no description for @param
    [ERROR] * @param <K2>
    [ERROR] ^
    [ERROR] /usr/local/gora-dev/gora-core/src/main/java/org/apache/gora/mapreduce/GoraMapper.java:126:
warning: no description for @param
    [ERROR] * @param <V2>
    [ERROR] ^
    [ERROR] /usr/local/gora-dev/gora-core/src/main/java/org/apache/gora/mapreduce/GoraMapper.java:127:
warning: no description for @throws
    [ERROR] * @throws IOException
    [ERROR] ^
    [ERROR] /usr/local/gora-dev/gora-core/src/main/java/org/apache/gora/mapreduce/GoraMapper.java:159:
warning: no description for @param
    [ERROR] * @param <K1>
    [ERROR] ^
    [ERROR] /usr/local/gora-dev/gora-core/src/main/java/org/apache/gora/mapreduce/GoraMapper.java:160:
warning: no description for @param
    [ERROR] * @param <V1>
    [ERROR] ^
    [ERROR] /usr/local/gora-dev/gora-core/src/main/java/org/apache/gora/mapreduce/GoraMapper.java:161:
warning: no description for @param
    [ERROR] * @param <K2>
    [ERROR] ^
    [ERROR] /usr/local/gora-dev/gora-core/src/main/java/org/apache/gora/mapreduce/GoraMapper.java:162:
warning: no description for @param
    [ERROR] * @param <V2>
    [ERROR] ^
    [ERROR] /usr/local/gora-dev/gora-core/src/main/java/org/apache/gora/mapreduce/GoraMapper.java:163:
warning: no description for @throws
    [ERROR] * @throws IOException
    [ERROR] ^
    [ERROR] /usr/local/gora-dev/gora-core/src/main/java/org/apache/gora/mapreduce/GoraMapper.java:186:
warning: no description for @param
    [ERROR] * @param <K1>
    [ERROR] ^
    [ERROR] /usr/local/gora-dev/gora-core/src/main/java/org/apache/gora/mapreduce/GoraMapper.java:187:
warning: no description for @param
    [ERROR] * @param <V1>
    [ERROR] ^
    [ERROR] /usr/local/gora-dev/gora-core/src/main/java/org/apache/gora/mapreduce/GoraMapper.java:188:
warning: no description for @param
    [ERROR] * @param <K2>
    [ERROR] ^
    [ERROR] /usr/local/gora-dev/gora-core/src/main/java/org/apache/gora/mapreduce/GoraMapper.java:189:
warning: no description for @param
    [ERROR] * @param <V2>
    [ERROR] ^
    [ERROR] /usr/local/gora-dev/gora-core/src/main/java/org/apache/gora/mapreduce/GoraMapper.java:190:
warning: no description for @throws
    [ERROR] * @throws IOException
    [ERROR] ^
    [ERROR] /usr/local/gora-dev/gora-core/src/main/java/org/apache/gora/mapreduce/GoraOutputFormat.java:102:
warning: no description for @param
    [ERROR] * @param <K>
    [ERROR] ^
    [ERROR] /usr/local/gora-dev/gora-core/src/main/java/org/apache/gora/mapreduce/GoraOutputFormat.java:103:
warning: no description for @param
    [ERROR] * @param <V>
    [ERROR] ^
    [ERROR] /usr/local/gora-dev/gora-core/src/main/java/org/apache/gora/mapreduce/GoraOutputFormat.java:119:
warning: no description for @param
    [ERROR] * @param <K>
    [ERROR] ^
    [ERROR] /usr/local/gora-dev/gora-core/src/main/java/org/apache/gora/mapreduce/GoraOutputFormat.java:120:
warning: no description for @param
    [ERROR] * @param <V>
    [ERROR] ^
    [ERROR] /usr/local/gora-dev/gora-core/src/main/java/org/apache/gora/mapreduce/GoraReducer.java:40:
warning: no description for @param
    [ERROR] * @param <K1>
    [ERROR] ^
    [ERROR] /usr/local/gora-dev/gora-core/src/main/java/org/apache/gora/mapreduce/GoraReducer.java:41:
warning: no description for @param
    [ERROR] * @param <V1>
    [ERROR] ^
    [ERROR] /usr/local/gora-dev/gora-core/src/main/java/org/apache/gora/mapreduce/GoraReducer.java:42:
warning: no description for @param
    [ERROR] * @param <K2>
    [ERROR] ^
    [ERROR] /usr/local/gora-dev/gora-core/src/main/java/org/apache/gora/mapreduce/GoraReducer.java:43:
warning: no description for @param
    [ERROR] * @param <V2>
    [ERROR] ^
    [ERROR] /usr/local/gora-dev/gora-core/src/main/java/org/apache/gora/mapreduce/GoraReducer.java:65:
warning: no description for @param
    [ERROR] * @param <K1>
    [ERROR] ^
    [ERROR] /usr/local/gora-dev/gora-core/src/main/java/org/apache/gora/mapreduce/GoraReducer.java:66:
warning: no description for @param
    [ERROR] * @param <V1>
    [ERROR] ^
    [ERROR] /usr/local/gora-dev/gora-core/src/main/java/org/apache/gora/mapreduce/GoraReducer.java:67:
warning: no description for @param
    [ERROR] * @param <K2>
    [ERROR] ^
    [ERROR] /usr/local/gora-dev/gora-core/src/main/java/org/apache/gora/mapreduce/GoraReducer.java:68:
warning: no description for @param
    [ERROR] * @param <V2>
    [ERROR] ^
    [ERROR] /usr/local/gora-dev/gora-core/src/main/java/org/apache/gora/mapreduce/GoraReducer.java:86:
warning: no description for @param
    [ERROR] * @param <K1>
    [ERROR] ^
    [ERROR] /usr/local/gora-dev/gora-core/src/main/java/org/apache/gora/mapreduce/GoraReducer.java:87:
warning: no description for @param
    [ERROR] * @param <V1>
    [ERROR] ^
    [ERROR] /usr/local/gora-dev/gora-core/src/main/java/org/apache/gora/mapreduce/GoraReducer.java:88:
warning: no description for @param
    [ERROR] * @param <K2>
    [ERROR] ^
    [ERROR] /usr/local/gora-dev/gora-core/src/main/java/org/apache/gora/mapreduce/GoraReducer.java:89:
warning: no description for @param
    [ERROR] * @param <V2>
    [ERROR] ^
    [ERROR] /usr/local/gora-dev/gora-core/src/main/java/org/apache/gora/mapreduce/PersistentSerializer.java:60:
warning: no description for @param
    [ERROR] * @param persistent
    [ERROR] ^
    [ERROR] /usr/local/gora-dev/gora-core/src/main/java/org/apache/gora/mapreduce/PersistentSerializer.java:61:
warning: no description for @throws
    [ERROR] * @throws IOException
    [ERROR] ^
    [ERROR] /usr/local/gora-dev/gora-core/src/main/java/org/apache/gora/persistency/BeanFactory.java:33:
warning: no description for @throws
    [ERROR] * @throws Exception
    [ERROR] ^
    [ERROR] /usr/local/gora-dev/gora-core/src/main/java/org/apache/gora/persistency/BeanFactory.java:24:
warning: no description for @param
    [ERROR] * @param <K>
    [ERROR] ^
    [ERROR] /usr/local/gora-dev/gora-core/src/main/java/org/apache/gora/persistency/BeanFactory.java:25:
warning: no description for @param
    [ERROR] * @param <T>
    [ERROR] ^
    [ERROR] /usr/local/gora-dev/gora-core/src/main/java/org/apache/gora/persistency/impl/BeanFactoryImpl.java:31:
warning: no description for @param
    [ERROR] * @param <K>
    [ERROR] ^
    [ERROR] /usr/local/gora-dev/gora-core/src/main/java/org/apache/gora/persistency/impl/BeanFactoryImpl.java:32:
warning: no description for @param
    [ERROR] * @param <T>
    [ERROR] ^
    [ERROR] /usr/local/gora-dev/gora-core/src/main/java/org/apache/gora/persistency/impl/BeanFactoryImpl.java:57:
warning: no description for @param
    [ERROR] * @param keyClass
    [ERROR] ^
    [ERROR] /usr/local/gora-dev/gora-core/src/main/java/org/apache/gora/persistency/impl/BeanFactoryImpl.java:58:
warning: no description for @param
    [ERROR] * @param persistentClass
    [ERROR] ^
    [ERROR] /usr/local/gora-dev/gora-core/src/main/java/org/apache/gora/persistency/ws/impl/BeanFactoryWSImpl.java:34:
warning: no description for @param
    [ERROR] * @param <K>
    [ERROR] ^
    [ERROR] /usr/local/gora-dev/gora-core/src/main/java/org/apache/gora/persistency/ws/impl/BeanFactoryWSImpl.java:35:
warning: no description for @param
    [ERROR] * @param <T>
    [ERROR] ^
    [ERROR] /usr/local/gora-dev/gora-core/src/main/java/org/apache/gora/persistency/ws/impl/BeanFactoryWSImpl.java:74:
warning: no description for @param
    [ERROR] * @param keyClass
    [ERROR] ^
    [ERROR] /usr/local/gora-dev/gora-core/src/main/java/org/apache/gora/persistency/ws/impl/BeanFactoryWSImpl.java:75:
warning: no description for @param
    [ERROR] * @param persistentClass
    [ERROR] ^
    [ERROR] /usr/local/gora-dev/gora-core/src/main/java/org/apache/gora/persistency/ws/impl/PersistentWSBase.java:65:
warning: no @return
    [ERROR] public String[] getFields() {
    [ERROR] ^
    [ERROR] /usr/local/gora-dev/gora-core/src/main/java/org/apache/gora/persistency/ws/impl/PersistentWSBase.java:72:
warning: no @param for index
    [ERROR] public String getField(int index) {
    [ERROR] ^
    [ERROR] /usr/local/gora-dev/gora-core/src/main/java/org/apache/gora/persistency/ws/impl/PersistentWSBase.java:72:
warning: no @return
    [ERROR] public String getField(int index) {
    [ERROR] ^
    [ERROR] /usr/local/gora-dev/gora-core/src/main/java/org/apache/gora/persistency/ws/impl/PersistentWSBase.java:79:
warning: no @param for field
    [ERROR] public int getFieldIndex(String field) {
    [ERROR] ^
    [ERROR] /usr/local/gora-dev/gora-core/src/main/java/org/apache/gora/persistency/ws/impl/PersistentWSBase.java:79:
warning: no @return
    [ERROR] public int getFieldIndex(String field) {
    [ERROR] ^
    [ERROR] /usr/local/gora-dev/gora-core/src/main/java/org/apache/gora/persistency/ws/impl/PersistentWSBase.java:174:
warning: no description for @param
    [ERROR] * @param index
    [ERROR] ^
    [ERROR] /usr/local/gora-dev/gora-core/src/main/java/org/apache/gora/persistency/ws/impl/PersistentWSBase.java:175:
warning: no description for @param
    [ERROR] * @param value
    [ERROR] ^
    [ERROR] /usr/local/gora-dev/gora-core/src/main/java/org/apache/gora/persistency/ws/impl/PersistentWSBase.java:176:
warning: no description for @return
    [ERROR] * @return
    [ERROR] ^
    [ERROR] /usr/local/gora-dev/gora-core/src/main/java/org/apache/gora/query/ws/impl/PartitionWSQueryImpl.java:84:
warning: no description for @return
    [ERROR] * @return
    [ERROR] ^
    [ERROR] /usr/local/gora-dev/gora-core/src/main/java/org/apache/gora/query/ws/impl/QueryWSBase.java:261:
warning: no description for @return
    [ERROR] * @return
    [ERROR] ^
    [ERROR] /usr/local/gora-dev/gora-core/src/main/java/org/apache/gora/query/ws/impl/QueryWSBase.java:269:
warning: no description for @param
    [ERROR] * @param auth
    [ERROR] ^
    [ERROR] /usr/local/gora-dev/gora-core/src/main/java/org/apache/gora/query/ws/impl/PartitionWSQueryImpl.java:64:
warning: no @param for baseQuery
    [ERROR] public PartitionWSQueryImpl(Query<K, T> baseQuery, K startKey, K endKey,
    [ERROR] ^
    [ERROR] /usr/local/gora-dev/gora-core/src/main/java/org/apache/gora/query/ws/impl/PartitionWSQueryImpl.java:64:
warning: no @param for startKey
    [ERROR] public PartitionWSQueryImpl(Query<K, T> baseQuery, K startKey, K endKey,
    [ERROR] ^
    [ERROR] /usr/local/gora-dev/gora-core/src/main/java/org/apache/gora/query/ws/impl/PartitionWSQueryImpl.java:64:
warning: no @param for endKey
    [ERROR] public PartitionWSQueryImpl(Query<K, T> baseQuery, K startKey, K endKey,
    [ERROR] ^
    [ERROR] /usr/local/gora-dev/gora-core/src/main/java/org/apache/gora/query/ws/impl/PartitionWSQueryImpl.java:64:
warning: no @param for locations
    [ERROR] public PartitionWSQueryImpl(Query<K, T> baseQuery, K startKey, K endKey,
    [ERROR] ^
    [ERROR] /usr/local/gora-dev/gora-core/src/main/java/org/apache/gora/util/TimingUtil.java:31:
error: bad use of '>'
    [ERROR] * @return a string of the form "XhYmZs" when the elapsed time is X hours, Y minutes
and Z seconds or null if start > end.
    [ERROR] ^
    [ERROR]
    [ERROR] Command line was: /Library/Java/JavaVirtualMachines/jdk1.8.0_66.jdk/Contents/Home/bin/javadoc
@options @packages
    [ERROR]
    [ERROR] Refer to the generated Javadoc files in '/usr/local/gora-dev/target/site/apidocs'
dir.
    [ERROR] -> [Help 1]
    [ERROR]
    [ERROR] To see the full stack trace of the errors, re-run Maven with the -e switch.
    [ERROR] Re-run Maven using the -X switch to enable full debug logging.
    [ERROR]
    [ERROR] For more information about the errors and possible solutions, please read the
following articles:
    [ERROR] [Help 1] http://cwiki.apache.org/confluence/display/MAVEN/MojoExecutionException
    ```


> Review extent of transative dependencies post GORA-386
> ------------------------------------------------------
>
>                 Key: GORA-445
>                 URL: https://issues.apache.org/jira/browse/GORA-445
>             Project: Apache Gora
>          Issue Type: New Feature
>          Components: build process, gora-core
>    Affects Versions: 0.6.1
>            Reporter: Lewis John McGibbney
>            Assignee: Furkan KAMACI
>            Priority: Critical
>             Fix For: 0.7
>
>         Attachments: gora-core_dependency_tree.txt, spark-core_2.10_dependeny_tree.txt
>
>
> Now that Apache Spark is included within gora-core, I've noticed a hike in the number
of transitive dependencies being pulled as a result of including gora-core in my project pom.xml.
> We should see if we can possibly <exclude> some of the transitive dependencies.



--
This message was sent by Atlassian JIRA
(v6.3.4#6332)

Mime
View raw message