gump-general mailing list archives

Site index · List index
Message view « Date » · « Thread »
Top « Date » · « Thread »
From g...@vmgump.apache.org
Subject BATCH: All dressed up, with nowhere to go...
Date Sat, 19 Jan 2008 04:19:39 GMT
Dear Gumpmeisters,
            
The following 22 notifys should have been sent

*********************************************************** G U M P
[GUMP@vmgump]: Module lenya success, but with warnings.
[GUMP@vmgump]: Project gsbase-test (in module gsbase) failed
[GUMP@vmgump]: Module village failed
[GUMP@vmgump]: Project village (in module village) failed
[GUMP@vmgump]: Project derby (in module db-derby) failed
[GUMP@vmgump]: Module town failed
[GUMP@vmgump]: Project ws-commons-xmlschema (in module ws-axis2-commons) failed
[GUMP@vmgump]: Project rhino (in module rhino) failed
[GUMP@vmgump]: Module httpcomponents success, but with warnings.
[GUMP@vmgump]: Project slf4j (in module slf4j) failed
[GUMP@vmgump]: Project commons-jci (in module commons-sandbox) failed
[GUMP@vmgump]: Project emma (in module emma) failed
[GUMP@vmgump]: Project hivemind-compile (in module hivemind) failed
[GUMP@vmgump]: Project jmock2 (in module jmock2) failed
[GUMP@vmgump]: Module beanshell failed
[GUMP@vmgump]: Project jtidy-cvs (in module jtidy) failed
[GUMP@vmgump]: Project portals-pluto-portal-1.0 (in module portals-pluto-1.0) failed
[GUMP@vmgump]: Module JacORB failed
[GUMP@vmgump]: Project JacORB-idllib (in module JacORB) failed
[GUMP@vmgump]: Project xml-security-tests (in module xml-security) failed
[GUMP@vmgump]: Project lenya (in module lenya) failed
[GUMP@vmgump]: Project portals-bridges-velocity (in module portals-bridges) failed
*********************************************************** G U M P
[GUMP@vmgump]: Module lenya success, but with warnings.
To whom it may engage...
        
This is an automated request, but not an unsolicited one. For 
more information please visit http://gump.apache.org/nagged.html, 
and/or contact the folk at general@gump.apache.org.

Module lenya contains errors.
The current state of this module is 'Success'.

Full details are available at:
    http://vmgump.apache.org/gump/public/lenya/index.html

That said, some information snippets are provided here.

The following annotations (debug/informational/warning/error messages) were provided:
 -ERROR- *** Failed to update from source control. Stale contents ***



The following work was performed:
http://vmgump.apache.org/gump/public/lenya/gump_work/update_lenya.html
Work Name: update_lenya (Type: Update)
Work ended in a state of : Failed
Elapsed: 22 secs
Command Line: svn --quiet update --non-interactive lenya 
[Working Directory: /srv/gump/public/workspace/cvs]
---------------------------------------------
svn: PROPFIND request failed on '/repos/bxe/trunk'
svn: PROPFIND of '/repos/bxe/trunk': could not connect to server (http://svn.bitflux.ch)
---------------------------------------------

To subscribe to this information via syndicated feeds:
- RSS: http://vmgump.apache.org/gump/public/lenya/rss.xml
- Atom: http://vmgump.apache.org/gump/public/lenya/atom.xml

============================== Gump Tracking Only ===
Produced by Gump version 2.3.
Gump Run 11000019012008, vmgump:vmgump-public:11000019012008
Gump E-mail Identifier (unique within run) #2.

*********************************************************** G U M P
[GUMP@vmgump]: Project gsbase-test (in module gsbase) failed
To whom it may engage...
        
This is an automated request, but not an unsolicited one. For 
more information please visit http://gump.apache.org/nagged.html, 
and/or contact the folk at general@gump.apache.org.

Project gsbase-test has an issue affecting its community integration.
This issue affects 1 projects,
 and has been outstanding for 99 runs.
The current state of this project is 'Failed', with reason 'Build Failed'.
For reference only, the following projects are affected by this:
    - gsbase-test :  A collection of java utility classes


Full details are available at:
    http://vmgump.apache.org/gump/public/gsbase/gsbase-test/index.html

That said, some information snippets are provided here.

The following annotations (debug/informational/warning/error messages) were provided:
 -WARNING- Overriding Maven properties: [/srv/gump/public/workspace/gsbase/build.properties]
 -DEBUG- (Gump generated) Maven Properties in: /srv/gump/public/workspace/gsbase/build.properties
 -INFO- Failed with reason build failed
 -DEBUG- Maven POM in: /srv/gump/public/workspace/gsbase/project.xml
 -DEBUG- Maven project properties in: /srv/gump/public/workspace/gsbase/project.properties



The following work was performed:
http://vmgump.apache.org/gump/public/gsbase/gsbase-test/gump_work/build_gsbase_gsbase-test.html
Work Name: build_gsbase_gsbase-test (Type: Build)
Work ended in a state of : Failed
Elapsed: 1 min 13 secs
Command Line: maven --offline jar 
[Working Directory: /srv/gump/public/workspace/gsbase]
CLASSPATH: /usr/lib/jvm/java-1.5.0-sun/lib/tools.jar:/srv/gump/public/workspace/gsbase/target/classes:/srv/gump/public/workspace/junit/dist/junit-19012008.jar:/srv/gump/packages/junitperf-1.8/lib/junitperf.jar
---------------------------------------------
    [junit] Running com.gargoylesoftware.base.testing.EqualsTesterTest
    [junit] Tests run: 6, Failures: 0, Errors: 0, Time elapsed: 0.31 sec
    [junit] Testsuite: com.gargoylesoftware.base.testing.EqualsTesterTest
    [junit] Tests run: 6, Failures: 0, Errors: 0, Time elapsed: 0.31 sec
    [junit] 
    [junit] Running com.gargoylesoftware.base.collections.NotificationListTest
    [junit] Tests run: 9, Failures: 0, Errors: 0, Time elapsed: 0.328 sec
    [junit] Testsuite: com.gargoylesoftware.base.collections.NotificationListTest
    [junit] Tests run: 9, Failures: 0, Errors: 0, Time elapsed: 0.328 sec
    [junit] 
    [junit] Running com.gargoylesoftware.base.objectstore.DispatchingObjectStoreTest
    [junit] Tests run: 4, Failures: 0, Errors: 0, Time elapsed: 0.309 sec
    [junit] Testsuite: com.gargoylesoftware.base.objectstore.DispatchingObjectStoreTest
    [junit] Tests run: 4, Failures: 0, Errors: 0, Time elapsed: 0.309 sec
    [junit] 
    [junit] Running com.gargoylesoftware.base.objectstore.ObjectStoreExceptionTest
    [junit] Tests run: 3, Failures: 0, Errors: 0, Time elapsed: 0.312 sec
    [junit] Testsuite: com.gargoylesoftware.base.objectstore.ObjectStoreExceptionTest
    [junit] Tests run: 3, Failures: 0, Errors: 0, Time elapsed: 0.312 sec
    [junit] 
    [junit] Running com.gargoylesoftware.base.objectstore.ObjectStoreTest
    [junit] Tests run: 9, Failures: 0, Errors: 0, Time elapsed: 0.396 sec
    [junit] Testsuite: com.gargoylesoftware.base.objectstore.ObjectStoreTest
    [junit] Tests run: 9, Failures: 0, Errors: 0, Time elapsed: 0.396 sec
    [junit] 
    [junit] Running com.gargoylesoftware.base.objectstore.ReflectedObjectStoreTest
    [junit] Tests run: 5, Failures: 0, Errors: 0, Time elapsed: 0.419 sec
    [junit] Testsuite: com.gargoylesoftware.base.objectstore.ReflectedObjectStoreTest
    [junit] Tests run: 5, Failures: 0, Errors: 0, Time elapsed: 0.419 sec
    [junit] 
    [junit] Running com.gargoylesoftware.base.objectstore.ObjectStoreCommandNotSupportedExceptionTest
    [junit] Tests run: 2, Failures: 0, Errors: 0, Time elapsed: 0.382 sec
    [junit] Testsuite: com.gargoylesoftware.base.objectstore.ObjectStoreCommandNotSupportedExceptionTest
    [junit] Tests run: 2, Failures: 0, Errors: 0, Time elapsed: 0.382 sec
    [junit] 
    [junit] Running com.gargoylesoftware.base.objectstore.ObjectStoreCommandTest
    [junit] Tests run: 1, Failures: 0, Errors: 0, Time elapsed: 0.41 sec
    [junit] Testsuite: com.gargoylesoftware.base.objectstore.ObjectStoreCommandTest
    [junit] Tests run: 1, Failures: 0, Errors: 0, Time elapsed: 0.41 sec
    [junit] 

BUILD FAILED
File...... /home/gump/.maven/cache/maven-test-plugin-1.6.2/plugin.jelly
Element... fail
Line...... 181
Column.... 54
There were test failures.
Total time: 1 minutes 12 seconds
Finished at: Sat Jan 19 00:43:06 GMT-08:00 2008

---------------------------------------------

To subscribe to this information via syndicated feeds:
- RSS: http://vmgump.apache.org/gump/public/gsbase/gsbase-test/rss.xml
- Atom: http://vmgump.apache.org/gump/public/gsbase/gsbase-test/atom.xml

============================== Gump Tracking Only ===
Produced by Gump version 2.3.
Gump Run 11000019012008, vmgump:vmgump-public:11000019012008
Gump E-mail Identifier (unique within run) #3.

*********************************************************** G U M P
[GUMP@vmgump]: Module village failed
To whom it may engage...
        
This is an automated request, but not an unsolicited one. For 
more information please visit http://gump.apache.org/nagged.html, 
and/or contact the folk at general@gump.apache.org.

Module village has an issue affecting its community integration,
 and has been outstanding for 510 runs.
The current state of this module is 'Failed', with reason 'Update Failed'.

Full details are available at:
    http://vmgump.apache.org/gump/public/village/index.html

That said, some information snippets are provided here.

The following annotations (debug/informational/warning/error messages) were provided:
 -INFO- Failed with reason update failed



The following work was performed:
http://vmgump.apache.org/gump/public/village/gump_work/update_village.html
Work Name: update_village (Type: Update)
Work ended in a state of : Failed
Elapsed: 1 sec
Command Line: cvs -q -z3 -d :pserver:anoncvs@share.whichever.com:/home/cvspublic checkout -P -d village village 
[Working Directory: /srv/gump/public/workspace/cvs]
---------------------------------------------
Unknown host share.whichever.com.
---------------------------------------------

To subscribe to this information via syndicated feeds:
- RSS: http://vmgump.apache.org/gump/public/village/rss.xml
- Atom: http://vmgump.apache.org/gump/public/village/atom.xml

============================== Gump Tracking Only ===
Produced by Gump version 2.3.
Gump Run 11000019012008, vmgump:vmgump-public:11000019012008
Gump E-mail Identifier (unique within run) #5.

*********************************************************** G U M P
[GUMP@vmgump]: Project village (in module village) failed
To whom it may engage...
        
This is an automated request, but not an unsolicited one. For 
more information please visit http://gump.apache.org/nagged.html, 
and/or contact the folk at general@gump.apache.org.

Project village has an issue affecting its community integration,
 and has been outstanding for 510 runs.
The current state of this project is 'Failed', with reason 'Update Failed'.

Full details are available at:
    http://vmgump.apache.org/gump/public/village/village/index.html

That said, some information snippets are provided here.

The following annotations (debug/informational/warning/error messages) were provided:
 -INFO- Failed with reason update failed
 -INFO- Failed to extract fallback artifacts from Gump Repository

To subscribe to this information via syndicated feeds:
- RSS: http://vmgump.apache.org/gump/public/village/village/rss.xml
- Atom: http://vmgump.apache.org/gump/public/village/village/atom.xml

============================== Gump Tracking Only ===
Produced by Gump version 2.3.
Gump Run 11000019012008, vmgump:vmgump-public:11000019012008
Gump E-mail Identifier (unique within run) #6.

*********************************************************** G U M P
[GUMP@vmgump]: Project derby (in module db-derby) failed
To whom it may engage...
        
This is an automated request, but not an unsolicited one. For 
more information please visit http://gump.apache.org/nagged.html, 
and/or contact the folk at general@gump.apache.org.

Project derby has an issue affecting its community integration.
This issue affects 1 projects,
 and has been outstanding for 99 runs.
The current state of this project is 'Failed', with reason 'Build Failed'.
For reference only, the following projects are affected by this:
    - derby :  Apache Derby, 100% Java relational database.


Full details are available at:
    http://vmgump.apache.org/gump/public/db-derby/derby/index.html

That said, some information snippets are provided here.

The following annotations (debug/informational/warning/error messages) were provided:
 -INFO- Failed with reason build failed
 -INFO- Failed to extract fallback artifacts from Gump Repository



The following work was performed:
http://vmgump.apache.org/gump/public/db-derby/derby/gump_work/build_db-derby_derby.html
Work Name: build_db-derby_derby (Type: Build)
Work ended in a state of : Failed
Elapsed: 3 secs
Command Line: /usr/lib/jvm/java-1.5.0-sun/bin/java -Djava.awt.headless=true -Xbootclasspath/p:/srv/gump/public/workspace/xml-commons/java/external/build/xml-apis.jar:/srv/gump/public/workspace/xml-xerces2/build/xercesImpl.jar:/srv/gump/public/workspace/xml-xalan/build/serializer.jar:/srv/gump/public/workspace/xml-xalan/build/xalan-unbundled.jar org.apache.tools.ant.Main -Dgump.merge=/srv/gump/public/gump/work/merge.xml -Dbuild.sysclasspath=only -Dsane=false gump_all 
[Working Directory: /srv/gump/public/workspace/db-derby]
CLASSPATH: /usr/lib/jvm/java-1.5.0-sun/lib/tools.jar:/srv/gump/public/workspace/db-derby/classes:/srv/gump/public/workspace/ant/dist/lib/ant-jmf.jar:/srv/gump/public/workspace/ant/dist/lib/ant-swing.jar:/srv/gump/public/workspace/ant/dist/lib/ant-apache-resolver.jar:/srv/gump/public/workspace/ant/dist/lib/ant-trax.jar:/srv/gump/public/workspace/ant/dist/lib/ant-junit.jar:/srv/gump/public/workspace/ant/dist/lib/ant-launcher.jar:/srv/gump/public/workspace/ant/dist/lib/ant-nodeps.jar:/srv/gump/public/workspace/ant/dist/lib/ant.jar:/srv/gump/public/workspace/xml-commons/java/external/build/xml-apis-ext.jar:/srv/gump/public/workspace/jakarta-servletapi-5/jsr154/dist/lib/servlet-api.jar:/srv/gump/public/workspace/jakarta-oro/jakarta-oro-19012008.jar:/srv/gump/packages/javacc-3.1/bin/lib/javacc.jar:/srv/gump/public/workspace/junit/dist/junit-19012008.jar
---------------------------------------------
[setJdkProperties] j14lib = null
[setJdkProperties] j15lib = null
[setJdkProperties] 
[setJdkProperties] Please consult BUILDING.txt for instructions on how to set the jdk-library and compiler-classpath properties.
[setJdkProperties] Don't know how to set java14compile.classpath using this environment:
[setJdkProperties] 
[setJdkProperties] java.vendor = Sun Microsystems Inc.
[setJdkProperties] java.home = /usr/lib/jvm/java-1.5.0-sun-1.5.0.11/jre
[setJdkProperties] java.version = 1.5.0_11
[setJdkProperties] os.name = Linux
[setJdkProperties] j14lib = null
[setJdkProperties] j15lib = null
[setJdkProperties] 
[setJdkProperties] Please consult BUILDING.txt for instructions on how to set the jdk-library and compiler-classpath properties.
[setJdkProperties] 	at org.apache.derbyPreBuild.PropertySetter.couldntSetProperty(PropertySetter.java:675)
[setJdkProperties] 	at org.apache.derbyPreBuild.PropertySetter.setClasspathFromLib(PropertySetter.java:482)
[setJdkProperties] 	at org.apache.derbyPreBuild.PropertySetter.defaultSetter(PropertySetter.java:459)
[setJdkProperties] 	at org.apache.derbyPreBuild.PropertySetter.setForMostJDKs(PropertySetter.java:319)
[setJdkProperties] 	at org.apache.derbyPreBuild.PropertySetter.setForSunJDKs(PropertySetter.java:291)
[setJdkProperties] 	at org.apache.derbyPreBuild.PropertySetter.execute(PropertySetter.java:221)
[setJdkProperties] 	at org.apache.tools.ant.UnknownElement.execute(UnknownElement.java:288)
[setJdkProperties] 	at sun.reflect.GeneratedMethodAccessor9.invoke(Unknown Source)
[setJdkProperties] 	at sun.reflect.DelegatingMethodAccessorImpl.invoke(DelegatingMethodAccessorImpl.java:25)
[setJdkProperties] 	at java.lang.reflect.Method.invoke(Method.java:585)
[setJdkProperties] 	at org.apache.tools.ant.dispatch.DispatchUtils.execute(DispatchUtils.java:106)
[setJdkProperties] 	at org.apache.tools.ant.Task.perform(Task.java:348)
[setJdkProperties] 	at org.apache.tools.ant.Target.execute(Target.java:354)
[setJdkProperties] 	at org.apache.tools.ant.Target.performTasks(Target.java:379)
[setJdkProperties] 	at org.apache.tools.ant.Project.executeSortedTargets(Project.java:1324)
[setJdkProperties] 	at org.apache.tools.ant.Project.executeTarget(Project.java:1293)
[setJdkProperties] 	at org.apache.tools.ant.helper.DefaultExecutor.executeTargets(DefaultExecutor.java:41)
[setJdkProperties] 	at org.apache.tools.ant.Project.executeTargets(Project.java:1176)
[setJdkProperties] 	at org.apache.tools.ant.Main.runBuild(Main.java:758)
[setJdkProperties] 	at org.apache.tools.ant.Main.startAnt(Main.java:217)
[setJdkProperties] 	at org.apache.tools.ant.Main.start(Main.java:179)
[setJdkProperties] 	at org.apache.tools.ant.Main.main(Main.java:268)

BUILD FAILED
/srv/gump/public/workspace/db-derby/build.xml:182: Don't know how to set java14compile.classpath using this environment:

java.vendor = Sun Microsystems Inc.
java.home = /usr/lib/jvm/java-1.5.0-sun-1.5.0.11/jre
java.version = 1.5.0_11
os.name = Linux
j14lib = null
j15lib = null

Please consult BUILDING.txt for instructions on how to set the jdk-library and compiler-classpath properties.

Total time: 2 seconds
---------------------------------------------

To subscribe to this information via syndicated feeds:
- RSS: http://vmgump.apache.org/gump/public/db-derby/derby/rss.xml
- Atom: http://vmgump.apache.org/gump/public/db-derby/derby/atom.xml

============================== Gump Tracking Only ===
Produced by Gump version 2.3.
Gump Run 11000019012008, vmgump:vmgump-public:11000019012008
Gump E-mail Identifier (unique within run) #7.

*********************************************************** G U M P
[GUMP@vmgump]: Module town failed
To whom it may engage...
        
This is an automated request, but not an unsolicited one. For 
more information please visit http://gump.apache.org/nagged.html, 
and/or contact the folk at general@gump.apache.org.

Module town has an issue affecting its community integration,
 and has been outstanding for 510 runs.
The current state of this module is 'Failed', with reason 'Update Failed'.

Full details are available at:
    http://vmgump.apache.org/gump/public/town/index.html

That said, some information snippets are provided here.

The following annotations (debug/informational/warning/error messages) were provided:
 -INFO- Failed with reason update failed



The following work was performed:
http://vmgump.apache.org/gump/public/town/gump_work/update_town.html
Work Name: update_town (Type: Update)
Work ended in a state of : Failed
Elapsed: 1 sec
Command Line: cvs -q -z3 -d :pserver:anoncvs@share.whichever.com:/home/cvspublic checkout -P -d town town 
[Working Directory: /srv/gump/public/workspace/cvs]
---------------------------------------------
Unknown host share.whichever.com.
---------------------------------------------

To subscribe to this information via syndicated feeds:
- RSS: http://vmgump.apache.org/gump/public/town/rss.xml
- Atom: http://vmgump.apache.org/gump/public/town/atom.xml

============================== Gump Tracking Only ===
Produced by Gump version 2.3.
Gump Run 11000019012008, vmgump:vmgump-public:11000019012008
Gump E-mail Identifier (unique within run) #9.

*********************************************************** G U M P
[GUMP@vmgump]: Project ws-commons-xmlschema (in module ws-axis2-commons) failed
To whom it may engage...
        
This is an automated request, but not an unsolicited one. For 
more information please visit http://gump.apache.org/nagged.html, 
and/or contact the folk at general@gump.apache.org.

Project ws-commons-xmlschema has an issue affecting its community integration.
This issue affects 4 projects,
 and has been outstanding for 99 runs.
The current state of this project is 'Failed', with reason 'Build Failed'.
For reference only, the following projects are affected by this:
    - ws-axis2 :  Apache Axis2 SOAP Stack
    - ws-commons-xmlschema :  Common stuff for the WS projects.
    - ws-juddi :  ws-juddi -- UDDI Toolkit/Repository
    - ws-juddi-test :  ws-juddi -- UDDI Toolkit/Repository


Full details are available at:
    http://vmgump.apache.org/gump/public/ws-axis2-commons/ws-commons-xmlschema/index.html

That said, some information snippets are provided here.

The following annotations (debug/informational/warning/error messages) were provided:
 -DEBUG- Sole output [ws-commons-xmlschema-19012008.jar] identifier set to project name
 -INFO- Failed with reason build failed
 -INFO- Failed to extract fallback artifacts from Gump Repository



The following work was performed:
http://vmgump.apache.org/gump/public/ws-axis2-commons/ws-commons-xmlschema/gump_work/build_ws-axis2-commons_ws-commons-xmlschema.html
Work Name: build_ws-axis2-commons_ws-commons-xmlschema (Type: Build)
Work ended in a state of : Failed
Elapsed: 1 min 10 secs
Command Line: /usr/lib/jvm/java-1.5.0-sun/bin/java -Djava.awt.headless=true -Xbootclasspath/p:/srv/gump/public/workspace/xml-commons/java/external/build/xml-apis.jar:/srv/gump/public/workspace/xml-xerces2/build/xercesImpl.jar:/srv/gump/public/workspace/xml-xalan/build/serializer.jar:/srv/gump/public/workspace/xml-xalan/build/xalan-unbundled.jar org.apache.tools.ant.Main -Dgump.merge=/srv/gump/public/gump/work/merge.xml -Dbuild.sysclasspath=only -Doutput.jar=ws-commons-xmlschema-19012008 -DdownloadLibs=false jar 
[Working Directory: /srv/gump/public/workspace/ws-axis2-commons/XmlSchema]
CLASSPATH: /usr/lib/jvm/java-1.5.0-sun/lib/tools.jar:/srv/gump/public/workspace/ws-axis2-commons/XmlSchema/build/classes:/srv/gump/public/workspace/ws-axis2-commons/XmlSchema/build/test-classes:/srv/gump/public/workspace/xml-commons/java/external/build/xml-apis-ext.jar:/srv/gump/public/workspace/xmlunit/build/lib/xmlunit-19012008.jar:/srv/gump/public/workspace/ant/dist/lib/ant-jmf.jar:/srv/gump/public/workspace/ant/dist/lib/ant-swing.jar:/srv/gump/public/workspace/ant/dist/lib/ant-apache-resolver.jar:/srv/gump/public/workspace/ant/dist/lib/ant-trax.jar:/srv/gump/public/workspace/ant/dist/lib/ant-junit.jar:/srv/gump/public/workspace/ant/dist/lib/ant-launcher.jar:/srv/gump/public/workspace/ant/dist/lib/ant-nodeps.jar:/srv/gump/public/workspace/ant/dist/lib/ant.jar:/srv/gump/packages/junit3.8.1/junit.jar:/srv/gump/public/workspace/xml-commons/java/build/resolver.jar:/srv/gump/packages/stax/jsr173_1.0_api.jar:/srv/gump/packages/stax/jsr173_1.0_ri.jar:/srv/gump/public/workspace/ju
 nit/dist/junit-19012008.jar
---------------------------------------------
    [junit] Tests run: 1, Failures: 0, Errors: 0, Time elapsed: 0.205 sec
    [junit] Running tests.ConstraintsTest
    [junit] Tests run: 1, Failures: 0, Errors: 0, Time elapsed: 0.121 sec
    [junit] Running tests.ElementRefs2Test
    [junit] Tests run: 1, Failures: 0, Errors: 0, Time elapsed: 0.169 sec
    [junit] Running tests.ElementRefsTest
    [junit] Tests run: 1, Failures: 0, Errors: 0, Time elapsed: 0.097 sec
    [junit] Running tests.EncodingTest
    [junit] Tests run: 1, Failures: 0, Errors: 0, Time elapsed: 0.23 sec
    [junit] Running tests.ExternalAttTest
    [junit] Tests run: 1, Failures: 0, Errors: 0, Time elapsed: 0.214 sec
    [junit] Running tests.FacetsTest
    [junit] Tests run: 9, Failures: 0, Errors: 0, Time elapsed: 0.273 sec
    [junit] Running tests.GroupTest
    [junit] Tests run: 1, Failures: 0, Errors: 0, Time elapsed: 0.261 sec
    [junit] Running tests.ImportTest
    [junit] Tests run: 3, Failures: 0, Errors: 0, Time elapsed: 0.271 sec
    [junit] Running tests.IncludeTest
    [junit] Tests run: 4, Failures: 0, Errors: 0, Time elapsed: 0.479 sec
    [junit] Running tests.ListTest
    [junit] Tests run: 1, Failures: 0, Errors: 0, Time elapsed: 0.053 sec
    [junit] Running tests.MixedContentTest
    [junit] Tests run: 1, Failures: 0, Errors: 0, Time elapsed: 0.135 sec
    [junit] Running tests.MultipleExternalAttTest
    [junit] Tests run: 1, Failures: 0, Errors: 0, Time elapsed: 0.154 sec
    [junit] Running tests.NamespaceContextTest
    [junit] Tests run: 1, Failures: 0, Errors: 0, Time elapsed: 0.466 sec
    [junit] Running tests.NotationTest
    [junit] Tests run: 1, Failures: 0, Errors: 0, Time elapsed: 0.26 sec
    [junit] Running tests.RedefineTest
    [junit] Tests run: 4, Failures: 0, Errors: 0, Time elapsed: 0.295 sec
    [junit] Running tests.SequenceTest
    [junit] Tests run: 1, Failures: 0, Errors: 0, Time elapsed: 0.076 sec
    [junit] Running tests.SimpleContentExtensionTest
    [junit] Tests run: 1, Failures: 0, Errors: 0, Time elapsed: 0.064 sec
    [junit] Running tests.SimpleContentRestrictionTest
    [junit] Tests run: 1, Failures: 0, Errors: 0, Time elapsed: 0.062 sec
    [junit] Running tests.TestElementForm
    [junit] Tests run: 1, Failures: 0, Errors: 0, Time elapsed: 0.053 sec
    [junit] Running tests.TestForwardRefs
    [junit] Tests run: 1, Failures: 0, Errors: 0, Time elapsed: 0.117 sec
    [junit] Running tests.TestLocalUnnamedSimpleType
    [junit] Tests run: 1, Failures: 0, Errors: 0, Time elapsed: 0.06 sec
    [junit] Running tests.TestSimpleRestriction
    [junit] Tests run: 2, Failures: 1, Errors: 0, Time elapsed: 0.071 sec

BUILD FAILED
/srv/gump/public/workspace/ws-axis2-commons/XmlSchema/build.xml:106: Test tests.TestSimpleRestriction failed

Total time: 1 minute 9 seconds
---------------------------------------------

To subscribe to this information via syndicated feeds:
- RSS: http://vmgump.apache.org/gump/public/ws-axis2-commons/ws-commons-xmlschema/rss.xml
- Atom: http://vmgump.apache.org/gump/public/ws-axis2-commons/ws-commons-xmlschema/atom.xml

============================== Gump Tracking Only ===
Produced by Gump version 2.3.
Gump Run 11000019012008, vmgump:vmgump-public:11000019012008
Gump E-mail Identifier (unique within run) #11.

*********************************************************** G U M P
[GUMP@vmgump]: Project rhino (in module rhino) failed
To whom it may engage...
        
This is an automated request, but not an unsolicited one. For 
more information please visit http://gump.apache.org/nagged.html, 
and/or contact the folk at general@gump.apache.org.

Project rhino has an issue affecting its community integration.
This issue affects 15 projects,
 and has been outstanding for 33 runs.
The current state of this project is 'Failed', with reason 'Build Failed'.
For reference only, the following projects are affected by this:
    - htmlunit :  A tool for testing web based applications
    - httpunit :  framework for unit testing web sites
    - jakarta-cactus-documentation :  Cactus Documentation
    - jakarta-cactus-framework-12 :  Cactus Framework (J2EE 1.2)
    - jakarta-cactus-framework-13 :  Cactus Framework (J2EE 1.3)
    - jakarta-cactus-release-12 :  Unit test framework for server-side java code
    - jakarta-cactus-release-13 :  Unit test framework for server-side java code
    - jakarta-cactus-sample-jetty-13 :  Cactus Jetty Sample (J2EE 1.3)
    - jakarta-cactus-sample-servlet-12 :  Cactus Servlet Sample (J2EE 1.2)
    - jakarta-cactus-sample-servlet-13 :  Cactus Servlet Sample (J2EE 1.3)
    - jakarta-jmeter-svn :  Pure Java load testing and performance measurement tool.
   ...
    - jakarta-jmeter-test :  Pure Java load testing and performance measurement tool.
   ...
    - rhino :  JavaScript for Java
    - strutstestcase :  An extension of the standard JUnit TestCase class that provi...
    - ws-axis-test :  Apache eXtensible Interaction System


Full details are available at:
    http://vmgump.apache.org/gump/public/rhino/rhino/index.html

That said, some information snippets are provided here.

The following annotations (debug/informational/warning/error messages) were provided:
 -DEBUG- Sole output [js.jar] identifier set to project name
 -INFO- Made directory [/srv/gump/public/workspace/rhino/build/classes]
 -INFO- Failed with reason build failed
 -INFO- Failed to extract fallback artifacts from Gump Repository



The following work was performed:
http://vmgump.apache.org/gump/public/rhino/rhino/gump_work/build_rhino_rhino.html
Work Name: build_rhino_rhino (Type: Build)
Work ended in a state of : Failed
Elapsed: 15 secs
Command Line: /usr/lib/jvm/java-1.5.0-sun/bin/java -Djava.awt.headless=true -Dant.build.clonevm=true -Xbootclasspath/p:/srv/gump/public/workspace/xml-commons/java/external/build/xml-apis.jar:/srv/gump/public/workspace/xml-xerces2/build/xercesImpl.jar org.apache.tools.ant.Main -Dgump.merge=/srv/gump/public/gump/work/merge.xml -Dbuild.sysclasspath=only -Dversion=_19012008 dist 
[Working Directory: /srv/gump/public/workspace/rhino]
CLASSPATH: /usr/lib/jvm/java-1.5.0-sun/lib/tools.jar:/srv/gump/public/workspace/rhino/build/classes:/srv/gump/public/workspace/ant/dist/lib/ant-jmf.jar:/srv/gump/public/workspace/ant/dist/lib/ant-swing.jar:/srv/gump/public/workspace/ant/dist/lib/ant-apache-resolver.jar:/srv/gump/public/workspace/ant/dist/lib/ant-trax.jar:/srv/gump/public/workspace/ant/dist/lib/ant-junit.jar:/srv/gump/public/workspace/ant/dist/lib/ant-launcher.jar:/srv/gump/public/workspace/ant/dist/lib/ant-nodeps.jar:/srv/gump/public/workspace/ant/dist/lib/ant.jar:/srv/gump/packages/junit3.8.1/junit.jar:/srv/gump/public/workspace/xml-commons/java/build/resolver.jar:/srv/gump/public/workspace/xml-xmlbeans/build/lib/xbean_xpath.jar:/srv/gump/public/workspace/xml-xmlbeans/build/lib/xmlpublic.jar:/srv/gump/public/workspace/xml-xmlbeans/build/lib/xbean.jar:/srv/gump/public/workspace/xml-commons/java/external/build/xml-apis-ext.jar
---------------------------------------------
    [javac]                                  ^
    [javac] Note: Some input files use unchecked or unsafe operations.
    [javac] Note: Recompile with -Xlint:unchecked for details.
    [javac] 31 warnings

no-e4x-compile:

old-e4x:

xmlbeans-unzip:

xmlbeans-get:
    [mkdir] Created dir: /srv/gump/public/workspace/rhino/build/tmp-xbean
      [get] Getting: http://www.apache.org/dist/xmlbeans/binaries/xmlbeans-2.2.0.zip
      [get] To: /srv/gump/public/workspace/rhino/build/tmp-xbean/xbean.zip
    [unzip] Expanding: /srv/gump/public/workspace/rhino/build/tmp-xbean/xbean.zip into /srv/gump/public/workspace/rhino/build/tmp-xbean
     [copy] Copying 1 file to /srv/gump/public/workspace/rhino/lib
     [copy] Copying 1 file to /srv/gump/public/workspace/rhino/lib
   [delete] Deleting directory /srv/gump/public/workspace/rhino/build/tmp-xbean

old-e4x-compile:
     [echo] Compiling XMLBeans E4X implementation using ./lib/xbean.jar and ./lib/jsr173_1.0_api.jar
    [javac] Compiling 11 source files to /srv/gump/public/workspace/rhino/build/classes
    [javac] Note: Some input files use unchecked or unsafe operations.
    [javac] Note: Recompile with -Xlint:unchecked for details.

no-old-e4x-compile:

compile-all:

compile:
    [javac] Compiling 3 source files to /srv/gump/public/workspace/rhino/build/classes

jar:
      [jar] Building jar: /srv/gump/public/workspace/rhino/build/rhino_19012008/js.jar

retrotranslator-check:

retrotranslator-download:
    [mkdir] Created dir: /srv/gump/public/workspace/rhino/build/download
      [get] Getting: http://downloads.sourceforge.net/retrotranslator/Retrotranslator-1.2.3-bin.zip
      [get] To: /srv/gump/public/workspace/rhino/build/download/Retrotranslator-1.2.3-bin.zip
    [unzip] Expanding: /srv/gump/public/workspace/rhino/build/download/Retrotranslator-1.2.3-bin.zip into /srv/gump/public/workspace/rhino/build/download

retrotranslator:

BUILD FAILED
/srv/gump/public/workspace/rhino/build.xml:118: taskdef class net.sf.retrotranslator.transformer.RetrotranslatorTask cannot be found

Total time: 14 seconds
---------------------------------------------

To subscribe to this information via syndicated feeds:
- RSS: http://vmgump.apache.org/gump/public/rhino/rhino/rss.xml
- Atom: http://vmgump.apache.org/gump/public/rhino/rhino/atom.xml

============================== Gump Tracking Only ===
Produced by Gump version 2.3.
Gump Run 11000019012008, vmgump:vmgump-public:11000019012008
Gump E-mail Identifier (unique within run) #12.

*********************************************************** G U M P
[GUMP@vmgump]: Module httpcomponents success, but with warnings.
To whom it may engage...
        
This is an automated request, but not an unsolicited one. For 
more information please visit http://gump.apache.org/nagged.html, 
and/or contact the folk at general@gump.apache.org.

Module httpcomponents contains errors.
The current state of this module is 'Success'.

Full details are available at:
    http://vmgump.apache.org/gump/public/httpcomponents/index.html

That said, some information snippets are provided here.

The following annotations (debug/informational/warning/error messages) were provided:
 -ERROR- *** Failed to update from source control. Stale contents ***



The following work was performed:
http://vmgump.apache.org/gump/public/httpcomponents/gump_work/update_httpcomponents.html
Work Name: update_httpcomponents (Type: Update)
Work ended in a state of : Failed
Elapsed: 1 sec
Command Line: svn --quiet update --non-interactive httpcomponents 
[Working Directory: /srv/gump/public/workspace/cvs]
---------------------------------------------
svn: URL 'https://svn.apache.org/repos/asf/jakarta/httpcomponents/httpcore/trunk' doesn't exist
---------------------------------------------

To subscribe to this information via syndicated feeds:
- RSS: http://vmgump.apache.org/gump/public/httpcomponents/rss.xml
- Atom: http://vmgump.apache.org/gump/public/httpcomponents/atom.xml

============================== Gump Tracking Only ===
Produced by Gump version 2.3.
Gump Run 11000019012008, vmgump:vmgump-public:11000019012008
Gump E-mail Identifier (unique within run) #18.

*********************************************************** G U M P
[GUMP@vmgump]: Project slf4j (in module slf4j) failed
To whom it may engage...
        
This is an automated request, but not an unsolicited one. For 
more information please visit http://gump.apache.org/nagged.html, 
and/or contact the folk at general@gump.apache.org.

Project slf4j has an issue affecting its community integration.
This issue affects 19 projects,
 and has been outstanding for 4 runs.
The current state of this project is 'Failed', with reason 'Build Failed'.
For reference only, the following projects are affected by this:
    - apache-ldapber-provider :  Apache Directory Project
    - apacheds-core :  Apache Directory Server
    - apacheds-main :  Apache Directory Server
    - apacheds-shared :  Apache Directory Server
    - asn1-ber :  Apache ASN.1 Tools
    - asn1-codec :  Apache ASN.1 Tools
    - asn1-der :  Apache ASN.1 Tools
    - cargo :  Cargo provides a Java API to manipulate Java Containers
    - jetty :  Java HTTP Servlet Server
    - kerberos-common :  Apache Directory Project
    - kerberos-protocol :  Apache Kerberos Server
    - ldap-common :  Apache Directory Project
    - ldap-protocol :  Apache Directory Server
    - ldap-snacc-provider :  Apache Directory Project
    - maven-directory-plugin :  Apache Directory Server
    - mina :  A Multipurpose Infrastrusture for Network Applications
    - nlog4j
    - slf4j :  Simple Logging Facade for Java
    - stub-compiler :  Apache ASN.1 Tools


Full details are available at:
    http://vmgump.apache.org/gump/public/slf4j/slf4j/index.html

That said, some information snippets are provided here.

The following annotations (debug/informational/warning/error messages) were provided:
 -DEBUG- (Gump generated) Maven Properties in: /srv/gump/public/workspace/slf4j/profiles.xml
 -INFO- Failed with reason build failed
 -DEBUG- Maven POM in: /srv/gump/public/workspace/slf4j/pom.xml
 -INFO- Failed to extract fallback artifacts from Gump Repository



The following work was performed:
http://vmgump.apache.org/gump/public/slf4j/slf4j/gump_work/build_slf4j_slf4j.html
Work Name: build_slf4j_slf4j (Type: Build)
Work ended in a state of : Failed
Elapsed: 30 secs
Command Line: mvn package 
[Working Directory: /srv/gump/public/workspace/slf4j]
CLASSPATH: /usr/lib/jvm/java-1.5.0-sun/lib/tools.jar:/srv/gump/public/workspace/apache-commons/logging/target/commons-logging-api-19012008.jar:/srv/gump/public/workspace/logging-log4j-12/dist/lib/log4j-19012008.jar:/srv/gump/public/workspace/xml-commons/java/external/build/xml-apis-ext.jar
---------------------------------------------
[INFO] Building SLF4J Converter
[INFO]    task-segment: [package]
[INFO] ----------------------------------------------------------------------------
[INFO] [resources:resources]
[INFO] Using default encoding to copy filtered resources.
[INFO] [compiler:compile]
[INFO] Compiling 14 source files to /srv/gump/public/workspace/slf4j/slf4j-converter/target/classes
[INFO] [resources:testResources]
[INFO] Using default encoding to copy filtered resources.
[INFO] [compiler:testCompile]
[INFO] Compiling 12 source files to /srv/gump/public/workspace/slf4j/slf4j-converter/target/test-classes
[INFO] [surefire:test]
[INFO] Surefire report directory: /srv/gump/public/workspace/slf4j/slf4j-converter/target/surefire-reports

-------------------------------------------------------
 T E S T S
-------------------------------------------------------
Running org.slf4j.converter.line.JCLRuleSetTest
Tests run: 5, Failures: 0, Errors: 0, Skipped: 0, Time elapsed: 0.06 sec
Running org.slf4j.converter.line.Log4jRuleSetTest
Tests run: 5, Failures: 0, Errors: 0, Skipped: 0, Time elapsed: 0.018 sec
Running org.slf4j.converter.line.TrivialMatcherTest
replacing group 1 : first group with 1st group
replacing group 3 :  third group with 
Tests run: 1, Failures: 0, Errors: 0, Skipped: 0, Time elapsed: 0.01 sec
Running org.slf4j.converter.line.NoConversionTest
Tests run: 2, Failures: 0, Errors: 0, Skipped: 0, Time elapsed: 0.008 sec
Running org.slf4j.converter.FileConverterTest
Tests run: 1, Failures: 0, Errors: 0, Skipped: 0, Time elapsed: 0.004 sec
Running org.slf4j.converter.ProjectConverterTest
Tests run: 2, Failures: 0, Errors: 1, Skipped: 0, Time elapsed: 0.027 sec <<< FAILURE!

Results :

Tests in error: 
  testBarracuda(org.slf4j.converter.ProjectConverterTest)

Tests run: 16, Failures: 0, Errors: 1, Skipped: 0

[INFO] ------------------------------------------------------------------------
[ERROR] BUILD FAILURE
[INFO] ------------------------------------------------------------------------
[INFO] There are test failures.
[INFO] ------------------------------------------------------------------------
[INFO] For more information, run Maven with the -e switch
[INFO] ------------------------------------------------------------------------
[INFO] Total time: 29 seconds
[INFO] Finished at: Sat Jan 19 01:51:20 GMT-08:00 2008
[INFO] Final Memory: 12M/25M
[INFO] ------------------------------------------------------------------------
---------------------------------------------

To subscribe to this information via syndicated feeds:
- RSS: http://vmgump.apache.org/gump/public/slf4j/slf4j/rss.xml
- Atom: http://vmgump.apache.org/gump/public/slf4j/slf4j/atom.xml

============================== Gump Tracking Only ===
Produced by Gump version 2.3.
Gump Run 11000019012008, vmgump:vmgump-public:11000019012008
Gump E-mail Identifier (unique within run) #20.

*********************************************************** G U M P
[GUMP@vmgump]: Project commons-jci (in module commons-sandbox) failed
To whom it may engage...
        
This is an automated request, but not an unsolicited one. For 
more information please visit http://gump.apache.org/nagged.html, 
and/or contact the folk at general@gump.apache.org.

Project commons-jci has an issue affecting its community integration.
This issue affects 2 projects,
 and has been outstanding for 4 runs.
The current state of this project is 'Failed', with reason 'Build Failed'.
For reference only, the following projects are affected by this:
    - commons-javaflow :  Commons Javaflow
    - commons-jci :  Commons JCI


Full details are available at:
    http://vmgump.apache.org/gump/public/commons-sandbox/commons-jci/index.html

That said, some information snippets are provided here.

The following annotations (debug/informational/warning/error messages) were provided:
 -DEBUG- Sole output [commons-jci-19012008.jar] identifier set to project name
 -DEBUG- Dependency on packaged-groovy exists, no need to add for property maven.jar.groovy.
 -INFO- Making directory for Maven properties: [/srv/gump/public/workspace/commons-sandbox/jci]
 -DEBUG- (Gump generated) Maven Properties in: /srv/gump/public/workspace/commons-sandbox/jci/build.properties
 -INFO- Failed with reason build failed
 -INFO- Failed to extract fallback artifacts from Gump Repository



The following work was performed:
http://vmgump.apache.org/gump/public/commons-sandbox/commons-jci/gump_work/build_commons-sandbox_commons-jci.html
Work Name: build_commons-sandbox_commons-jci (Type: Build)
Work ended in a state of : Failed
Elapsed: 4 secs
Command Line: maven --offline jar 
[Working Directory: /srv/gump/public/workspace/commons-sandbox/jci]
CLASSPATH: /usr/lib/jvm/java-1.5.0-sun/lib/tools.jar:/srv/gump/public/workspace/jakarta-bcel/target/bcel-5.3-SNAPSHOT.jar:/srv/gump/public/workspace/apache-commons/collections/build/commons-collections-19012008.jar:/srv/gump/public/workspace/apache-commons/io/target/commons-io-19012008.jar:/srv/gump/public/workspace/apache-commons/lang/commons-lang-19012008.jar:/srv/gump/public/workspace/apache-commons/logging/target/commons-logging-19012008.jar:/srv/gump/public/workspace/apache-commons/logging/target/commons-logging-api-19012008.jar:/srv/gump/packages/eclipse-3.1M6/plugins/org.eclipse.jdt.core_3.1.0/jdtcore.jar:/srv/gump/packages/janino-2.3.8/lib/janino.jar:/srv/gump/packages/jarjar/jarjar-0.6.jar:/srv/gump/public/workspace/asm/output/dist/lib/asm-analysis-19012008.jar:/srv/gump/public/workspace/asm/output/dist/lib/asm-util-19012008.jar:/srv/gump/public/workspace/asm/output/dist/lib/asm-xml-19012008.jar:/srv/gump/public/workspace/asm/output/dist/lib/asm-commons-19012008.jar:
 /srv/gump/public/workspace/asm/output/dist/lib/asm-19012008.jar:/srv/gump/public/workspace/asm/output/dist/lib/asm-tree-19012008.jar:/srv/gump/packages/antlr-2.7.6/antlr.jar:/srv/gump/packages/groovy-1.0-jsr-03/groovy-1.0-jsr-03.jar:/srv/gump/packages/maven-cobertura-plugin/maven-cobertura-plugin-1.1.jar
---------------------------------------------
 __  __
|  \/  |__ _Apache__ ___
| |\/| / _` \ V / -_) ' \  ~ intelligent projects ~
|_|  |_\__,_|\_/\___|_||_|  v. 1.0.2

build:start:

java:prepare-filesystem:
    [mkdir] Created dir: /srv/gump/public/workspace/commons-sandbox/jci/target/classes

java:compile:
    [echo] Compiling to /srv/gump/public/workspace/commons-sandbox/jci/target/classes
    [echo] No java source files to compile.
resources or todir was null

java:jar-resources:

test:prepare-filesystem:
    [mkdir] Created dir: /srv/gump/public/workspace/commons-sandbox/jci/target/test-classes
    [mkdir] Created dir: /srv/gump/public/workspace/commons-sandbox/jci/target/test-reports

test:test-resources:

test:compile:
    [echo] No test source files to compile.

test:test:
    [echo] No tests to run.

BUILD FAILED
File...... /home/gump/.maven/cache/maven-jar-plugin-1.6.1/plugin.jelly
Element... ant:fail
Line...... 53
Column.... 19
You must define currentVersion in your POM.
Total time: 3 seconds
Finished at: Sat Jan 19 01:55:56 GMT-08:00 2008

---------------------------------------------

To subscribe to this information via syndicated feeds:
- RSS: http://vmgump.apache.org/gump/public/commons-sandbox/commons-jci/rss.xml
- Atom: http://vmgump.apache.org/gump/public/commons-sandbox/commons-jci/atom.xml

============================== Gump Tracking Only ===
Produced by Gump version 2.3.
Gump Run 11000019012008, vmgump:vmgump-public:11000019012008
Gump E-mail Identifier (unique within run) #21.

*********************************************************** G U M P
[GUMP@vmgump]: Project emma (in module emma) failed
To whom it may engage...
        
This is an automated request, but not an unsolicited one. For 
more information please visit http://gump.apache.org/nagged.html, 
and/or contact the folk at general@gump.apache.org.

Project emma has an issue affecting its community integration.
This issue affects 1 projects,
 and has been outstanding for 619 runs.
The current state of this project is 'Failed', with reason 'Build Failed'.
For reference only, the following projects are affected by this:
    - emma :  code coverage tool


Full details are available at:
    http://vmgump.apache.org/gump/public/emma/emma/index.html

That said, some information snippets are provided here.

The following annotations (debug/informational/warning/error messages) were provided:
 -INFO- Failed with reason build failed
 -INFO- Failed to extract fallback artifacts from Gump Repository



The following work was performed:
http://vmgump.apache.org/gump/public/emma/emma/gump_work/build_emma_emma.html
Work Name: build_emma_emma (Type: Build)
Work ended in a state of : Failed
Elapsed: 7 secs
Command Line: /usr/lib/jvm/java-1.5.0-sun/bin/java -Djava.awt.headless=true -Xbootclasspath/p:/srv/gump/public/workspace/xml-commons/java/external/build/xml-apis.jar:/srv/gump/public/workspace/xml-xerces2/build/xercesImpl.jar org.apache.tools.ant.Main -Dgump.merge=/srv/gump/public/gump/work/merge.xml -Dbuild.sysclasspath=only -Dapp.short.name=emma-19012008 
[Working Directory: /srv/gump/public/workspace/emma]
CLASSPATH: /usr/lib/jvm/java-1.5.0-sun/lib/tools.jar:/srv/gump/public/workspace/emma/out/core/classes:/srv/gump/public/workspace/emma/out/ant/classes:/srv/gump/public/workspace/emma/lib/internal/stamptool.jar:/srv/gump/public/workspace/ant/dist/lib/ant-jmf.jar:/srv/gump/public/workspace/ant/dist/lib/ant-swing.jar:/srv/gump/public/workspace/ant/dist/lib/ant-apache-resolver.jar:/srv/gump/public/workspace/ant/dist/lib/ant-trax.jar:/srv/gump/public/workspace/ant/dist/lib/ant-junit.jar:/srv/gump/public/workspace/ant/dist/lib/ant-launcher.jar:/srv/gump/public/workspace/ant/dist/lib/ant-nodeps.jar:/srv/gump/public/workspace/ant/dist/lib/ant.jar:/srv/gump/public/workspace/xml-commons/java/external/build/xml-apis-ext.jar
---------------------------------------------
     [copy] Copying 1 file to /srv/gump/public/workspace/emma/out/temp

timestamp:

-pre-compile:

core.bootstrap.compile:
    [javac] Compiling 2 source files to /srv/gump/public/workspace/emma/out/core/classes
    [javac] 
    [javac]           WARNING
    [javac] 
    [javac] The -source switch defaults to 1.5 in JDK 1.5 and 1.6.
    [javac] If you specify -target 1.2 you now must also specify -source 1.2.
    [javac] Ant will implicitly add -source 1.2 for you.  Please change your build file.

core.java14.compile:
    [javac] Compiling 1 source file to /srv/gump/public/workspace/emma/out/core/classes
    [javac] 
    [javac]           WARNING
    [javac] 
    [javac] The -source switch defaults to 1.5 in JDK 1.5 and 1.6.
    [javac] If you specify -target 1.2 you now must also specify -source 1.2.
    [javac] Ant will implicitly add -source 1.2 for you.  Please change your build file.

core.java13.compile:
    [javac] Compiling 1 source file to /srv/gump/public/workspace/emma/out/core/classes
    [javac] 
    [javac]           WARNING
    [javac] 
    [javac] The -source switch defaults to 1.5 in JDK 1.5 and 1.6.
    [javac] If you specify -target 1.2 you now must also specify -source 1.2.
    [javac] Ant will implicitly add -source 1.2 for you.  Please change your build file.

core.compile:
    [javac] Compiling 175 source files to /srv/gump/public/workspace/emma/out/core/classes
    [javac] 
    [javac]           WARNING
    [javac] 
    [javac] The -source switch defaults to 1.5 in JDK 1.5 and 1.6.
    [javac] If you specify -target 1.2 you now must also specify -source 1.2.
    [javac] Ant will implicitly add -source 1.2 for you.  Please change your build file.
    [javac] /srv/gump/public/workspace/emma/core/java12/com/vladium/emma/run/InstrClassLoader.java:346: reference to CodeSource is ambiguous, both method CodeSource(java.net.URL,java.security.cert.Certificate[]) in java.security.CodeSource and method CodeSource(java.net.URL,java.security.CodeSigner[]) in java.security.CodeSource match
    [javac]         final CodeSource csrc = new CodeSource (srcURL, null);
    [javac]                                 ^
    [javac] 1 error

BUILD FAILED
/srv/gump/public/workspace/emma/build.xml:297: Compile failed; see the compiler error output for details.

Total time: 6 seconds
---------------------------------------------

To subscribe to this information via syndicated feeds:
- RSS: http://vmgump.apache.org/gump/public/emma/emma/rss.xml
- Atom: http://vmgump.apache.org/gump/public/emma/emma/atom.xml

============================== Gump Tracking Only ===
Produced by Gump version 2.3.
Gump Run 11000019012008, vmgump:vmgump-public:11000019012008
Gump E-mail Identifier (unique within run) #22.

*********************************************************** G U M P
[GUMP@vmgump]: Project hivemind-compile (in module hivemind) failed
To whom it may engage...
        
This is an automated request, but not an unsolicited one. For 
more information please visit http://gump.apache.org/nagged.html, 
and/or contact the folk at general@gump.apache.org.

Project hivemind-compile has an issue affecting its community integration.
This issue affects 8 projects,
 and has been outstanding for 4 runs.
The current state of this project is 'Failed', with reason 'Build Failed'.
For reference only, the following projects are affected by this:
    - eyebrowse :  Web-based mail archive browsing
    - hivemind :  HiveMind is a services and configuration
    microkernel
    - hivemind-compile :  HiveMind is a services and configuration
    microkernel
    - hivemind-library :  HiveMind is a services and configuration
    microkernel
    - jakarta-lucene :  Java Based Search Engine
    - lucene-java :  Java Based Search Engine
    - tapestry :  Component-based web application framework organized around i...
    - xml-xindice :  native XML database


Full details are available at:
    http://vmgump.apache.org/gump/public/hivemind/hivemind-compile/index.html

That said, some information snippets are provided here.

The following annotations (debug/informational/warning/error messages) were provided:
 -INFO- Failed with reason build failed



The following work was performed:
http://vmgump.apache.org/gump/public/hivemind/hivemind-compile/gump_work/build_hivemind_hivemind-compile.html
Work Name: build_hivemind_hivemind-compile (Type: Build)
Work ended in a state of : Failed
Elapsed: 
Command Line: /usr/lib/jvm/java-1.5.0-sun/bin/java -Djava.awt.headless=true -Xbootclasspath/p:/srv/gump/public/workspace/xml-commons/java/external/build/xml-apis.jar:/srv/gump/public/workspace/xml-xerces2/build/xercesImpl.jar org.apache.tools.ant.Main -Dgump.merge=/srv/gump/public/gump/work/merge.xml -Dbuild.sysclasspath=only -Ddownload-warning-marker-displayed=true -Dtest.classes.dir=target/test-classes -Djunit-available=true -Djavacc.home=/srv/gump/packages/javacc-3.1 -Djava.classes.dir=target/classes compile-tests 
[Working Directory: /srv/gump/public/workspace/hivemind/framework]
CLASSPATH: /usr/lib/jvm/java-1.5.0-sun/lib/tools.jar:/srv/gump/public/workspace/hivemind/hivemind/target/classes:/srv/gump/public/workspace/hivemind/hivebuild/target/classes:/srv/gump/public/workspace/hivemind/framework/target/classes:/srv/gump/public/workspace/ant/dist/lib/ant-jmf.jar:/srv/gump/public/workspace/ant/dist/lib/ant-swing.jar:/srv/gump/public/workspace/ant/dist/lib/ant-apache-resolver.jar:/srv/gump/public/workspace/ant/dist/lib/ant-trax.jar:/srv/gump/public/workspace/ant/dist/lib/ant-junit.jar:/srv/gump/public/workspace/ant/dist/lib/ant-launcher.jar:/srv/gump/public/workspace/ant/dist/lib/ant-nodeps.jar:/srv/gump/public/workspace/ant/dist/lib/ant.jar:/srv/gump/public/workspace/apache-commons/logging/target/commons-logging-19012008.jar:/srv/gump/public/workspace/apache-commons/logging/target/commons-logging-api-19012008.jar:/srv/gump/packages/easymock1.2_Java1.3/easymock.jar:/srv/gump/packages/easymockclassextension1.2/easymockclassextension.jar:/srv/gump/public/w
 orkspace/jakarta-oro/jakarta-oro-19012008.jar:/srv/gump/public/workspace/jakarta-servletapi-4/lib/servlet.jar:/srv/gump/public/workspace/javassist/javassist.jar:/srv/gump/public/workspace/junit/dist/junit-19012008.jar:/srv/gump/public/workspace/logging-log4j-12/dist/lib/log4j-19012008.jar:/srv/gump/public/workspace/xml-commons/java/external/build/xml-apis-ext.jar
---------------------------------------------
Buildfile: build.xml does not exist!
Build failed
---------------------------------------------

To subscribe to this information via syndicated feeds:
- RSS: http://vmgump.apache.org/gump/public/hivemind/hivemind-compile/rss.xml
- Atom: http://vmgump.apache.org/gump/public/hivemind/hivemind-compile/atom.xml

============================== Gump Tracking Only ===
Produced by Gump version 2.3.
Gump Run 11000019012008, vmgump:vmgump-public:11000019012008
Gump E-mail Identifier (unique within run) #23.

*********************************************************** G U M P
[GUMP@vmgump]: Project jmock2 (in module jmock2) failed
To whom it may engage...
        
This is an automated request, but not an unsolicited one. For 
more information please visit http://gump.apache.org/nagged.html, 
and/or contact the folk at general@gump.apache.org.

Project jmock2 has an issue affecting its community integration.
This issue affects 1 projects,
 and has been outstanding for 99 runs.
The current state of this project is 'Failed', with reason 'Build Failed'.
For reference only, the following projects are affected by this:
    - jmock2 :  jMock is a library for testing Java code using mock objects.


Full details are available at:
    http://vmgump.apache.org/gump/public/jmock2/jmock2/index.html

That said, some information snippets are provided here.

The following annotations (debug/informational/warning/error messages) were provided:
 -INFO- Failed with reason build failed
 -INFO- Failed to extract fallback artifacts from Gump Repository



The following work was performed:
http://vmgump.apache.org/gump/public/jmock2/jmock2/gump_work/build_jmock2_jmock2.html
Work Name: build_jmock2_jmock2 (Type: Build)
Work ended in a state of : Failed
Elapsed: 5 secs
Command Line: /usr/lib/jvm/java-1.5.0-sun/bin/java -Djava.awt.headless=true -Xbootclasspath/p:/srv/gump/public/workspace/xml-xerces2/build/xercesImpl.jar:/srv/gump/public/workspace/xml-commons/java/external/build/xml-apis.jar org.apache.tools.ant.Main -Dgump.merge=/srv/gump/public/gump/work/merge.xml -Dbuild.sysclasspath=only -Dversion=19012008 
[Working Directory: /srv/gump/public/workspace/jmock2]
CLASSPATH: /usr/lib/jvm/java-1.5.0-sun/lib/tools.jar:/srv/gump/public/workspace/jmock2/build/classes:/srv/gump/public/workspace/jmock2/lib/hamcrest-api-1.0.jar:/srv/gump/public/workspace/jmock2/lib/hamcrest-library-1.0.jar:/srv/gump/public/workspace/jmock2/lib/objenesis-1.0.jar:/srv/gump/public/workspace/ant/dist/lib/ant-jmf.jar:/srv/gump/public/workspace/ant/dist/lib/ant-swing.jar:/srv/gump/public/workspace/ant/dist/lib/ant-apache-resolver.jar:/srv/gump/public/workspace/ant/dist/lib/ant-trax.jar:/srv/gump/public/workspace/ant/dist/lib/ant-junit.jar:/srv/gump/public/workspace/ant/dist/lib/ant-launcher.jar:/srv/gump/public/workspace/ant/dist/lib/ant-nodeps.jar:/srv/gump/public/workspace/ant/dist/lib/ant.jar:/srv/gump/packages/cglib/cglib-nodep-2.1_3.jar:/srv/gump/public/workspace/junit/dist/junit-19012008.jar:/srv/gump/packages/junit3.8.1/junit.jar:/srv/gump/public/workspace/xml-commons/java/external/build/xml-apis-ext.jar
---------------------------------------------
    [javac]             exactly(1).of (anything()).method(withName("m")).with(greaterThan(0));
    [javac]                                                                   ^
    [javac] /srv/gump/public/workspace/jmock2/test/org/jmock/test/acceptance/HamcrestTypeSafetyAcceptanceTests.java:34: incompatible types
    [javac] found   : org.jmock.internal.matcher.MethodNameMatcher
    [javac] required: org.hamcrest.Matcher<java.lang.reflect.Method>
    [javac]         return new MethodNameMatcher(nameRegex);
    [javac]                ^
    [javac] /srv/gump/public/workspace/jmock2/test/org/jmock/test/unit/support/StringContainsInOrder.java:18: method does not override a method from its superclass
    [javac]     @Override
    [javac]      ^
    [javac] /srv/gump/public/workspace/jmock2/test/org/jmock/test/unit/support/StringContainsInOrder.java:39: incompatible types
    [javac] found   : org.jmock.test.unit.support.StringContainsInOrder
    [javac] required: org.hamcrest.Matcher<java.lang.String>
    [javac]         return new StringContainsInOrder(Arrays.asList(substrings));
    [javac]                ^
    [javac] /srv/gump/public/workspace/jmock2/test/org/jmock/test/unit/support/StringContainsInOrder.java:44: incompatible types
    [javac] found   : org.jmock.test.unit.support.StringContainsInOrder
    [javac] required: org.hamcrest.Matcher<java.lang.String>
    [javac]         return new StringContainsInOrder(substrings);
    [javac]                ^
    [javac] /srv/gump/public/workspace/jmock2/test/org/jmock/test/unit/internal/InvocationExpectationTests.java:34: cannot find symbol
    [javac] symbol: method equalTo(T)
    [javac] 				           equalTo(expected).matches(actual));
    [javac]                                            ^
    [javac] /srv/gump/public/workspace/jmock2/test/org/jmock/test/unit/internal/InvocationExpectationTests.java:54: cannot find symbol
    [javac] symbol  : method sameInstance(java.lang.Object)
    [javac] location: class org.jmock.test.unit.internal.InvocationExpectationTests
    [javac] 		expectation.setObjectMatcher(sameInstance(targetObject));
    [javac]                                              ^
    [javac] /srv/gump/public/workspace/jmock2/test/org/jmock/test/unit/internal/InvocationExpectationTests.java:63: cannot find symbol
    [javac] symbol  : method equalTo(java.lang.reflect.Method)
    [javac] location: class org.jmock.test.unit.internal.InvocationExpectationTests
    [javac] 		expectation.setMethodMatcher(equalTo(method));
    [javac]                                              ^
    [javac] /srv/gump/public/workspace/jmock2/test/org/jmock/test/unit/internal/InvocationExpectationTests.java:75: cannot find symbol
    [javac] symbol  : method equalTo(java.lang.Object[])
    [javac] location: class org.jmock.test.unit.internal.InvocationExpectationTests
    [javac] 		expectation.setParametersMatcher(equalTo(args));
    [javac]                                                  ^
    [javac] /srv/gump/public/workspace/jmock2/test/org/jmock/test/unit/lib/script/ScriptedCallbackActionTests.java:78: cannot find symbol
    [javac] symbol  : method sameInstance(java.lang.Exception)
    [javac] location: class org.jmock.test.unit.lib.script.ScriptedCallbackActionTests
    [javac]             assertThat(e, sameInstance(exception));
    [javac]                           ^
    [javac] 53 errors

BUILD FAILED
/srv/gump/public/workspace/jmock2/build.xml:59: Compile failed; see the compiler error output for details.

Total time: 4 seconds
---------------------------------------------

To subscribe to this information via syndicated feeds:
- RSS: http://vmgump.apache.org/gump/public/jmock2/jmock2/rss.xml
- Atom: http://vmgump.apache.org/gump/public/jmock2/jmock2/atom.xml

============================== Gump Tracking Only ===
Produced by Gump version 2.3.
Gump Run 11000019012008, vmgump:vmgump-public:11000019012008
Gump E-mail Identifier (unique within run) #25.

*********************************************************** G U M P
[GUMP@vmgump]: Module beanshell failed
To whom it may engage...
        
This is an automated request, but not an unsolicited one. For 
more information please visit http://gump.apache.org/nagged.html, 
and/or contact the folk at general@gump.apache.org.

Module beanshell has an issue affecting its community integration,
 and has been outstanding for 510 runs.
The current state of this module is 'Failed', with reason 'Update Failed'.

Full details are available at:
    http://vmgump.apache.org/gump/public/beanshell/index.html

That said, some information snippets are provided here.

The following annotations (debug/informational/warning/error messages) were provided:
 -INFO- Failed with reason update failed



The following work was performed:
http://vmgump.apache.org/gump/public/beanshell/gump_work/update_beanshell.html
Work Name: update_beanshell (Type: Update)
Work ended in a state of : Failed
Elapsed: 
Command Line: svn --quiet checkout svn://svn.ikayzo.org/beanshell/BeanShell --non-interactive beanshell 
[Working Directory: /srv/gump/public/workspace/cvs]
---------------------------------------------
svn: Can't connect to host 'svn.ikayzo.org': Connection refused
---------------------------------------------

To subscribe to this information via syndicated feeds:
- RSS: http://vmgump.apache.org/gump/public/beanshell/rss.xml
- Atom: http://vmgump.apache.org/gump/public/beanshell/atom.xml

============================== Gump Tracking Only ===
Produced by Gump version 2.3.
Gump Run 11000019012008, vmgump:vmgump-public:11000019012008
Gump E-mail Identifier (unique within run) #26.

*********************************************************** G U M P
[GUMP@vmgump]: Project jtidy-cvs (in module jtidy) failed
To whom it may engage...
        
This is an automated request, but not an unsolicited one. For 
more information please visit http://gump.apache.org/nagged.html, 
and/or contact the folk at general@gump.apache.org.

Project jtidy-cvs has an issue affecting its community integration.
This issue affects 1 projects,
 and has been outstanding for 4 runs.
The current state of this project is 'Failed', with reason 'Build Failed'.
For reference only, the following projects are affected by this:
    - jtidy-cvs :  HTML Templates


Full details are available at:
    http://vmgump.apache.org/gump/public/jtidy/jtidy-cvs/index.html

That said, some information snippets are provided here.

The following annotations (debug/informational/warning/error messages) were provided:
 -DEBUG- Sole output [jtidy-19012008.jar] identifier set to project name
 -DEBUG- Dependency on xml-apis exists, no need to add for property maven.jar.dom3-xml-apis.
 -DEBUG- (Gump generated) Maven Properties in: /srv/gump/public/workspace/jtidy/build.properties
 -INFO- Failed with reason build failed
 -DEBUG- Maven POM in: /srv/gump/public/workspace/jtidy/project.xml
 -DEBUG- Maven project properties in: /srv/gump/public/workspace/jtidy/project.properties
 -INFO- Failed to extract fallback artifacts from Gump Repository



The following work was performed:
http://vmgump.apache.org/gump/public/jtidy/jtidy-cvs/gump_work/build_jtidy_jtidy-cvs.html
Work Name: build_jtidy_jtidy-cvs (Type: Build)
Work ended in a state of : Failed
Elapsed: 3 secs
Command Line: maven --offline jar 
[Working Directory: /srv/gump/public/workspace/jtidy]
CLASSPATH: /usr/lib/jvm/java-1.5.0-sun/lib/tools.jar:/srv/gump/public/workspace/ant/dist/lib/ant-jmf.jar:/srv/gump/public/workspace/ant/dist/lib/ant-swing.jar:/srv/gump/public/workspace/ant/dist/lib/ant-apache-resolver.jar:/srv/gump/public/workspace/ant/dist/lib/ant-trax.jar:/srv/gump/public/workspace/ant/dist/lib/ant-junit.jar:/srv/gump/public/workspace/ant/dist/lib/ant-launcher.jar:/srv/gump/public/workspace/ant/dist/lib/ant-nodeps.jar:/srv/gump/public/workspace/ant/dist/lib/ant.jar:/srv/gump/packages/junit3.8.1/junit.jar:/srv/gump/public/workspace/xml-commons/java/build/resolver.jar:/srv/gump/public/workspace/xml-commons/java/external/build/xml-apis-ext.jar:/srv/gump/public/workspace/apache-commons/logging/target/commons-logging-19012008.jar:/srv/gump/public/workspace/apache-commons/logging/target/commons-logging-api-19012008.jar
---------------------------------------------
[MethodExpression] Cannot evaluate expression
java.lang.reflect.InvocationTargetException
	at sun.reflect.NativeMethodAccessorImpl.invoke0(Native Method)
	at sun.reflect.NativeMethodAccessorImpl.invoke(NativeMethodAccessorImpl.java:39)
	at sun.reflect.DelegatingMethodAccessorImpl.invoke(DelegatingMethodAccessorImpl.java:25)
	at java.lang.reflect.Method.invoke(Method.java:585)
	at org.apache.commons.betwixt.expression.MethodExpression.evaluate(MethodExpression.java:96)
	at org.apache.commons.betwixt.io.AbstractBeanWriter.writeContent(AbstractBeanWriter.java:658)
	at org.apache.commons.betwixt.io.AbstractBeanWriter.writeRestOfElement(AbstractBeanWriter.java:539)
	at org.apache.commons.betwixt.io.AbstractBeanWriter.write(AbstractBeanWriter.java:481)
	at org.apache.commons.betwixt.io.AbstractBeanWriter.writeContent(AbstractBeanWriter.java:643)
	at org.apache.commons.betwixt.io.AbstractBeanWriter.writeRestOfElement(AbstractBeanWriter.java:539)
	at org.apache.commons.betwixt.io.AbstractBeanWriter.write(AbstractBeanWriter.java:513)
	at org.apache.commons.betwixt.io.AbstractBeanWriter.write(AbstractBeanWriter.java:233)
	at org.apache.commons.betwixt.io.AbstractBeanWriter.writeContent(AbstractBeanWriter.java:630)
	at org.apache.commons.betwixt.io.AbstractBeanWriter.writeRestOfElement(AbstractBeanWriter.java:539)
	at org.apache.commons.betwixt.io.AbstractBeanWriter.write(AbstractBeanWriter.java:513)
	at org.apache.commons.betwixt.io.AbstractBeanWriter.write(AbstractBeanWriter.java:233)
	at org.apache.commons.betwixt.io.AbstractBeanWriter.write(AbstractBeanWriter.java:162)
	at org.apache.commons.betwixt.io.BeanWriter.write(BeanWriter.java:217)
	at org.apache.maven.MavenUtils.getProjectString(MavenUtils.java:432)
	at org.apache.maven.MavenUtils.getInterpolatedPOM(MavenUtils.java:383)
	at org.apache.maven.MavenUtils.getJellyProject(MavenUtils.java:360)
	at org.apache.maven.MavenUtils.getProject(MavenUtils.java:144)
	at org.apache.maven.MavenUtils.getProject(MavenUtils.java:122)
	at org.apache.maven.MavenSession.initializeRootProject(MavenSession.java:232)
	at org.apache.maven.MavenSession.initialize(MavenSession.java:172)
	at org.apache.maven.cli.App.doMain(App.java:475)
	at org.apache.maven.cli.App.main(App.java:1239)
	at sun.reflect.NativeMethodAccessorImpl.invoke0(Native Method)
	at sun.reflect.NativeMethodAccessorImpl.invoke(NativeMethodAccessorImpl.java:39)
	at sun.reflect.DelegatingMethodAccessorImpl.invoke(DelegatingMethodAccessorImpl.java:25)
	at java.lang.reflect.Method.invoke(Method.java:585)
	at com.werken.forehead.Forehead.run(Forehead.java:551)
	at com.werken.forehead.Forehead.main(Forehead.java:581)
Caused by: java.lang.IllegalArgumentException: cvs repository connection string doesn't contain six tokens
	at org.apache.maven.project.Repository.splitSCMConnection(Repository.java:258)
	at org.apache.maven.project.Repository.getScmType(Repository.java:115)
	... 33 more
The build cannot continue because of the following unsatisfied dependencies:

maven-sourceforge-plugin-1.0.jar (try downloading from http://maven-plugins.sourceforge.net)
maven-statcvs-plugin-2.7.jar
maven-findbugs-plugin-0.9.2.jar
maven-xhtml-plugin-1.2.jar (try downloading from http://maven-validator.sourceforge.net)
maven-checkstyle-plugin-2.4.1.jar (try downloading from http://maven.apache.org/reference/plugins/checkstyle)

Total time: 2 seconds
Finished at: Sat Jan 19 02:20:28 GMT-08:00 2008

---------------------------------------------

To subscribe to this information via syndicated feeds:
- RSS: http://vmgump.apache.org/gump/public/jtidy/jtidy-cvs/rss.xml
- Atom: http://vmgump.apache.org/gump/public/jtidy/jtidy-cvs/atom.xml

============================== Gump Tracking Only ===
Produced by Gump version 2.3.
Gump Run 11000019012008, vmgump:vmgump-public:11000019012008
Gump E-mail Identifier (unique within run) #28.

*********************************************************** G U M P
[GUMP@vmgump]: Project portals-pluto-portal-1.0 (in module portals-pluto-1.0) failed
To whom it may engage...
        
This is an automated request, but not an unsolicited one. For 
more information please visit http://gump.apache.org/nagged.html, 
and/or contact the folk at general@gump.apache.org.

Project portals-pluto-portal-1.0 has an issue affecting its community integration.
This issue affects 1 projects,
 and has been outstanding for 4 runs.
The current state of this project is 'Failed', with reason 'Build Failed'.
For reference only, the following projects are affected by this:
    - portals-pluto-portal-1.0 :  JSR168 Container


Full details are available at:
    http://vmgump.apache.org/gump/public/portals-pluto-1.0/portals-pluto-portal-1.0/index.html

That said, some information snippets are provided here.

The following annotations (debug/informational/warning/error messages) were provided:
 -DEBUG- Dependency on ant exists, no need to add for property env.ANT_HOME.
 -INFO- Failed with reason build failed
 -INFO- Failed to extract fallback artifacts from Gump Repository



The following work was performed:
http://vmgump.apache.org/gump/public/portals-pluto-1.0/portals-pluto-portal-1.0/gump_work/build_portals-pluto-1.0_portals-pluto-portal-1.0.html
Work Name: build_portals-pluto-1.0_portals-pluto-portal-1.0 (Type: Build)
Work ended in a state of : Failed
Elapsed: 5 secs
Command Line: /usr/lib/jvm/java-1.5.0-sun/bin/java -Djava.awt.headless=true -Xbootclasspath/p:/srv/gump/public/workspace/xml-commons/java/external/build/xml-apis.jar:/srv/gump/public/workspace/xml-xerces2/build/xercesImpl.jar org.apache.tools.ant.Main -Dgump.merge=/srv/gump/public/gump/work/merge.xml -Dbuild.sysclasspath=only -Denv.ANT_HOME=/srv/gump/public/workspace/ant/dist -Dversion=19012008 -Dfinal.portal.name=pluto-portal-impl-19012008 all 
[Working Directory: /srv/gump/public/workspace/portals-pluto-1.0]
CLASSPATH: /usr/lib/jvm/java-1.5.0-sun/lib/tools.jar:/srv/gump/public/workspace/portals-pluto-1.0/build/ant/lib/ForeachTask.jar:/srv/gump/public/workspace/ant/dist/lib/ant-jmf.jar:/srv/gump/public/workspace/ant/dist/lib/ant-swing.jar:/srv/gump/public/workspace/ant/dist/lib/ant-apache-resolver.jar:/srv/gump/public/workspace/ant/dist/lib/ant-trax.jar:/srv/gump/public/workspace/ant/dist/lib/ant-junit.jar:/srv/gump/public/workspace/ant/dist/lib/ant-launcher.jar:/srv/gump/public/workspace/ant/dist/lib/ant-nodeps.jar:/srv/gump/public/workspace/ant/dist/lib/ant.jar:/srv/gump/packages/junit3.8.1/junit.jar:/srv/gump/public/workspace/xml-commons/java/build/resolver.jar:/srv/gump/public/workspace/castor/dist/castor-19012008.jar:/srv/gump/public/workspace/castor/dist/castor-19012008-xml.jar:/srv/gump/public/workspace/apache-commons/fileupload/target/commons-fileupload-19012008.jar:/srv/gump/public/workspace/apache-commons/logging/target/commons-logging-19012008.jar:/srv/gump/public/works
 pace/apache-commons/logging/target/commons-logging-api-19012008.jar:/srv/gump/public/workspace/junit/dist/junit-19012008.jar:/srv/gump/public/workspace/jakarta-regexp/build/jakarta-regexp-19012008.jar:/srv/gump/public/workspace/jakarta-servletapi-5/jsr154/dist/lib/servlet-api.jar:/srv/gump/public/workspace/jakarta-servletapi-5/jsr152/dist/lib/jsp-api.jar:/srv/gump/public/workspace/portals-pluto-1.0/api/target/portlet-api-1.0.jar:/srv/gump/public/workspace/portals-pluto-1.0/container/target/pluto-1.0.jar:/srv/gump/public/workspace/portals-pluto-1.0/descriptors/target/pluto-descriptors-1.0.jar:/srv/gump/public/workspace/xml-commons/java/external/build/xml-apis-ext.jar
---------------------------------------------
    [javac]                                            ^
    [javac] /srv/gump/public/workspace/portals-pluto-1.0/portal/src/java/org/apache/pluto/portalImpl/core/PortalURL.java:179: warning: [deprecation] encode(java.lang.String) in java.net.URLEncoder has been deprecated
    [javac]         value = URLEncoder.encode(value);
    [javac]                           ^
    [javac] /srv/gump/public/workspace/portals-pluto-1.0/portal/src/java/org/apache/pluto/portalImpl/services/portletdefinitionregistry/PortletDefinitionRegistryServiceContextImpl.java:113: exception java.io.IOException is never thrown in body of corresponding try statement
    [javac]         } catch (IOException e) {
    [javac]           ^
    [javac] /srv/gump/public/workspace/portals-pluto-1.0/portal/src/java/org/apache/pluto/portalImpl/services/portletdefinitionregistry/PortletDefinitionRegistryServiceContextImpl.java:115: exception org.exolab.castor.mapping.MappingException is never thrown in body of corresponding try statement
    [javac]         } catch (MappingException e) {
    [javac]           ^
    [javac] /srv/gump/public/workspace/portals-pluto-1.0/portal/src/java/org/apache/pluto/portalImpl/servlet/ServletRequestImpl.java:32: warning: [deprecation] getRealPath(java.lang.String) in javax.servlet.ServletRequest has been deprecated
    [javac] public class ServletRequestImpl extends javax.servlet.http.HttpServletRequestWrapper 
    [javac]        ^
    [javac] /srv/gump/public/workspace/portals-pluto-1.0/portal/src/java/org/apache/pluto/portalImpl/servlet/ServletRequestImpl.java:32: warning: [deprecation] isRequestedSessionIdFromUrl() in javax.servlet.http.HttpServletRequest has been deprecated
    [javac] public class ServletRequestImpl extends javax.servlet.http.HttpServletRequestWrapper 
    [javac]        ^
    [javac] /srv/gump/public/workspace/portals-pluto-1.0/portal/src/java/org/apache/pluto/portalImpl/servlet/ServletRequestImpl.java:32: warning: [deprecation] getRealPath(java.lang.String) in javax.servlet.ServletRequest has been deprecated
    [javac] public class ServletRequestImpl extends javax.servlet.http.HttpServletRequestWrapper 
    [javac]        ^
    [javac] /srv/gump/public/workspace/portals-pluto-1.0/portal/src/java/org/apache/pluto/portalImpl/servlet/ServletResponseImpl.java:24: warning: [deprecation] setStatus(int,java.lang.String) in javax.servlet.http.HttpServletResponse has been deprecated
    [javac] public class ServletResponseImpl extends javax.servlet.http.HttpServletResponseWrapper 
    [javac]        ^
    [javac] /srv/gump/public/workspace/portals-pluto-1.0/portal/src/java/org/apache/pluto/portalImpl/servlet/ServletResponseImpl.java:24: warning: [deprecation] encodeRedirectUrl(java.lang.String) in javax.servlet.http.HttpServletResponse has been deprecated
    [javac] public class ServletResponseImpl extends javax.servlet.http.HttpServletResponseWrapper 
    [javac]        ^
    [javac] /srv/gump/public/workspace/portals-pluto-1.0/portal/src/java/org/apache/pluto/portalImpl/servlet/ServletResponseImpl.java:24: warning: [deprecation] encodeUrl(java.lang.String) in javax.servlet.http.HttpServletResponse has been deprecated
    [javac] public class ServletResponseImpl extends javax.servlet.http.HttpServletResponseWrapper 
    [javac]        ^
    [javac] /srv/gump/public/workspace/portals-pluto-1.0/portal/src/java/org/apache/pluto/portalImpl/servlet/StoredServletResponseImpl.java:27: warning: [deprecation] setStatus(int,java.lang.String) in javax.servlet.http.HttpServletResponse has been deprecated
    [javac] public class StoredServletResponseImpl extends ServletResponseImpl 
    [javac]        ^
    [javac] /srv/gump/public/workspace/portals-pluto-1.0/portal/src/java/org/apache/pluto/portalImpl/servlet/StoredServletResponseImpl.java:27: warning: [deprecation] encodeRedirectUrl(java.lang.String) in javax.servlet.http.HttpServletResponse has been deprecated
    [javac] public class StoredServletResponseImpl extends ServletResponseImpl 
    [javac]        ^
    [javac] /srv/gump/public/workspace/portals-pluto-1.0/portal/src/java/org/apache/pluto/portalImpl/servlet/StoredServletResponseImpl.java:27: warning: [deprecation] encodeUrl(java.lang.String) in javax.servlet.http.HttpServletResponse has been deprecated
    [javac] public class StoredServletResponseImpl extends ServletResponseImpl 
    [javac]        ^
    [javac] /srv/gump/public/workspace/portals-pluto-1.0/portal/src/java/org/apache/pluto/portlet/admin/services/DeployWarService.java:165: warning: [deprecation] org.apache.pluto.portalImpl.Deploy in org.apache.pluto.portalImpl has been deprecated
    [javac] 		            org.apache.pluto.portalImpl.Deploy.main(args);
    [javac]                                                        ^
    [javac] Note: Some input files use unchecked or unsafe operations.
    [javac] Note: Recompile with -Xlint:unchecked for details.
    [javac] 2 errors
    [javac] 17 warnings

BUILD FAILED
/srv/gump/public/workspace/portals-pluto-1.0/build.xml:51: The following error occurred while executing this line:
/srv/gump/public/workspace/portals-pluto-1.0/portal/build.xml:50: Compile failed; see the compiler error output for details.

Total time: 4 seconds
---------------------------------------------

To subscribe to this information via syndicated feeds:
- RSS: http://vmgump.apache.org/gump/public/portals-pluto-1.0/portals-pluto-portal-1.0/rss.xml
- Atom: http://vmgump.apache.org/gump/public/portals-pluto-1.0/portals-pluto-portal-1.0/atom.xml

============================== Gump Tracking Only ===
Produced by Gump version 2.3.
Gump Run 11000019012008, vmgump:vmgump-public:11000019012008
Gump E-mail Identifier (unique within run) #30.

*********************************************************** G U M P
[GUMP@vmgump]: Module JacORB failed
To whom it may engage...
        
This is an automated request, but not an unsolicited one. For 
more information please visit http://gump.apache.org/nagged.html, 
and/or contact the folk at general@gump.apache.org.

Module JacORB has an issue affecting its community integration,
 and has been outstanding for 3 runs.
The current state of this module is 'Failed', with reason 'Update Failed'.

Full details are available at:
    http://vmgump.apache.org/gump/public/JacORB/index.html

That said, some information snippets are provided here.

The following annotations (debug/informational/warning/error messages) were provided:
 -INFO- Failed with reason update failed



The following work was performed:
http://vmgump.apache.org/gump/public/JacORB/gump_work/update_JacORB.html
Work Name: update_JacORB (Type: Update)
Work ended in a state of : Failed
Elapsed: 1 sec
Command Line: cvs -q -z3 -d :pserver:anonymous@www.jacorb.org:/cvsroot/jacorb checkout -P -d JacORB JacORB 
[Working Directory: /srv/gump/public/workspace/cvs]
---------------------------------------------
Fatal error, aborting.
cvsuser: no such user
---------------------------------------------

To subscribe to this information via syndicated feeds:
- RSS: http://vmgump.apache.org/gump/public/JacORB/rss.xml
- Atom: http://vmgump.apache.org/gump/public/JacORB/atom.xml

============================== Gump Tracking Only ===
Produced by Gump version 2.3.
Gump Run 11000019012008, vmgump:vmgump-public:11000019012008
Gump E-mail Identifier (unique within run) #31.

*********************************************************** G U M P
[GUMP@vmgump]: Project JacORB-idllib (in module JacORB) failed
To whom it may engage...
        
This is an automated request, but not an unsolicited one. For 
more information please visit http://gump.apache.org/nagged.html, 
and/or contact the folk at general@gump.apache.org.

Project JacORB-idllib has an issue affecting its community integration,
 and has been outstanding for 4 runs.
The current state of this project is 'Failed', with reason 'Update Failed'.

Full details are available at:
    http://vmgump.apache.org/gump/public/JacORB/JacORB-idllib/index.html

That said, some information snippets are provided here.

The following annotations (debug/informational/warning/error messages) were provided:
 -DEBUG- Sole output [idl.jar] identifier set to project name
 -INFO- Failed with reason update failed
 -INFO- Failed to extract fallback artifacts from Gump Repository

To subscribe to this information via syndicated feeds:
- RSS: http://vmgump.apache.org/gump/public/JacORB/JacORB-idllib/rss.xml
- Atom: http://vmgump.apache.org/gump/public/JacORB/JacORB-idllib/atom.xml

============================== Gump Tracking Only ===
Produced by Gump version 2.3.
Gump Run 11000019012008, vmgump:vmgump-public:11000019012008
Gump E-mail Identifier (unique within run) #32.

*********************************************************** G U M P
[GUMP@vmgump]: Project xml-security-tests (in module xml-security) failed
To whom it may engage...
        
This is an automated request, but not an unsolicited one. For 
more information please visit http://gump.apache.org/nagged.html, 
and/or contact the folk at general@gump.apache.org.

Project xml-security-tests has an issue affecting its community integration.
This issue affects 1 projects,
 and has been outstanding for 4 runs.
The current state of this project is 'Failed', with reason 'Build Failed'.
For reference only, the following projects are affected by this:
    - xml-security-tests :  XML-Signature Syntax and Processing


Full details are available at:
    http://vmgump.apache.org/gump/public/xml-security/xml-security-tests/index.html

That said, some information snippets are provided here.

The following annotations (debug/informational/warning/error messages) were provided:
 -DEBUG- Dependency on jce exists, no need to add for property lib.jce.
 -INFO- Failed with reason build failed



The following work was performed:
http://vmgump.apache.org/gump/public/xml-security/xml-security-tests/gump_work/build_xml-security_xml-security-tests.html
Work Name: build_xml-security_xml-security-tests (Type: Build)
Work ended in a state of : Failed
Elapsed: 4 mins 18 secs
Command Line: /usr/lib/jvm/java-1.5.0-sun/bin/java -Djava.awt.headless=true -Dant.build.clonevm=true -Xbootclasspath/p:/srv/gump/public/workspace/xml-commons/java/external/build/xml-apis.jar:/srv/gump/public/workspace/xml-xerces2/build/xercesImpl.jar:/srv/gump/public/workspace/xml-xalan/build/serializer.jar:/srv/gump/public/workspace/xml-xalan/build/xalan-unbundled.jar org.apache.tools.ant.Main -Dgump.merge=/srv/gump/public/gump/work/merge.xml -Dbuild.sysclasspath=only -Djce.download.sha1=c1f0e975e8c8e0a0105787b249a50615b485d109 -Dlib.jce=/srv/gump/packages/jce/jce-jdk13-116.jar -Djce.download.md5=85c64cd754719a4bc8da7e9aa0e113fd test 
[Working Directory: /srv/gump/public/workspace/xml-security]
CLASSPATH: /usr/lib/jvm/java-1.5.0-sun/lib/tools.jar:/srv/gump/public/workspace/xml-security/build/test:/srv/gump/public/workspace/xml-security:/srv/gump/public/workspace/xml-security/build/xmlsec-19012008.jar:/srv/gump/public/workspace/ant/dist/lib/ant-jmf.jar:/srv/gump/public/workspace/ant/dist/lib/ant-swing.jar:/srv/gump/public/workspace/ant/dist/lib/ant-apache-resolver.jar:/srv/gump/public/workspace/ant/dist/lib/ant-trax.jar:/srv/gump/public/workspace/ant/dist/lib/ant-junit.jar:/srv/gump/public/workspace/ant/dist/lib/ant-launcher.jar:/srv/gump/public/workspace/ant/dist/lib/ant-nodeps.jar:/srv/gump/public/workspace/ant/dist/lib/ant.jar:/srv/gump/packages/junit3.8.1/junit.jar:/srv/gump/public/workspace/xml-commons/java/build/resolver.jar:/srv/gump/public/workspace/xml-commons/java/external/build/xml-apis-ext.jar:/srv/gump/packages/jce/jce-jdk13-116.jar:/srv/gump/public/workspace/apache-commons/logging/target/commons-logging-19012008.jar:/srv/gump/public/workspace/apache-com
 mons/logging/target/commons-logging-api-19012008.jar:/srv/gump/public/workspace/junit/dist/junit-19012008.jar
---------------------------------------------
    [junit] Testcase: testBug40783 took 0.008 sec
    [junit] Running org.apache.xml.security.test.utils.Base64Test
    [junit] Testsuite: org.apache.xml.security.test.utils.Base64Test
    [junit] Tests run: 3, Failures: 0, Errors: 0, Time elapsed: 0.075 sec
    [junit] Tests run: 3, Failures: 0, Errors: 0, Time elapsed: 0.075 sec
    [junit] 
    [junit] Testcase: testA1 took 0.005 sec
    [junit] Testcase: testWrap1 took 0.002 sec
    [junit] Testcase: testWrap2 took 0.001 sec
    [junit] Running org.apache.xml.security.test.utils.IdResolverTest
    [junit] Testsuite: org.apache.xml.security.test.utils.IdResolverTest
    [junit] Tests run: 3, Failures: 0, Errors: 0, Time elapsed: 0.309 sec
    [junit] Tests run: 3, Failures: 0, Errors: 0, Time elapsed: 0.309 sec
    [junit] 
    [junit] Testcase: testIdSoap took 0.075 sec
    [junit] Testcase: testIdWithOtherIdSoap took 0.007 sec
    [junit] Testcase: testANoId took 0.009 sec
    [junit] Running org.apache.xml.security.test.utils.OldApiTest
    [junit] Testsuite: org.apache.xml.security.test.utils.OldApiTest
    [junit] Tests run: 4, Failures: 0, Errors: 0, Time elapsed: 0.517 sec
    [junit] Tests run: 4, Failures: 0, Errors: 0, Time elapsed: 0.517 sec
    [junit] 
    [junit] Testcase: testOldTransformSpiApi took 0.275 sec
    [junit] Testcase: testOldResourceResolverSpi took 0.005 sec
    [junit] Testcase: testOldKeyResolverSpi took 0.014 sec
    [junit] Testcase: testOldKeyResolverSpiInKeyInfo took 0.004 sec
    [junit] Running org.apache.xml.security.test.utils.resolver.AllTests
    [junit] Testsuite: org.apache.xml.security.test.utils.resolver.AllTests
    [junit] Tests run: 3, Failures: 0, Errors: 0, Time elapsed: 0.099 sec
    [junit] Tests run: 3, Failures: 0, Errors: 0, Time elapsed: 0.099 sec
    [junit] 
    [junit] Testcase: testCustomResolver took 0.022 sec
    [junit] Testcase: testLocalFileWithEmptyBaseURI took 0.007 sec
    [junit] Testcase: testBug40783 took 0.009 sec
    [junit] Running org.apache.xml.security.test.utils.resolver.ResourceResolverTest
    [junit] Testsuite: org.apache.xml.security.test.utils.resolver.ResourceResolverTest
    [junit] Tests run: 2, Failures: 0, Errors: 0, Time elapsed: 0.131 sec
    [junit] Tests run: 2, Failures: 0, Errors: 0, Time elapsed: 0.131 sec
    [junit] 
    [junit] Testcase: testCustomResolver took 0.024 sec
    [junit] Testcase: testLocalFileWithEmptyBaseURI took 0.004 sec
[junitreport] Processing /srv/gump/public/workspace/xml-security/build/docs/xml/junit/TESTS-TestSuites.xml to /tmp/null498177007
[junitreport] Loading stylesheet jar:file:/srv/gump/public/workspace/ant/dist/lib/ant-junit.jar!/org/apache/tools/ant/taskdefs/optional/junit/xsl/junit-frames.xsl
[junitreport] Transform time: 17325ms
[junitreport] Deleting: /tmp/null498177007

BUILD FAILED
/srv/gump/public/workspace/xml-security/build.xml:418: Unit Tests Failed

Total time: 4 minutes 17 seconds
---------------------------------------------

To subscribe to this information via syndicated feeds:
- RSS: http://vmgump.apache.org/gump/public/xml-security/xml-security-tests/rss.xml
- Atom: http://vmgump.apache.org/gump/public/xml-security/xml-security-tests/atom.xml

============================== Gump Tracking Only ===
Produced by Gump version 2.3.
Gump Run 11000019012008, vmgump:vmgump-public:11000019012008
Gump E-mail Identifier (unique within run) #33.

*********************************************************** G U M P
[GUMP@vmgump]: Project lenya (in module lenya) failed
To whom it may engage...
        
This is an automated request, but not an unsolicited one. For 
more information please visit http://gump.apache.org/nagged.html, 
and/or contact the folk at general@gump.apache.org.

Project lenya has an issue affecting its community integration.
This issue affects 1 projects,
 and has been outstanding for 1375 runs.
The current state of this project is 'Failed', with reason 'Configuration Failed'.
For reference only, the following projects are affected by this:
    - lenya :  Content Management System


Full details are available at:
    http://vmgump.apache.org/gump/public/lenya/lenya/index.html

That said, some information snippets are provided here.

The following annotations (debug/informational/warning/error messages) were provided:
 -INFO- Failed with reason configuration failed
 -ERROR- Bad Dependency. Project: cocoon : unknown to *this* workspace 
 -ERROR- Bad Dependency. Project: cocoon-block-naming : unknown to *this* workspace 
 -ERROR- Bad Dependency. Project: cocoon-block-html : unknown to *this* workspace 
 -ERROR- Bad Dependency. Project: cocoon-block-lucene : unknown to *this* workspace 
 -ERROR- Bad Dependency. Project: cocoon-block-linkrewriter : unknown to *this* workspace 
 -ERROR- Bad Dependency. Project: cocoon-block-proxy : unknown to *this* workspace 
 -ERROR- Bad Dependency. Project: cocoon-block-forms : unknown to *this* workspace 
 -ERROR- Bad Dependency. Project: cocoon-block-xsp : unknown to *this* workspace 
 -ERROR- Bad Dependency. Project: cocoon-block-session-fw : unknown to *this* workspace 

To subscribe to this information via syndicated feeds:
- RSS: http://vmgump.apache.org/gump/public/lenya/lenya/rss.xml
- Atom: http://vmgump.apache.org/gump/public/lenya/lenya/atom.xml

============================== Gump Tracking Only ===
Produced by Gump version 2.3.
Gump Run 11000019012008, vmgump:vmgump-public:11000019012008
Gump E-mail Identifier (unique within run) #35.

*********************************************************** G U M P
[GUMP@vmgump]: Project portals-bridges-velocity (in module portals-bridges) failed
To whom it may engage...
        
This is an automated request, but not an unsolicited one. For 
more information please visit http://gump.apache.org/nagged.html, 
and/or contact the folk at general@gump.apache.org.

Project portals-bridges-velocity has an issue affecting its community integration.
This issue affects 2 projects,
 and has been outstanding for 4 runs.
The current state of this project is 'Failed', with reason 'Build Failed'.
For reference only, the following projects are affected by this:
    - portals-bridges-frameworks :  Support for JSR168 compliant Portlet development
    - portals-bridges-velocity :  Support for JSR168 compliant Portlet development


Full details are available at:
    http://vmgump.apache.org/gump/public/portals-bridges/portals-bridges-velocity/index.html

That said, some information snippets are provided here.

The following annotations (debug/informational/warning/error messages) were provided:
 -DEBUG- Sole output [portals-bridges-velocity-19012008.jar] identifier set to project name
 -DEBUG- Dependency on portals-pluto-api-1.0 exists, no need to add for property maven.jar.portlet-api.
 -DEBUG- Dependency on jakarta-servletapi-5-servlet exists, no need to add for property maven.jar.servletapi.
 -DEBUG- (Gump generated) Maven Properties in: /srv/gump/public/workspace/portals-bridges/velocity/build.properties
 -INFO- Failed with reason build failed
 -DEBUG- Maven POM in: /srv/gump/public/workspace/portals-bridges/velocity/project.xml
 -DEBUG- Maven project properties in: /srv/gump/public/workspace/portals-bridges/velocity/project.properties
 -INFO- Failed to extract fallback artifacts from Gump Repository



The following work was performed:
http://vmgump.apache.org/gump/public/portals-bridges/portals-bridges-velocity/gump_work/build_portals-bridges_portals-bridges-velocity.html
Work Name: build_portals-bridges_portals-bridges-velocity (Type: Build)
Work ended in a state of : Failed
Elapsed: 6 secs
Command Line: maven --offline jar 
[Working Directory: /srv/gump/public/workspace/portals-bridges/velocity]
CLASSPATH: /usr/lib/jvm/java-1.5.0-sun/lib/tools.jar:/srv/gump/public/workspace/jakarta-servletapi-5/jsr154/dist/lib/servlet-api.jar:/srv/gump/public/workspace/portals-bridges/common/target/portals-bridges-common-19012008.jar:/srv/gump/public/workspace/portals-pluto-1.0/api/target/portlet-api-1.0.jar:/srv/gump/public/workspace/velocity-engine/bin/velocity-19012008.jar:/srv/gump/public/workspace/velocity-tools/dist/velocity-tools-19012008.jar
---------------------------------------------
 __  __
|  \/  |__ _Apache__ ___
| |\/| / _` \ V / -_) ' \  ~ intelligent projects ~
|_|  |_\__,_|\_/\___|_||_|  v. 1.0.2

build:start:

java:prepare-filesystem:
    [mkdir] Created dir: /srv/gump/public/workspace/portals-bridges/velocity/target/classes

java:compile:
    [echo] Compiling to /srv/gump/public/workspace/portals-bridges/velocity/target/classes
    [javac] Compiling 3 source files to /srv/gump/public/workspace/portals-bridges/velocity/target/classes
    [javac] /srv/gump/public/workspace/portals-bridges/velocity/src/java/org/apache/portals/bridges/velocity/BridgesVelocityViewServlet.java:35: warning: [deprecation] org.apache.velocity.tools.view.servlet.VelocityViewServlet in org.apache.velocity.tools.view.servlet has been deprecated
    [javac] import org.apache.velocity.tools.view.servlet.VelocityViewServlet;
    [javac]                                               ^
    [javac] /srv/gump/public/workspace/portals-bridges/velocity/src/java/org/apache/portals/bridges/velocity/BridgesVelocityViewServlet.java:42: warning: [deprecation] org.apache.velocity.tools.view.servlet.VelocityViewServlet in org.apache.velocity.tools.view.servlet has been deprecated
    [javac] public class BridgesVelocityViewServlet extends VelocityViewServlet
    [javac]                                                 ^
    [javac] /srv/gump/public/workspace/portals-bridges/velocity/src/java/org/apache/portals/bridges/velocity/BridgesVelocityViewServlet.java:58: warning: [deprecation] handleRequest(javax.servlet.http.HttpServletRequest,javax.servlet.http.HttpServletResponse,org.apache.velocity.context.Context) in org.apache.velocity.tools.view.VelocityViewServlet has been deprecated
    [javac]     protected Template handleRequest(HttpServletRequest request, HttpServletResponse response, Context ctx) throws Exception
    [javac]                        ^
    [javac] /srv/gump/public/workspace/portals-bridges/velocity/src/java/org/apache/portals/bridges/velocity/BridgesVelocityViewServlet.java:86: warning: [deprecation] handleRequest(javax.servlet.http.HttpServletRequest,javax.servlet.http.HttpServletResponse,org.apache.velocity.context.Context) in org.apache.velocity.tools.view.VelocityViewServlet has been deprecated
    [javac]         return super.handleRequest(request, response, ctx);
    [javac]                     ^
    [javac] /srv/gump/public/workspace/portals-bridges/velocity/src/java/org/apache/portals/bridges/velocity/BridgesVelocityViewServlet.java:92: mergeTemplate(org.apache.velocity.Template,org.apache.velocity.context.Context,javax.servlet.http.HttpServletResponse) in org.apache.portals.bridges.velocity.BridgesVelocityViewServlet cannot override mergeTemplate(org.apache.velocity.Template,org.apache.velocity.context.Context,javax.servlet.http.HttpServletResponse) in org.apache.velocity.tools.view.VelocityViewServlet; overridden method does not throw java.lang.Exception
    [javac]     protected void mergeTemplate(Template template, Context context, HttpServletResponse response)
    [javac]                    ^
    [javac] 1 error
    [javac] 4 warnings

BUILD FAILED
File...... /home/gump/.maven/cache/maven-java-plugin-1.5/plugin.jelly
Element... ant:javac
Line...... 63
Column.... 48
Compile failed; see the compiler error output for details.
Total time: 6 seconds
Finished at: Sat Jan 19 03:28:50 GMT-08:00 2008

---------------------------------------------

To subscribe to this information via syndicated feeds:
- RSS: http://vmgump.apache.org/gump/public/portals-bridges/portals-bridges-velocity/rss.xml
- Atom: http://vmgump.apache.org/gump/public/portals-bridges/portals-bridges-velocity/atom.xml

============================== Gump Tracking Only ===
Produced by Gump version 2.3.
Gump Run 11000019012008, vmgump:vmgump-public:11000019012008
Gump E-mail Identifier (unique within run) #36.


--
Apache Gump
http://gump.apache.org/ [Instance: vmgump]

---------------------------------------------------------------------
To unsubscribe, e-mail: general-unsubscribe@gump.apache.org
For additional commands, e-mail: general-help@gump.apache.org


Mime
View raw message