gump-general mailing list archives

Site index · List index
Message view « Date » · « Thread »
Top « Date » · « Thread »
From g...@vmgump.apache.org
Subject BATCH: All dressed up, with nowhere to go...
Date Fri, 09 Jul 2010 02:18:53 GMT
Dear Gumpmeisters,
            
The following 3 notifys should have been sent

*********************************************************** G U M P
[GUMP@vmgump]: Project testng (in module testng) failed
[GUMP@vmgump]: Project cocoon-rest (in module cocoon3) failed
[GUMP@vmgump]: Project apacheds-protocol-ldap (in module apacheds) failed
*********************************************************** G U M P
[GUMP@vmgump]: Project testng (in module testng) failed
To whom it may engage...
        
This is an automated request, but not an unsolicited one. For 
more information please visit http://gump.apache.org/nagged.html, 
and/or contact the folk at general@gump.apache.org.

Project testng has an issue affecting its community integration.
This issue affects 3 projects.
The current state of this project is 'Failed', with reason 'Build Failed'.
For reference only, the following projects are affected by this:
    - jakarta-turbine-jcs :  Cache
    - jgroups :  A Reliable Multicast Communication Toolkit for Java
    - testng :  Java Unit test framework


Full details are available at:
    http://vmgump.apache.org/gump/public/testng/testng/index.html

That said, some information snippets are provided here.

The following annotations (debug/informational/warning/error messages) were provided:
 -DEBUG- Sole jar output [testng-08072010.jar] identifier set to project name
 -INFO- Failed with reason build failed
 -DEBUG- Extracted fallback artifacts from Gump Repository



The following work was performed:
http://vmgump.apache.org/gump/public/testng/testng/gump_work/build_testng_testng.html
Work Name: build_testng_testng (Type: Build)
Work ended in a state of : Failed
Elapsed: 17 secs
Command Line: /usr/lib/jvm/java-6-sun/bin/java -Djava.awt.headless=true -Xbootclasspath/p:/srv/gump/public/workspace/xml-commons/java/external/build/xml-apis.jar:/srv/gump/public/workspace/xml-xerces2/build/xercesImpl.jar
org.apache.tools.ant.Main -Dgump.merge=/srv/gump/public/gump/work/merge.xml -Dbuild.sysclasspath=only
-Dtestng.version=08072010 build 
[Working Directory: /srv/gump/public/workspace/testng]
CLASSPATH: /usr/lib/jvm/java-6-sun/lib/tools.jar:/srv/gump/public/workspace/testng/lib/DTDDoc.jar:/srv/gump/public/workspace/testng/lib/guice-2.0.jar:/srv/gump/public/workspace/ant/dist/lib/ant.jar:/srv/gump/public/workspace/ant/dist/lib/ant-launcher.jar:/srv/gump/public/workspace/ant/dist/lib/ant-jmf.jar:/srv/gump/public/workspace/ant/dist/lib/ant-junit.jar:/srv/gump/public/workspace/ant/dist/lib/ant-swing.jar:/srv/gump/public/workspace/ant/dist/lib/ant-apache-resolver.jar:/srv/gump/public/workspace/ant/dist/lib/ant-apache-xalan2.jar:/srv/gump/packages/bsh-2.0b4/bsh-2.0b4.jar:/srv/gump/packages/bsh-2.0b4/bsh-bsf-2.0b4.jar:/srv/gump/packages/bsh-2.0b4/bsh-classpath-2.0b4.jar:/srv/gump/packages/bsh-2.0b4/bsh-commands-2.0b4.jar:/srv/gump/packages/bsh-2.0b4/bsh-core-2.0b4.jar:/srv/gump/packages/bsh-2.0b4/bsh-reflect-2.0b4.jar:/srv/gump/packages/bsh-2.0b4/bsh-util-2.0b4.jar:/srv/gump/public/workspace/ivy/build/artifact/jars/ivy-08072010.jar:/srv/gump/packages/qdox-1.6.3/qdox-1.6.
 3.jar:/srv/gump/public/workspace/xml-commons/java/external/build/xml-apis-ext.jar:/srv/gump/public/workspace/junit/dist/junit-08072010.jar:/srv/gump/public/workspace/xml-fop/lib/build/backport-util-concurrent-3.1.jar
---------------------------------------------
    [javac] /srv/gump/public/workspace/testng/src/org/testng/TestRunner.java:175: cannot find
symbol
    [javac] symbol  : class PreserveOrderMethodInterceptor
    [javac] location: class org.testng.TestRunner
    [javac]     m_methodInterceptor = test.getPreserveOrder() ? new PreserveOrderMethodInterceptor()
    [javac]                                                         ^
    [javac] /srv/gump/public/workspace/testng/src/org/testng/TestRunner.java:176: cannot find
symbol
    [javac] symbol  : class InstanceOrderingMethodInterceptor
    [javac] location: class org.testng.TestRunner
    [javac]         : new InstanceOrderingMethodInterceptor();
    [javac]               ^
    [javac] /srv/gump/public/workspace/testng/src/org/testng/TestRunner.java:351: cannot find
symbol
    [javac] symbol  : class ClassInfoMap
    [javac] location: class org.testng.TestRunner
    [javac]     ClassInfoMap classMap = new ClassInfoMap(m_testClassesFromXml);
    [javac]     ^
    [javac] /srv/gump/public/workspace/testng/src/org/testng/TestRunner.java:351: cannot find
symbol
    [javac] symbol  : class ClassInfoMap
    [javac] location: class org.testng.TestRunner
    [javac]     ClassInfoMap classMap = new ClassInfoMap(m_testClassesFromXml);
    [javac]                                 ^
    [javac] /srv/gump/public/workspace/testng/src/org/testng/TestRunner.java:587: cannot find
symbol
    [javac] symbol  : class ClassInfoMap
    [javac] location: class org.testng.TestRunner
    [javac]     ClassInfoMap cim = new ClassInfoMap(m_testClassesFromXml);
    [javac]     ^
    [javac] /srv/gump/public/workspace/testng/src/org/testng/TestRunner.java:587: cannot find
symbol
    [javac] symbol  : class ClassInfoMap
    [javac] location: class org.testng.TestRunner
    [javac]     ClassInfoMap cim = new ClassInfoMap(m_testClassesFromXml);
    [javac]                            ^
    [javac] /srv/gump/public/workspace/testng/src/org/testng/internal/TestNGClassFinder.java:134:
cannot find symbol
    [javac] symbol  : class ClassInfoMap
    [javac] location: class org.testng.internal.TestNGClassFinder
    [javac]             ClassInfoMap moreClasses = new ClassInfoMap();
    [javac]             ^
    [javac] /srv/gump/public/workspace/testng/src/org/testng/internal/TestNGClassFinder.java:134:
cannot find symbol
    [javac] symbol  : class ClassInfoMap
    [javac] location: class org.testng.internal.TestNGClassFinder
    [javac]             ClassInfoMap moreClasses = new ClassInfoMap();
    [javac]                                            ^
    [javac] Note: Some input files use or override a deprecated API.
    [javac] Note: Recompile with -Xlint:deprecation for details.
    [javac] Note: Some input files use unchecked or unsafe operations.
    [javac] Note: Recompile with -Xlint:unchecked for details.
    [javac] 10 errors

BUILD FAILED
/srv/gump/public/workspace/testng/build.xml:96: Compile failed; see the compiler error output
for details.

Total time: 17 seconds
---------------------------------------------

To subscribe to this information via syndicated feeds:
- RSS: http://vmgump.apache.org/gump/public/testng/testng/rss.xml
- Atom: http://vmgump.apache.org/gump/public/testng/testng/atom.xml

============================== Gump Tracking Only ===
Produced by Gump version 2.3.
Gump Run 07001608072010, vmgump:vmgump-public:07001608072010
Gump E-mail Identifier (unique within run) #1.

*********************************************************** G U M P
[GUMP@vmgump]: Project cocoon-rest (in module cocoon3) failed
To whom it may engage...
        
This is an automated request, but not an unsolicited one. For 
more information please visit http://gump.apache.org/nagged.html, 
and/or contact the folk at general@gump.apache.org.

Project cocoon-rest has an issue affecting its community integration.
This issue affects 3 projects.
The current state of this project is 'Failed', with reason 'Build Failed'.
For reference only, the following projects are affected by this:
    - cocoon-all :  Java XML Framework
    - cocoon-profiling :  Java XML Framework
    - cocoon-rest :  Java XML Framework


Full details are available at:
    http://vmgump.apache.org/gump/public/cocoon3/cocoon-rest/index.html

That said, some information snippets are provided here.

The following annotations (debug/informational/warning/error messages) were provided:
 -DEBUG- Sole jar output [cocoon-rest-*[0-9T].jar] identifier set to project name
 -INFO- Optional dependency jersey-reactor failed with reason build failed
 -DEBUG- (Gump generated) Maven2 Settings in: /srv/gump/public/workspace/cocoon3/cocoon-rest/gump_mvn_settings.xml
 -INFO- Failed with reason build failed
 -DEBUG- Maven POM in: /srv/gump/public/workspace/cocoon3/cocoon-rest/pom.xml
 -DEBUG- Extracted fallback artifacts from Gump Repository



The following work was performed:
http://vmgump.apache.org/gump/public/cocoon3/cocoon-rest/gump_work/build_cocoon3_cocoon-rest.html
Work Name: build_cocoon3_cocoon-rest (Type: Build)
Work ended in a state of : Failed
Elapsed: 16 secs
Command Line: mvn --batch-mode --settings /srv/gump/public/workspace/cocoon3/cocoon-rest/gump_mvn_settings.xml
install 
[Working Directory: /srv/gump/public/workspace/cocoon3/cocoon-rest]
CLASSPATH: /usr/lib/jvm/java-6-sun/lib/tools.jar:/srv/gump/public/workspace/cocoon3/parent/pom.xml:/srv/gump/public/workspace/cocoon3/cocoon-controller/target/cocoon-controller-3.0.0-alpha-3-SNAPSHOT.jar:/srv/gump/public/workspace/cocoon3/cocoon-servlet/target/cocoon-servlet-3.0.0-alpha-3-SNAPSHOT.jar:/srv/gump/public/workspace/junit/dist/junit-08072010.jar
---------------------------------------------
Downloading: http://download.java.net/maven/2/asm/asm/3.1/asm-3.1.pom
[INFO] Unable to find resource 'asm:asm:pom:3.1' in repository m2.dev.java.net (http://download.java.net/maven/2)
Downloading: http://localhost:8192/maven2/asm/asm/3.1/asm-3.1.pom

Downloading: http://localhost:8192/maven/2/asm/asm-parent/3.1/asm-parent-3.1.pom
[INFO] Unable to find resource 'asm:asm-parent:pom:3.1' in repository maven2-repository.dev.java.net
(http://download.java.net/maven/2/)
Downloading: http://download.java.net/maven/glassfish/asm/asm-parent/3.1/asm-parent-3.1.pom
[INFO] Unable to find resource 'asm:asm-parent:pom:3.1' in repository glassfish-repository
(http://download.java.net/maven/glassfish)
Downloading: http://download.java.net/maven/1/asm/poms/asm-parent-3.1.pom
[INFO] Unable to find resource 'asm:asm-parent:pom:3.1' in repository m1.dev.java.net (http://download.java.net/maven/1)
Downloading: http://download.java.net/maven/2/asm/asm-parent/3.1/asm-parent-3.1.pom
[INFO] Unable to find resource 'asm:asm-parent:pom:3.1' in repository m2.dev.java.net (http://download.java.net/maven/2)
Downloading: http://localhost:8192/maven2/asm/asm-parent/3.1/asm-parent-3.1.pom

Downloading: http://localhost:8192/maven/2/javax/ws/rs/jsr311-api/1.0/jsr311-api-1.0.jar
Downloading: http://localhost:8192/maven/2/com/sun/jersey/jersey-core/1.0.3/jersey-core-1.0.3.jar
Downloading: http://localhost:8192/maven/2/asm/asm/3.1/asm-3.1.jar
42K downloaded  (asm-3.1.jar)
43K downloaded  (jsr311-api-1.0.jar)
266K downloaded  (jersey-core-1.0.3.jar)
Downloading: http://localhost:8192/maven/2/com/sun/jersey/jersey-server/1.0.3/jersey-server-1.0.3.jar
613K downloaded  (jersey-server-1.0.3.jar)
[INFO] [enforcer:enforce {execution: enforce-maven}]
[INFO] Setting property: classpath.resource.loader.class => 'org.codehaus.plexus.velocity.ContextClassLoaderResourceLoader'.
[INFO] Setting property: velocimacro.messages.on => 'false'.
[INFO] Setting property: resource.loader => 'classpath'.
[INFO] Setting property: resource.manager.logwhenfound => 'false'.
[INFO] [remote-resources:process {execution: default}]
[INFO] [resources:resources {execution: default-resources}]
[INFO] Using 'UTF-8' encoding to copy filtered resources.
[INFO] Copying 1 resource
[INFO] Copying 3 resources
[INFO] [compiler:compile {execution: default-compile}]
[INFO] Compiling 25 source files to /srv/gump/public/workspace/cocoon3/cocoon-rest/target/classes
[INFO] ------------------------------------------------------------------------
[ERROR] BUILD FAILURE
[INFO] ------------------------------------------------------------------------
[INFO] Compilation failure
/srv/gump/public/workspace/cocoon3/cocoon-rest/src/main/java/org/apache/cocoon/rest/jaxrs/container/CocoonJAXRSServlet.java:[103,30]
cannot access com.sun.jersey.core.util.FeaturesAndProperties
class file for com.sun.jersey.core.util.FeaturesAndProperties not found
            if (ResourceConfig.isProviderClass(type)) {


[INFO] ------------------------------------------------------------------------
[INFO] For more information, run Maven with the -e switch
[INFO] ------------------------------------------------------------------------
[INFO] Total time: 14 seconds
[INFO] Finished at: Thu Jul 08 22:52:22 PDT 2010
[INFO] Final Memory: 30M/54M
[INFO] ------------------------------------------------------------------------
---------------------------------------------

To subscribe to this information via syndicated feeds:
- RSS: http://vmgump.apache.org/gump/public/cocoon3/cocoon-rest/rss.xml
- Atom: http://vmgump.apache.org/gump/public/cocoon3/cocoon-rest/atom.xml

============================== Gump Tracking Only ===
Produced by Gump version 2.3.
Gump Run 07001608072010, vmgump:vmgump-public:07001608072010
Gump E-mail Identifier (unique within run) #2.

*********************************************************** G U M P
[GUMP@vmgump]: Project apacheds-protocol-ldap (in module apacheds) failed
To whom it may engage...
        
This is an automated request, but not an unsolicited one. For 
more information please visit http://gump.apache.org/nagged.html, 
and/or contact the folk at general@gump.apache.org.

Project apacheds-protocol-ldap has an issue affecting its community integration.
This issue affects 11 projects.
The current state of this project is 'Failed', with reason 'Build Failed'.
For reference only, the following projects are affected by this:
    - apacheds-all :  Apache Directory Server
    - apacheds-core-integ :  Apache Directory Server
    - apacheds-core-integ-test :  Apache Directory Server
    - apacheds-protocol-ldap :  Apache Directory Server
    - apacheds-server-annotations :  Apache Directory Server
    - apacheds-server-annotations-test :  Apache Directory Server
    - apacheds-server-integ :  Apache Directory Server
    - apacheds-server-integ-test :  Apache Directory Server
    - apacheds-server-jndi :  Apache Directory Server
    - apacheds-server-tools :  Apache Directory Server
    - apacheds-test-framework :  Apache Directory Server


Full details are available at:
    http://vmgump.apache.org/gump/public/apacheds/apacheds-protocol-ldap/index.html

That said, some information snippets are provided here.

The following annotations (debug/informational/warning/error messages) were provided:
 -DEBUG- Sole jar output [apacheds-protocol-ldap-*[0-9T].jar] identifier set to project name
 -DEBUG- (Gump generated) Maven2 Settings in: /srv/gump/public/workspace/apacheds/protocol-ldap/gump_mvn_settings.xml
 -INFO- Failed with reason build failed
 -DEBUG- Maven POM in: /srv/gump/public/workspace/apacheds/protocol-ldap/pom.xml
 -INFO- Failed to extract fallback artifacts from Gump Repository



The following work was performed:
http://vmgump.apache.org/gump/public/apacheds/apacheds-protocol-ldap/gump_work/build_apacheds_apacheds-protocol-ldap.html
Work Name: build_apacheds_apacheds-protocol-ldap (Type: Build)
Work ended in a state of : Failed
Elapsed: 3 mins 32 secs
Command Line: mvn --batch-mode --settings /srv/gump/public/workspace/apacheds/protocol-ldap/gump_mvn_settings.xml
install 
[Working Directory: /srv/gump/public/workspace/apacheds/protocol-ldap]
CLASSPATH: /usr/lib/jvm/java-6-sun/lib/tools.jar:/srv/gump/public/workspace/apacheds/pom.xml:/srv/gump/public/workspace/apacheds/core-api/target/apacheds-core-api-1.5.8-SNAPSHOT.jar:/srv/gump/public/workspace/apacheds/protocol-shared/target/apacheds-protocol-shared-1.5.8-SNAPSHOT.jar:/srv/gump/public/workspace/apacheds/i18n/target/apacheds-i18n-1.5.8-SNAPSHOT.jar:/srv/gump/public/workspace/apacheds/kerberos-shared/target/apacheds-kerberos-shared-1.5.8-SNAPSHOT.jar:/srv/gump/public/workspace/apacheds/xdbm-tools/target/apacheds-xdbm-tools-1.5.8-SNAPSHOT.jar
---------------------------------------------
location: class org.apache.directory.server.ldap.LdapServer

/srv/gump/public/workspace/apacheds/protocol-ldap/src/main/java/org/apache/directory/server/ldap/handlers/bind/ntlm/NtlmSaslServer.java:[160,66]
cannot find symbol
symbol  : method getDirectoryService()
location: class org.apache.directory.server.ldap.LdapServer

/srv/gump/public/workspace/apacheds/protocol-ldap/src/main/java/org/apache/directory/server/ldap/handlers/bind/gssapi/GssapiMechanismHandler.java:[70,66]
cannot find symbol
symbol  : method getDirectoryService()
location: class org.apache.directory.server.ldap.LdapServer

/srv/gump/public/workspace/apacheds/protocol-ldap/src/main/java/org/apache/directory/server/ldap/handlers/bind/gssapi/GssapiMechanismHandler.java:[137,16]
cannot find symbol
symbol  : class ServiceConfigurationException
location: class org.apache.directory.server.ldap.handlers.bind.gssapi.GssapiMechanismHandler

/srv/gump/public/workspace/apacheds/protocol-ldap/src/main/java/org/apache/directory/server/ldap/handlers/bind/gssapi/GssapiMechanismHandler.java:[139,85]
cannot find symbol
symbol  : method getSearchBaseDn()
location: class org.apache.directory.server.ldap.LdapServer

/srv/gump/public/workspace/apacheds/protocol-ldap/src/main/java/org/apache/directory/server/ldap/handlers/bind/gssapi/GssapiMechanismHandler.java:[140,22]
cannot find symbol
symbol  : class ServiceConfigurationException
location: class org.apache.directory.server.ldap.handlers.bind.gssapi.GssapiMechanismHandler

/srv/gump/public/workspace/apacheds/protocol-ldap/src/main/java/org/apache/directory/server/ldap/handlers/bind/gssapi/GssapiMechanismHandler.java:[145,85]
cannot find symbol
symbol  : method getSearchBaseDn()
location: class org.apache.directory.server.ldap.LdapServer

/srv/gump/public/workspace/apacheds/protocol-ldap/src/main/java/org/apache/directory/server/ldap/handlers/bind/gssapi/GssapiMechanismHandler.java:[146,22]
cannot find symbol
symbol  : class ServiceConfigurationException
location: class org.apache.directory.server.ldap.handlers.bind.gssapi.GssapiMechanismHandler

/srv/gump/public/workspace/apacheds/protocol-ldap/src/main/java/org/apache/directory/server/ldap/handlers/bind/gssapi/GssapiMechanismHandler.java:[170,45]
cannot find symbol
symbol  : method getDirectoryService()
location: class org.apache.directory.server.ldap.LdapServer

/srv/gump/public/workspace/apacheds/protocol-ldap/src/main/java/org/apache/directory/server/ldap/handlers/bind/gssapi/GssapiMechanismHandler.java:[171,93]
cannot find symbol
symbol  : method getSearchBaseDn()
location: class org.apache.directory.server.ldap.LdapServer

/srv/gump/public/workspace/apacheds/protocol-ldap/src/main/java/org/apache/directory/server/ldap/handlers/bind/SimpleMechanismHandler.java:[69,66]
cannot find symbol
symbol  : method getDirectoryService()
location: class org.apache.directory.server.ldap.LdapServer


[INFO] ------------------------------------------------------------------------
[INFO] For more information, run Maven with the -e switch
[INFO] ------------------------------------------------------------------------
[INFO] Total time: 3 minutes 30 seconds
[INFO] Finished at: Fri Jul 09 01:20:45 PDT 2010
[INFO] Final Memory: 27M/48M
[INFO] ------------------------------------------------------------------------
---------------------------------------------

To subscribe to this information via syndicated feeds:
- RSS: http://vmgump.apache.org/gump/public/apacheds/apacheds-protocol-ldap/rss.xml
- Atom: http://vmgump.apache.org/gump/public/apacheds/apacheds-protocol-ldap/atom.xml

============================== Gump Tracking Only ===
Produced by Gump version 2.3.
Gump Run 07001608072010, vmgump:vmgump-public:07001608072010
Gump E-mail Identifier (unique within run) #3.


--
Apache Gump
http://gump.apache.org/ [Instance: vmgump]

---------------------------------------------------------------------
To unsubscribe, e-mail: general-unsubscribe@gump.apache.org
For additional commands, e-mail: general-help@gump.apache.org


Mime
View raw message