gump-general mailing list archives

Site index · List index
Message view « Date » · « Thread »
Top « Date » · « Thread »
From g...@vmgump.apache.org
Subject BATCH: All dressed up, with nowhere to go...
Date Mon, 20 Sep 2010 03:13:47 GMT
Dear Gumpmeisters,
            
The following 2 notifys should have been sent

*********************************************************** G U M P
[GUMP@vmgump]: Project castor-xml (in module castor) failed
[GUMP@vmgump]: Project castor-reactor (in module castor) failed
*********************************************************** G U M P
[GUMP@vmgump]: Project castor-xml (in module castor) failed
To whom it may engage...
        
This is an automated request, but not an unsolicited one. For 
more information please visit http://gump.apache.org/nagged.html, 
and/or contact the folk at general@gump.apache.org.

Project castor-xml has an issue affecting its community integration.
This issue affects 2 projects.
The current state of this project is 'Failed', with reason 'Build Failed'.
For reference only, the following projects are affected by this:
    - castor-xml :  Java to XML, SQL, LDAP bindings
    - castor-xml-test :  Java to XML, SQL, LDAP bindings


Full details are available at:
    http://vmgump.apache.org/gump/public/castor/castor-xml/index.html

That said, some information snippets are provided here.

The following annotations (debug/informational/warning/error messages) were provided:
 -DEBUG- Sole jar output [castor-xml-1.3.2-SNAPSHOT.jar] identifier set to project name
 -DEBUG- (Gump generated) Maven2 Settings in: /srv/gump/public/workspace/castor/xml/gump_mvn_settings.xml
 -INFO- Failed with reason build failed
 -DEBUG- Maven POM in: /srv/gump/public/workspace/castor/xml/pom.xml
 -INFO- Failed to extract fallback artifacts from Gump Repository



The following work was performed:
http://vmgump.apache.org/gump/public/castor/castor-xml/gump_work/build_castor_castor-xml.html
Work Name: build_castor_castor-xml (Type: Build)
Work ended in a state of : Failed
Elapsed: 5 secs
Command Line: mvn --batch-mode -DskipTests=true --settings /srv/gump/public/workspace/castor/xml/gump_mvn_settings.xml
package 
[Working Directory: /srv/gump/public/workspace/castor/xml]
---------------------------------------------
[INFO] Scanning for projects...
[INFO] ------------------------------------------------------------------------
[INFO] Building Castor XML - core
[INFO]    task-segment: [package]
[INFO] ------------------------------------------------------------------------
[INFO] snapshot org.codehaus.mojo:castor-maven-plugin:2.1-SNAPSHOT: checking for updates from
Maven Codehaus Snapshots
[WARNING] *** CHECKSUM FAILED - Checksum failed on download: local = '324ae2809e19be647aef59d83d556e393e032a12';
remote = '<!DOCTYPE' - RETRYING
[WARNING] *** CHECKSUM FAILED - Checksum failed on download: local = '324ae2809e19be647aef59d83d556e393e032a12';
remote = '<!DOCTYPE' - IGNORING
[INFO] snapshot org.codehaus.mojo:castor-maven-plugin:2.1-SNAPSHOT: checking for updates from
codehaus-snapshots
[WARNING] *** CHECKSUM FAILED - Checksum failed on download: local = '324ae2809e19be647aef59d83d556e393e032a12';
remote = '<!DOCTYPE' - RETRYING
[WARNING] *** CHECKSUM FAILED - Checksum failed on download: local = '324ae2809e19be647aef59d83d556e393e032a12';
remote = '<!DOCTYPE' - IGNORING
[INFO] ------------------------------------------------------------------------
[ERROR] BUILD ERROR
[INFO] ------------------------------------------------------------------------
[INFO] Error building POM (may not be this project's POM).


Project ID: org.codehaus.mojo:castor-maven-plugin

Reason: Error getting POM for 'org.codehaus.mojo:castor-maven-plugin' from the repository:
Unable to read local copy of metadata: Cannot read metadata from '/srv/gump/public/workspace/mvnlocalrepo/castor/org/codehaus/mojo/castor-maven-plugin/2.1-SNAPSHOT/maven-metadata-Maven
Codehaus Snapshots.xml': end tag name </body> must match start tag name <hr> from
line 7 (position: TEXT seen ...</address>\n</body>... @9:8) 
  org.codehaus.mojo:castor-maven-plugin:pom:2.1-SNAPSHOT


 for project org.codehaus.mojo:castor-maven-plugin


[INFO] ------------------------------------------------------------------------
[INFO] For more information, run Maven with the -e switch
[INFO] ------------------------------------------------------------------------
[INFO] Total time: 4 seconds
[INFO] Finished at: Sun Sep 19 23:19:35 UTC 2010
[INFO] Final Memory: 11M/27M
[INFO] ------------------------------------------------------------------------
---------------------------------------------

To subscribe to this information via syndicated feeds:
- RSS: http://vmgump.apache.org/gump/public/castor/castor-xml/rss.xml
- Atom: http://vmgump.apache.org/gump/public/castor/castor-xml/atom.xml

============================== Gump Tracking Only ===
Produced by Gump version 2.3.
Gump Run 06001819092010, vmgump.apache.org:vmgump:06001819092010
Gump E-mail Identifier (unique within run) #2.

*********************************************************** G U M P
[GUMP@vmgump]: Project castor-reactor (in module castor) failed
To whom it may engage...
        
This is an automated request, but not an unsolicited one. For 
more information please visit http://gump.apache.org/nagged.html, 
and/or contact the folk at general@gump.apache.org.

Project castor-reactor has an issue affecting its community integration.
This issue affects 22 projects.
The current state of this project is 'Failed', with reason 'Build Failed'.
For reference only, the following projects are affected by this:
    - castor :  Java to XML, SQL, LDAP bindings
    - castor-reactor :  Java to XML, SQL, LDAP bindings
    - castor-test :  Java to XML, SQL, LDAP bindings
    - commons-chain :  GoF "Chain of Responsibility" pattern
    - commons-fileupload :  Commons File Upload Package
    - fulcrum-intake :  Services Framework
    - fulcrum-parser :  Services Framework
    - fulcrum-upload :  Services Framework
    - jakarta-tomcat-4.0 :  Servlet 2.3 and JSP 1.2 Reference Implementation
    - jakarta-tomcat-catalina :  Servlet 2.4 Reference Implementation
    - jakarta-tomcat-coyote-tomcat4 :  Connectors to various web servers
    - jakarta-tomcat-jk :  Connectors to various web servers
    - portals-jetspeed-1 :  Enterprise Information Portal
    - portals-pluto-api-1.0 :  JSR168 Container
    - portals-pluto-container-1.0 :  JSR168 Container
    - portals-pluto-deploy-1.0 :  JSR168 Container
    - portals-pluto-descriptors-1.0 :  JSR168 Container
    - portals-pluto-portal-1.0 :  JSR168 Container
    - tomcat-catalina :  Servlet 2.3 and JSP 1.2 Reference Implementation
    - turbine-core :  A servlet based framework.
    - turbine-core-test :  A servlet based framework.
    - xml-xindice :  native XML database


Full details are available at:
    http://vmgump.apache.org/gump/public/castor/castor-reactor/index.html

That said, some information snippets are provided here.

The following annotations (debug/informational/warning/error messages) were provided:
 -INFO- Optional dependency castor-xml failed with reason build failed
 -DEBUG- (Gump generated) Maven2 Settings in: /srv/gump/public/workspace/castor/gump_mvn_settings.xml
 -INFO- Failed with reason build failed
 -DEBUG- Maven POM in: /srv/gump/public/workspace/castor/pom.xml



The following work was performed:
http://vmgump.apache.org/gump/public/castor/castor-reactor/gump_work/build_castor_castor-reactor.html
Work Name: build_castor_castor-reactor (Type: Build)
Work ended in a state of : Failed
Elapsed: 13 secs
Command Line: mvn --batch-mode -DskipTests=true --settings /srv/gump/public/workspace/castor/gump_mvn_settings.xml
package 
[Working Directory: /srv/gump/public/workspace/castor]
---------------------------------------------
[INFO] ------------------------------------------------------------------------
[INFO] [resources:resources {execution: default-resources}]
[INFO] Using 'UTF-8' encoding to copy filtered resources.
[INFO] Copying 4 resources
[INFO] [compiler:compile {execution: default-compile}]
[INFO] Nothing to compile - all classes are up to date
[INFO] [resources:testResources {execution: default-testResources}]
[INFO] Using 'UTF-8' encoding to copy filtered resources.
[INFO] Copying 0 resource
[INFO] [compiler:testCompile {execution: default-testCompile}]
[INFO] Nothing to compile - all classes are up to date
[INFO] [surefire:test {execution: default-test}]
[INFO] Tests are skipped.
[INFO] [jar:jar {execution: default-jar}]
[INFO] Preparing source:jar
[WARNING] Removing: jar from forked lifecycle, to prevent recursive invocation.
[INFO] No goals needed for project - skipping
[INFO] [source:jar {execution: default}]
[INFO] ------------------------------------------------------------------------
[INFO] Building Castor XML - core
[INFO]    task-segment: [package]
[INFO] ------------------------------------------------------------------------
[INFO] snapshot org.codehaus.mojo:castor-maven-plugin:2.1-SNAPSHOT: checking for updates from
Maven Codehaus Snapshots
[WARNING] *** CHECKSUM FAILED - Checksum failed on download: local = '324ae2809e19be647aef59d83d556e393e032a12';
remote = '<!DOCTYPE' - RETRYING
[WARNING] *** CHECKSUM FAILED - Checksum failed on download: local = '324ae2809e19be647aef59d83d556e393e032a12';
remote = '<!DOCTYPE' - IGNORING
[INFO] snapshot org.codehaus.mojo:castor-maven-plugin:2.1-SNAPSHOT: checking for updates from
codehaus-snapshots
[WARNING] *** CHECKSUM FAILED - Checksum failed on download: local = '324ae2809e19be647aef59d83d556e393e032a12';
remote = '<!DOCTYPE' - RETRYING
[WARNING] *** CHECKSUM FAILED - Checksum failed on download: local = '324ae2809e19be647aef59d83d556e393e032a12';
remote = '<!DOCTYPE' - IGNORING
[INFO] ------------------------------------------------------------------------
[ERROR] BUILD ERROR
[INFO] ------------------------------------------------------------------------
[INFO] Error building POM (may not be this project's POM).


Project ID: org.codehaus.mojo:castor-maven-plugin

Reason: Error getting POM for 'org.codehaus.mojo:castor-maven-plugin' from the repository:
Unable to read local copy of metadata: Cannot read metadata from '/srv/gump/public/workspace/mvnlocalrepo/shared/org/codehaus/mojo/castor-maven-plugin/2.1-SNAPSHOT/maven-metadata-Maven
Codehaus Snapshots.xml': end tag name </body> must match start tag name <hr> from
line 7 (position: TEXT seen ...</address>\n</body>... @9:8) 
  org.codehaus.mojo:castor-maven-plugin:pom:2.1-SNAPSHOT


 for project org.codehaus.mojo:castor-maven-plugin


[INFO] ------------------------------------------------------------------------
[INFO] For more information, run Maven with the -e switch
[INFO] ------------------------------------------------------------------------
[INFO] Total time: 12 seconds
[INFO] Finished at: Sun Sep 19 23:36:23 UTC 2010
[INFO] Final Memory: 36M/87M
[INFO] ------------------------------------------------------------------------
---------------------------------------------

To subscribe to this information via syndicated feeds:
- RSS: http://vmgump.apache.org/gump/public/castor/castor-reactor/rss.xml
- Atom: http://vmgump.apache.org/gump/public/castor/castor-reactor/atom.xml

============================== Gump Tracking Only ===
Produced by Gump version 2.3.
Gump Run 06001819092010, vmgump.apache.org:vmgump:06001819092010
Gump E-mail Identifier (unique within run) #3.


--
Apache Gump
http://gump.apache.org/ [Instance: vmgump]

---------------------------------------------------------------------
To unsubscribe, e-mail: general-unsubscribe@gump.apache.org
For additional commands, e-mail: general-help@gump.apache.org


Mime
View raw message