gump-general mailing list archives

Site index · List index
Message view « Date » · « Thread »
Top « Date » · « Thread »
From g...@vmgump.apache.org
Subject BATCH: All dressed up, with nowhere to go...
Date Mon, 02 Jul 2012 22:20:12 GMT
Dear Gumpmeisters,
            
The following 2 notifys should have been sent

*********************************************************** G U M P
[GUMP@vmgump]: Project apacheds-server-integ-test (in module apacheds) failed
[GUMP@vmgump]: Project camel-jms-test (in module camel) failed
*********************************************************** G U M P
[GUMP@vmgump]: Project apacheds-server-integ-test (in module apacheds) failed
To whom it may engage...
        
This is an automated request, but not an unsolicited one. For 
more information please visit http://gump.apache.org/nagged.html, 
and/or contact the folk at general@gump.apache.org.

Project apacheds-server-integ-test has an issue affecting its community integration.
This issue affects 1 projects.
The current state of this project is 'Failed', with reason 'Build Failed'.
For reference only, the following projects are affected by this:
    - apacheds-server-integ-test :  Apache Directory Server


Full details are available at:
    http://vmgump.apache.org/gump/public/apacheds/apacheds-server-integ-test/index.html

That said, some information snippets are provided here.

The following annotations (debug/informational/warning/error messages) were provided:
 -WARNING- Overriding Maven settings: [/srv/gump/public/workspace/apacheds/server-integ/gump_mvn_settings.xml]
 -DEBUG- (Apache Gump generated) Apache Maven Settings in: /srv/gump/public/workspace/apacheds/server-integ/gump_mvn_settings.xml
 -INFO- Failed with reason build failed
 -DEBUG- Maven POM in: /srv/gump/public/workspace/apacheds/server-integ/pom.xml



The following work was performed:
http://vmgump.apache.org/gump/public/apacheds/apacheds-server-integ-test/gump_work/build_apacheds_apacheds-server-integ-test.html
Work Name: build_apacheds_apacheds-server-integ-test (Type: Build)
Work ended in a state of : Failed
Elapsed: 15 mins 19 secs
Command Line: /opt/maven3/bin/mvn --batch-mode --settings /srv/gump/public/workspace/apacheds/server-integ/gump_mvn_settings.xml
package 
[Working Directory: /srv/gump/public/workspace/apacheds/server-integ]
M2_HOME: /opt/maven3
---------------------------------------------
  testSearchBadDN(org.apache.directory.server.operations.search.SearchIT): [LDAP: error code
54 - LOOP_DETECT: failed for MessageType : SEARCH_REQUEST(..)
  testSearchValue(org.apache.directory.server.operations.search.SearchIT): [LDAP: error code
54 - LOOP_DETECT: failed for MessageType : SEARCH_REQUEST(..)
  testSearchWithBackslashEscapedBase(org.apache.directory.server.operations.search.SearchIT):
[LDAP: error code 54 - LOOP_DETECT: failed for MessageType : SEARCH_REQUEST(..)
  testSearchOperationalAndUserAttributes(org.apache.directory.server.operations.search.SearchIT):
[LDAP: error code 54 - LOOP_DETECT: failed for MessageType : SEARCH_REQUEST(..)
  testSearchSubstringWithPlus(org.apache.directory.server.operations.search.SearchIT): [LDAP:
error code 54 - LOOP_DETECT: failed for MessageType : SEARCH_REQUEST(..)
  testSearchUsersAttrs(org.apache.directory.server.operations.search.SearchIT): [LDAP: error
code 54 - LOOP_DETECT: failed for MessageType : SEARCH_REQUEST(..)
  testSearchUserAttributes_EmptyAttrs(org.apache.directory.server.operations.search.SearchIT):
[LDAP: error code 54 - LOOP_DETECT: failed for MessageType : SEARCH_REQUEST(..)
  testSearchUserAttributes_Space(org.apache.directory.server.operations.search.SearchIT):
[LDAP: error code 54 - LOOP_DETECT: failed for MessageType : SEARCH_REQUEST(..)
  testSearchUserAttributes_NullAttrs(org.apache.directory.server.operations.search.SearchIT):
[LDAP: error code 54 - LOOP_DETECT: failed for MessageType : SEARCH_REQUEST(..)
  testMultiValuedRdnName(org.apache.directory.server.operations.search.SearchIT): [LDAP: error
code 54 - LOOP_DETECT: failed for MessageType : SEARCH_REQUEST(..)
  testMultiValuedRdnContent(org.apache.directory.server.operations.search.SearchIT): [LDAP:
error code 54 - LOOP_DETECT: failed for MessageType : SEARCH_REQUEST(..)
  testSearchComplexFilter(org.apache.directory.server.operations.search.SearchIT): [LDAP:
error code 54 - LOOP_DETECT: failed for MessageType : SEARCH_REQUEST(..)
  testSearchAttrCommonName(org.apache.directory.server.operations.search.SearchIT): [LDAP:
error code 54 - LOOP_DETECT: failed for MessageType : SEARCH_REQUEST(..)
  testSearchUserAttributes_1_1(org.apache.directory.server.operations.search.SearchIT): [LDAP:
error code 54 - LOOP_DETECT: failed for MessageType : SEARCH_REQUEST(..)
  testSearchUserAttributes(org.apache.directory.server.operations.search.SearchIT): [LDAP:
error code 54 - LOOP_DETECT: failed for MessageType : SEARCH_REQUEST(..)
  testSubstringSearchWithEscapedCharsInFilter(org.apache.directory.server.operations.search.SearchIT):
[LDAP: error code 54 - LOOP_DETECT: failed for MessageType : SEARCH_REQUEST(..)
  testSearchInvalidDN(org.apache.directory.server.operations.search.SearchIT): [LDAP: error
code 54 - LOOP_DETECT: failed for MessageType : SEARCH_REQUEST(..)
  testDirserver635(org.apache.directory.server.operations.search.SearchIT): [LDAP: error code
54 - LOOP_DETECT: failed for MessageType : SEARCH_REQUEST(..)
  testSearchOperationalAttrs(org.apache.directory.server.operations.search.SearchIT): [LDAP:
error code 54 - LOOP_DETECT: failed for MessageType : SEARCH_REQUEST(..)
  testAddWithObjectclasses(org.apache.directory.server.operations.search.SearchIT): [LDAP:
error code 54 - LOOP_DETECT: failed for MessageType : SEARCH_REQUEST(..)
  testSearchAttrCN(org.apache.directory.server.operations.search.SearchIT): [LDAP: error code
54 - LOOP_DETECT: failed for MessageType : SEARCH_REQUEST(..)
  testAddWithMissingObjectclasses(org.apache.directory.server.operations.search.SearchIT):
[LDAP: error code 54 - LOOP_DETECT: failed for MessageType : SEARCH_REQUEST(..)
  testSubentryControl(org.apache.directory.server.operations.search.SearchIT): [LDAP: error
code 54 - LOOP_DETECT: failed for MessageType : SEARCH_REQUEST(..)
  testSearchAttrName(org.apache.directory.server.operations.search.SearchIT): [LDAP: error
code 54 - LOOP_DETECT: failed for MessageType : SEARCH_REQUEST(..)
  testUndefinedAvaInBranchFilters(org.apache.directory.server.operations.search.SearchIT):
[LDAP: error code 54 - LOOP_DETECT: failed for MessageType : SEARCH_REQUEST(..)
  testUnicodeFilter_DIRSERVER_1347(org.apache.directory.server.operations.search.SearchIT):
[LDAP: error code 54 - LOOP_DETECT: failed for MessageType : SEARCH_REQUEST(..)
  org.apache.directory.server.operations.search.SearchIT: Action Context Not Null: browse
key
  org.apache.directory.server.operations.search.SearchLimitsIT: Action Context Not Null: browse
key
  org.apache.directory.server.ssl.LdapsIT: Action Context Not Null: browse key
  org.apache.directory.server.ssl.LdapsUpdateCertificateIT: Action Context Not Null: browse
key
  org.apache.directory.server.ssl.StartTlsConfidentialityIT: Action Context Not Null: browse
key
  org.apache.directory.server.ssl.StartTlsIT: Action Context Not Null: browse key
  org.apache.directory.server.ssl.StartTlsUpdateCertificateIT: Action Context Not Null: browse
key

Tests run: 5, Failures: 1, Errors: 3, Skipped: 1

[INFO] ------------------------------------------------------------------------
[INFO] BUILD FAILURE
[INFO] ------------------------------------------------------------------------
[INFO] Total time: 15:17.011s
[INFO] Finished at: Mon Jul 02 21:38:34 UTC 2012
[INFO] Final Memory: 16M/49M
[INFO] ------------------------------------------------------------------------
[ERROR] Failed to execute goal org.apache.maven.plugins:maven-surefire-plugin:2.12:test (default-test)
on project apacheds-server-integ: Failure or timeout -> [Help 1]
[ERROR] 
[ERROR] To see the full stack trace of the errors, re-run Maven with the -e switch.
[ERROR] Re-run Maven using the -X switch to enable full debug logging.
[ERROR] 
[ERROR] For more information about the errors and possible solutions, please read the following
articles:
[ERROR] [Help 1] http://cwiki.apache.org/confluence/display/MAVEN/MojoExecutionException
---------------------------------------------

To subscribe to this information via syndicated feeds:
- RSS: http://vmgump.apache.org/gump/public/apacheds/apacheds-server-integ-test/rss.xml
- Atom: http://vmgump.apache.org/gump/public/apacheds/apacheds-server-integ-test/atom.xml

============================== Gump Tracking Only ===
Produced by Apache Gump(TM) version 2.3.
Gump Run 06001202072012, vmgump.apache.org:vmgump:06001202072012
Gump E-mail Identifier (unique within run) #1.

*********************************************************** G U M P
[GUMP@vmgump]: Project camel-jms-test (in module camel) failed
To whom it may engage...
        
This is an automated request, but not an unsolicited one. For 
more information please visit http://gump.apache.org/nagged.html, 
and/or contact the folk at general@gump.apache.org.

Project camel-jms-test has an issue affecting its community integration.
This issue affects 1 projects.
The current state of this project is 'Failed', with reason 'Build Failed'.
For reference only, the following projects are affected by this:
    - camel-jms-test :  Integration framework based on known Enterprise Integration
...


Full details are available at:
    http://vmgump.apache.org/gump/public/camel/camel-jms-test/index.html

That said, some information snippets are provided here.

The following annotations (debug/informational/warning/error messages) were provided:
 -WARNING- Overriding Maven settings: [/srv/gump/public/workspace/camel/components/camel-jms/gump_mvn_settings.xml]
 -DEBUG- (Apache Gump generated) Apache Maven Settings in: /srv/gump/public/workspace/camel/components/camel-jms/gump_mvn_settings.xml
 -INFO- Failed with reason build failed
 -DEBUG- Maven POM in: /srv/gump/public/workspace/camel/components/camel-jms/pom.xml
 -INFO- Project Reports in: /srv/gump/public/workspace/camel/components/camel-jms/target/surefire-report
 -WARNING- No directory [/srv/gump/public/workspace/camel/components/camel-jms/target/surefire-report]



The following work was performed:
http://vmgump.apache.org/gump/public/camel/camel-jms-test/gump_work/build_camel_camel-jms-test.html
Work Name: build_camel_camel-jms-test (Type: Build)
Work ended in a state of : Failed
Elapsed: 21 mins 14 secs
Command Line: /opt/maven2/bin/mvn --batch-mode --settings /srv/gump/public/workspace/camel/components/camel-jms/gump_mvn_settings.xml
test 
[Working Directory: /srv/gump/public/workspace/camel/components/camel-jms]
M2_HOME: /opt/maven2
---------------------------------------------
Running org.apache.camel.component.jms.tx.JMXTXUseOriginalBodyWithTXErrorHandlerTest
Tests run: 2, Failures: 0, Errors: 0, Skipped: 0, Time elapsed: 7.763 sec
Running org.apache.camel.component.jms.tx.JmsToJmsTransactedSecurityTest
Tests run: 2, Failures: 0, Errors: 0, Skipped: 0, Time elapsed: 9.215 sec
Running org.apache.camel.component.jms.tx.JmsToJmsTransactedTest
Tests run: 4, Failures: 0, Errors: 0, Skipped: 0, Time elapsed: 7.245 sec
Running org.apache.camel.component.jms.tx.QueueToProcessorTransactionTest
Tests run: 1, Failures: 0, Errors: 0, Skipped: 0, Time elapsed: 5.345 sec
Running org.apache.camel.component.jms.tx.QueueToQueueRequestReplyTransactionTest
Tests run: 1, Failures: 0, Errors: 0, Skipped: 0, Time elapsed: 11.554 sec
Running org.apache.camel.component.jms.tx.QueueToQueueTransactionTest
Tests run: 1, Failures: 0, Errors: 0, Skipped: 0, Time elapsed: 5.457 sec
Running org.apache.camel.component.jms.tx.QueueToQueueTransactionWithoutDefineTransactionManagerTest
Tests run: 1, Failures: 0, Errors: 0, Skipped: 0, Time elapsed: 3.407 sec
Running org.apache.camel.component.jms.tx.RouteIdTransactedTest
Tests run: 2, Failures: 0, Errors: 0, Skipped: 0, Time elapsed: 4.695 sec
Running org.apache.camel.component.jms.tx.TransactedAsyncUsingThreadsTest
Tests run: 2, Failures: 0, Errors: 0, Skipped: 0, Time elapsed: 4.722 sec
Running org.apache.camel.component.jms.tx.TransactionErrorHandlerBuilderAsSpringBeanTest
Tests run: 1, Failures: 0, Errors: 0, Skipped: 0, Time elapsed: 5.796 sec
Running org.apache.camel.component.jms.tx.TransactionErrorHandlerCustomerSpringParserTest
Tests run: 1, Failures: 0, Errors: 0, Skipped: 0, Time elapsed: 5.835 sec
Running org.apache.camel.component.jms.tx.TransactionInterceptSendToEndpointTest
Tests run: 1, Failures: 0, Errors: 0, Skipped: 0, Time elapsed: 4.853 sec
Running org.apache.camel.component.jms.tx.TransactionMinimalConfigurationTest
Tests run: 1, Failures: 0, Errors: 0, Skipped: 0, Time elapsed: 5.262 sec
Running org.apache.camel.component.jms.tx.XMLQueueToProcessorTransactionTest
Tests run: 1, Failures: 0, Errors: 0, Skipped: 0, Time elapsed: 5.501 sec
Running org.apache.camel.component.jms.tx.XMLQueueToQueueTransactionTest
Tests run: 1, Failures: 0, Errors: 0, Skipped: 0, Time elapsed: 4.539 sec

Results :

Failed tests: 

Tests run: 389, Failures: 1, Errors: 0, Skipped: 5

[INFO] ------------------------------------------------------------------------
[ERROR] BUILD FAILURE
[INFO] ------------------------------------------------------------------------
[INFO] There are test failures.

Please refer to /srv/gump/public/workspace/camel/components/camel-jms/target/surefire-reports
for the individual test results.
[INFO] ------------------------------------------------------------------------
[INFO] For more information, run Maven with the -e switch
[INFO] ------------------------------------------------------------------------
[INFO] Total time: 21 minutes 13 seconds
[INFO] Finished at: Mon Jul 02 22:07:44 UTC 2012
[INFO] Final Memory: 34M/82M
[INFO] ------------------------------------------------------------------------
---------------------------------------------

To subscribe to this information via syndicated feeds:
- RSS: http://vmgump.apache.org/gump/public/camel/camel-jms-test/rss.xml
- Atom: http://vmgump.apache.org/gump/public/camel/camel-jms-test/atom.xml

============================== Gump Tracking Only ===
Produced by Apache Gump(TM) version 2.3.
Gump Run 06001202072012, vmgump.apache.org:vmgump:06001202072012
Gump E-mail Identifier (unique within run) #2.


--
Apache Gump
http://gump.apache.org/ [Instance: vmgump]

---------------------------------------------------------------------
To unsubscribe, e-mail: general-unsubscribe@gump.apache.org
For additional commands, e-mail: general-help@gump.apache.org


Mime
View raw message