gump-general mailing list archives

Site index · List index
Message view « Date » · « Thread »
Top « Date » · « Thread »
From g...@vmgump.apache.org
Subject BATCH: All dressed up, with nowhere to go...
Date Tue, 31 Jul 2012 23:29:31 GMT
Dear Gumpmeisters,
            
The following 11 notifys should have been sent

*********************************************************** G U M P
[GUMP@vmgump]: Project hamcrest-java-unit-test (in module hamcrest) failed
[GUMP@vmgump]: Project lucene-java-test (in module lucene-java) failed
[GUMP@vmgump]: Project lucene-java-analyzers-test (in module lucene-java) failed
[GUMP@vmgump]: Project lucene-java-contrib-test (in module lucene-java) failed
[GUMP@vmgump]: Project pdfbox-lucene (in module pdfbox) failed
[GUMP@vmgump]: Project tika-parsers (in module tika) failed
[GUMP@vmgump]: Project tika-reactor (in module tika) failed
[GUMP@vmgump]: Project commons-jelly-tags-ant-test (in module commons-jelly) failed
[GUMP@vmgump]: Project cocoon-optional (in module cocoon3) failed
[GUMP@vmgump]: Project james-mailbox (in module james-mailbox) failed
[GUMP@vmgump]: Project camel-jms-test (in module camel) failed
*********************************************************** G U M P
[GUMP@vmgump]: Project hamcrest-java-unit-test (in module hamcrest) failed
To whom it may engage...
        
This is an automated request, but not an unsolicited one. For 
more information please visit http://gump.apache.org/nagged.html, 
and/or contact the folk at general@gump.apache.org.

Project hamcrest-java-unit-test has an issue affecting its community integration.
This issue affects 3 projects.
The current state of this project is 'Failed', with reason 'Build Failed'.
For reference only, the following projects are affected by this:
    - hamcrest-java-unit-test :  Provides a library of matcher objects (also known as constra...
    - jmock2 :  jMock is a library for testing Java code using mock objects.
    - jmock2-test :  jMock is a library for testing Java code using mock objects.


Full details are available at:
    http://vmgump.apache.org/gump/public/hamcrest/hamcrest-java-unit-test/index.html

That said, some information snippets are provided here.

The following annotations (debug/informational/warning/error messages) were provided:
 -INFO- Failed with reason build failed
 -INFO- Failed to extract fallback artifacts from Gump Repository



The following work was performed:
http://vmgump.apache.org/gump/public/hamcrest/hamcrest-java-unit-test/gump_work/build_hamcrest_hamcrest-java-unit-test.html
Work Name: build_hamcrest_hamcrest-java-unit-test (Type: Build)
Work ended in a state of : Failed
Elapsed: 13 secs
Command Line: /usr/lib/jvm/java-6-openjdk/bin/java -Djava.awt.headless=true -Dbuild.sysclasspath=only -Xbootclasspath/p:/srv/gump/public/workspace/xml-xalan/build/xalan-unbundled.jar:/srv/gump/public/workspace/xml-xalan/build/serializer.jar:/srv/gump/public/workspace/xml-commons/java/external/build/xml-apis.jar:/srv/gump/public/workspace/xml-xerces2/build/xercesImpl.jar org.apache.tools.ant.Main -Dgump.merge=/srv/gump/public/gump/work/merge.xml -Dversion=31072012 unit-test 
[Working Directory: /srv/gump/public/workspace/hamcrest/hamcrest-java]
CLASSPATH: /usr/lib/jvm/java-6-openjdk/lib/tools.jar:/srv/gump/public/workspace/hamcrest/hamcrest-java/lib/integration/easymock-2.2.jar:/srv/gump/public/workspace/hamcrest/hamcrest-java/build/temp/build/hamcrest-unit-test-31072012.jar.contents:/srv/gump/public/workspace/ant/dist/lib/ant.jar:/srv/gump/public/workspace/ant/dist/lib/ant-launcher.jar:/srv/gump/public/workspace/ant/dist/lib/ant-jmf.jar:/srv/gump/public/workspace/ant/dist/lib/ant-junit.jar:/srv/gump/public/workspace/ant/dist/lib/ant-swing.jar:/srv/gump/public/workspace/ant/dist/lib/ant-apache-resolver.jar:/srv/gump/public/workspace/ant/dist/lib/ant-apache-xalan2.jar:/srv/gump/public/workspace/hamcrest/hamcrest-java/build/hamcrest-integration-31072012.jar:/srv/gump/public/workspace/hamcrest/hamcrest-java/build/hamcrest-all-31072012.jar:/srv/gump/packages/jarjar/jarjar-0.6.jar:/srv/gump/public/workspace/jmock/build/dist/jmock-core-31072012.jar:/srv/gump/public/workspace/jmock/build/dist/jmock-cglib-31072012.jar:/srv/
 gump/public/workspace/junit/dist/junit-31072012.jar:/srv/gump/public/workspace/junit/dist/junit-dep-31072012.jar:/srv/gump/packages/qdox/qdox-1.12.jar:/srv/gump/public/workspace/xml-commons/java/external/build/xml-apis-ext.jar
---------------------------------------------
     [java]              [T] greaterThan(T value)
     [java]              [T] greaterThanOrEqualTo(T value)
     [java]              [T] lessThan(T value)
     [java]              [T] lessThanOrEqualTo(T value)
     [java]         [String] equalToIgnoringCase(String string)
     [java]         [String] equalToIgnoringWhiteSpace(String string)
     [java]              [T] hasToString(Matcher<String> toStringMatcher)
     [java]              [T] hasToString(String expectedToString)
     [java]       [Class<?>] typeCompatibleWith(Class<T> baseType)
     [java]    [EventObject] eventFrom(Class<EventObject> eventClass, Object source)
     [java]    [EventObject] eventFrom(Object source)
     [java]              [T] hasProperty(String propertyName)
     [java]              [T] hasProperty(String propertyName, Matcher<?> value)
     [java]              [T] samePropertyValuesAs(T expectedBean)
     [java]           [Node] hasXPath(String xPath, Matcher<String> valueMatcher)
     [java]           [Node] hasXPath(String xPath, NamespaceContext namespaceContext, Matcher<String> valueMatcher)
     [java]           [Node] hasXPath(String xPath)
     [java]           [Node] hasXPath(String xPath, NamespaceContext namespaceContext)
    [javac] Compiling 1 source file to /srv/gump/public/workspace/hamcrest/hamcrest-java/build/temp/build/hamcrest-library-31072012.jar.contents
    [javac] Note: /srv/gump/public/workspace/hamcrest/hamcrest-java/build/temp/hamcrest-library/generated-code/org/hamcrest/Matchers.java uses or overrides a deprecated API.
    [javac] Note: Recompile with -Xlint:deprecation for details.
     [copy] Copying 1 file to /srv/gump/public/workspace/hamcrest/hamcrest-java/build/temp/build/hamcrest-library-31072012.jar.contents
      [jar] Building jar: /srv/gump/public/workspace/hamcrest/hamcrest-java/build/hamcrest-library-31072012.jar

integration:

unit-test:
    [mkdir] Created dir: /srv/gump/public/workspace/hamcrest/hamcrest-java/build/temp/build/hamcrest-unit-test-31072012.jar.contents
    [javac] Compiling 62 source files to /srv/gump/public/workspace/hamcrest/hamcrest-java/build/temp/build/hamcrest-unit-test-31072012.jar.contents
    [javac] /srv/gump/public/workspace/hamcrest/hamcrest-java/hamcrest-unit-test/src/main/java/org/hamcrest/core/AllOfTest.java:21: invalid inferred types for T; actual arguments do not conforms to inferred formal arguments
    [javac] required: org.hamcrest.Matcher<? super java.lang.Object>[]
    [javac] found: org.hamcrest.Matcher<java.lang.String>
    [javac]         return allOf(equalTo("irrelevant"));
    [javac]                     ^
    [javac] /srv/gump/public/workspace/hamcrest/hamcrest-java/hamcrest-unit-test/src/main/java/org/hamcrest/core/AnyOfTest.java:18: invalid inferred types for T; actual arguments do not conforms to inferred formal arguments
    [javac] required: org.hamcrest.Matcher<? super java.lang.Object>[]
    [javac] found: org.hamcrest.Matcher<java.lang.String>
    [javac]         return anyOf(equalTo("irrelevant"));
    [javac]                     ^
    [javac] Note: /srv/gump/public/workspace/hamcrest/hamcrest-java/hamcrest-unit-test/src/main/java/org/hamcrest/core/IsTest.java uses or overrides a deprecated API.
    [javac] Note: Recompile with -Xlint:deprecation for details.
    [javac] Note: Some input files use unchecked or unsafe operations.
    [javac] Note: Recompile with -Xlint:unchecked for details.
    [javac] 2 errors

BUILD FAILED
/srv/gump/public/workspace/hamcrest/hamcrest-java/build.xml:117: The following error occurred while executing this line:
/srv/gump/public/workspace/hamcrest/hamcrest-java/build.xml:231: Compile failed; see the compiler error output for details.

Total time: 12 seconds
---------------------------------------------

To subscribe to this information via syndicated feeds:
- RSS: http://vmgump.apache.org/gump/public/hamcrest/hamcrest-java-unit-test/rss.xml
- Atom: http://vmgump.apache.org/gump/public/hamcrest/hamcrest-java-unit-test/atom.xml

============================== Gump Tracking Only ===
Produced by Apache Gump(TM) version 2.3.
Gump Run 05001231072012, vmgump.apache.org:vmgump:05001231072012
Gump E-mail Identifier (unique within run) #2.

*********************************************************** G U M P
[GUMP@vmgump]: Project lucene-java-test (in module lucene-java) failed
To whom it may engage...
        
This is an automated request, but not an unsolicited one. For 
more information please visit http://gump.apache.org/nagged.html, 
and/or contact the folk at general@gump.apache.org.

Project lucene-java-test has an issue affecting its community integration.
This issue affects 1 projects.
The current state of this project is 'Failed', with reason 'Build Timed Out'.
For reference only, the following projects are affected by this:
    - lucene-java-test :  Java Based Search Engine


Full details are available at:
    http://vmgump.apache.org/gump/public/lucene-java/lucene-java-test/index.html

That said, some information snippets are provided here.

The following annotations (debug/informational/warning/error messages) were provided:
 -DEBUG- Dependency on javacc exists, no need to add for property javacc.home.
 -INFO- Failed with reason build timed out



The following work was performed:
http://vmgump.apache.org/gump/public/lucene-java/lucene-java-test/gump_work/build_lucene-java_lucene-java-test.html
Work Name: build_lucene-java_lucene-java-test (Type: Build)
Work ended in a state of : Failed
Elapsed: 60 mins
Command Line: /usr/lib/jvm/java-6-openjdk/bin/java -Djava.awt.headless=true -Xbootclasspath/p:/srv/gump/public/workspace/xml-commons/java/external/build/xml-apis.jar:/srv/gump/public/workspace/xml-xerces2/build/xercesImpl.jar org.apache.tools.ant.Main -Dgump.merge=/srv/gump/public/gump/work/merge.xml -Dversion=31072012 -Dbuild.sysclasspath=first -Divy.default.ivy.user.dir=/srv/gump/public/workspace/lucene-java/.ivy2 -Djavacc.home=/srv/gump/packages/javacc-3.1 test-core 
[Working Directory: /srv/gump/public/workspace/lucene-java/lucene]
CLASSPATH: /usr/lib/jvm/java-6-openjdk/lib/tools.jar:/srv/gump/public/workspace/lucene-java/lucene/build/classes/test:/srv/gump/public/workspace/lucene-java/lucene/build/classes/tools:/srv/gump/public/workspace/lucene-java/lucene/build/core/classes/test:/srv/gump/public/workspace/lucene-java/lucene/build/core/classes/tools:/srv/gump/public/workspace/ant/dist/lib/ant.jar:/srv/gump/public/workspace/ant/dist/lib/ant-launcher.jar:/srv/gump/public/workspace/ant/dist/lib/ant-jmf.jar:/srv/gump/public/workspace/ant/dist/lib/ant-junit.jar:/srv/gump/public/workspace/ant/dist/lib/ant-swing.jar:/srv/gump/public/workspace/ant/dist/lib/ant-apache-resolver.jar:/srv/gump/public/workspace/ant/dist/lib/ant-apache-xalan2.jar:/srv/gump/public/workspace/xml-commons/java/build/resolver.jar:/srv/gump/public/workspace/ivy/build/artifact/jars/ivy-31072012.jar:/srv/gump/packages/bouncycastle-jdk14/bcpg-jdk14-145.jar:/srv/gump/packages/bouncycastle-jdk14/bcprov-ext-jdk14-145.jar:/srv/gump/public/worksp
 ace/httpcomponents/oac.hc3x/dist/commons-httpclient.jar:/srv/gump/public/workspace/commons-codec-1.x/dist/commons-codec-31072012.jar:/srv/gump/packages/apache-attic/oro-2.0.8.jar:/srv/gump/packages/apache-commons/commons-vfs-1.0.jar:/srv/gump/packages/apache-attic/slide-webdavlib-2.1.jar:/srv/gump/packages/jsch/jsch-0.1.45.jar:/srv/gump/packages/javacc-3.1/bin/lib/javacc.jar:/srv/gump/public/workspace/junit/dist/junit-31072012.jar:/srv/gump/public/workspace/junit/dist/junit-dep-31072012.jar:/srv/gump/public/workspace/lucene-java/lucene/build/core/lucene-core-31072012.jar:/srv/gump/public/workspace/lucene-java/lucene/build/test-framework/lucene-test-framework-31072012.jar:/srv/gump/public/workspace/xml-commons/java/external/build/xml-apis-ext.jar
---------------------------------------------
[junit4:junit4] HEARTBEAT J0: 2012-07-31T15:15:10, no events in:  611s, approx. at: <unknown>
[junit4:junit4] HEARTBEAT J0: 2012-07-31T15:16:10, no events in:  671s, approx. at: <unknown>
[junit4:junit4] HEARTBEAT J0: 2012-07-31T15:17:10, no events in:  731s, approx. at: <unknown>
[junit4:junit4] HEARTBEAT J0: 2012-07-31T15:18:10, no events in:  791s, approx. at: <unknown>
[junit4:junit4] HEARTBEAT J0: 2012-07-31T15:19:10, no events in:  851s, approx. at: <unknown>
[junit4:junit4] HEARTBEAT J0: 2012-07-31T15:20:10, no events in:  911s, approx. at: <unknown>
[junit4:junit4] HEARTBEAT J0: 2012-07-31T15:21:10, no events in:  971s, approx. at: <unknown>
[junit4:junit4] HEARTBEAT J0: 2012-07-31T15:22:10, no events in: 1031s, approx. at: <unknown>
[junit4:junit4] HEARTBEAT J0: 2012-07-31T15:23:10, no events in: 1091s, approx. at: <unknown>
[junit4:junit4] HEARTBEAT J0: 2012-07-31T15:24:10, no events in: 1151s, approx. at: <unknown>
[junit4:junit4] HEARTBEAT J0: 2012-07-31T15:25:10, no events in: 1211s, approx. at: <unknown>
[junit4:junit4] HEARTBEAT J0: 2012-07-31T15:26:10, no events in: 1271s, approx. at: <unknown>
[junit4:junit4] HEARTBEAT J0: 2012-07-31T15:27:10, no events in: 1331s, approx. at: <unknown>
[junit4:junit4] HEARTBEAT J0: 2012-07-31T15:28:10, no events in: 1391s, approx. at: <unknown>
[junit4:junit4] HEARTBEAT J0: 2012-07-31T15:29:10, no events in: 1451s, approx. at: <unknown>
[junit4:junit4] HEARTBEAT J0: 2012-07-31T15:30:10, no events in: 1511s, approx. at: <unknown>
[junit4:junit4] HEARTBEAT J0: 2012-07-31T15:31:10, no events in: 1571s, approx. at: <unknown>
[junit4:junit4] HEARTBEAT J0: 2012-07-31T15:32:10, no events in: 1631s, approx. at: <unknown>
[junit4:junit4] HEARTBEAT J0: 2012-07-31T15:33:10, no events in: 1691s, approx. at: <unknown>
[junit4:junit4] HEARTBEAT J0: 2012-07-31T15:34:10, no events in: 1751s, approx. at: <unknown>
[junit4:junit4] HEARTBEAT J0: 2012-07-31T15:35:10, no events in: 1811s, approx. at: <unknown>
[junit4:junit4] HEARTBEAT J0: 2012-07-31T15:36:11, no events in: 1871s, approx. at: <unknown>
[junit4:junit4] HEARTBEAT J0: 2012-07-31T15:37:11, no events in: 1931s, approx. at: <unknown>
[junit4:junit4] HEARTBEAT J0: 2012-07-31T15:38:11, no events in: 1991s, approx. at: <unknown>
[junit4:junit4] HEARTBEAT J0: 2012-07-31T15:39:11, no events in: 2051s, approx. at: <unknown>
[junit4:junit4] HEARTBEAT J0: 2012-07-31T15:40:11, no events in: 2111s, approx. at: <unknown>
[junit4:junit4] HEARTBEAT J0: 2012-07-31T15:41:11, no events in: 2171s, approx. at: <unknown>
[junit4:junit4] HEARTBEAT J0: 2012-07-31T15:42:11, no events in: 2231s, approx. at: <unknown>
[junit4:junit4] HEARTBEAT J0: 2012-07-31T15:43:11, no events in: 2291s, approx. at: <unknown>
[junit4:junit4] HEARTBEAT J0: 2012-07-31T15:44:11, no events in: 2351s, approx. at: <unknown>
[junit4:junit4] HEARTBEAT J0: 2012-07-31T15:45:11, no events in: 2411s, approx. at: <unknown>
[junit4:junit4] HEARTBEAT J0: 2012-07-31T15:46:11, no events in: 2471s, approx. at: <unknown>
[junit4:junit4] HEARTBEAT J0: 2012-07-31T15:47:11, no events in: 2531s, approx. at: <unknown>
[junit4:junit4] HEARTBEAT J0: 2012-07-31T15:48:11, no events in: 2591s, approx. at: <unknown>
[junit4:junit4] HEARTBEAT J0: 2012-07-31T15:49:11, no events in: 2651s, approx. at: <unknown>
[junit4:junit4] HEARTBEAT J0: 2012-07-31T15:50:11, no events in: 2711s, approx. at: <unknown>
[junit4:junit4] HEARTBEAT J0: 2012-07-31T15:51:11, no events in: 2771s, approx. at: <unknown>
[junit4:junit4] HEARTBEAT J0: 2012-07-31T15:52:11, no events in: 2831s, approx. at: <unknown>
[junit4:junit4] HEARTBEAT J0: 2012-07-31T15:53:11, no events in: 2891s, approx. at: <unknown>
[junit4:junit4] HEARTBEAT J0: 2012-07-31T15:54:11, no events in: 2951s, approx. at: <unknown>
[junit4:junit4] HEARTBEAT J0: 2012-07-31T15:55:11, no events in: 3011s, approx. at: <unknown>
[junit4:junit4] HEARTBEAT J0: 2012-07-31T15:56:11, no events in: 3071s, approx. at: <unknown>
[junit4:junit4] HEARTBEAT J0: 2012-07-31T15:57:11, no events in: 3131s, approx. at: <unknown>
[junit4:junit4] HEARTBEAT J0: 2012-07-31T15:58:11, no events in: 3191s, approx. at: <unknown>
[junit4:junit4] HEARTBEAT J0: 2012-07-31T15:59:11, no events in: 3251s, approx. at: <unknown>
[junit4:junit4] HEARTBEAT J0: 2012-07-31T16:00:11, no events in: 3311s, approx. at: <unknown>
[junit4:junit4] HEARTBEAT J0: 2012-07-31T16:01:11, no events in: 3371s, approx. at: <unknown>
[junit4:junit4] HEARTBEAT J0: 2012-07-31T16:02:11, no events in: 3431s, approx. at: <unknown>
[junit4:junit4] HEARTBEAT J0: 2012-07-31T16:03:11, no events in: 3492s, approx. at: <unknown>
[junit4:junit4] HEARTBEAT J0: 2012-07-31T16:04:11, no events in: 3552s, approx. at: <unknown>
---------------------------------------------

To subscribe to this information via syndicated feeds:
- RSS: http://vmgump.apache.org/gump/public/lucene-java/lucene-java-test/rss.xml
- Atom: http://vmgump.apache.org/gump/public/lucene-java/lucene-java-test/atom.xml

============================== Gump Tracking Only ===
Produced by Apache Gump(TM) version 2.3.
Gump Run 05001231072012, vmgump.apache.org:vmgump:05001231072012
Gump E-mail Identifier (unique within run) #5.

*********************************************************** G U M P
[GUMP@vmgump]: Project lucene-java-analyzers-test (in module lucene-java) failed
To whom it may engage...
        
This is an automated request, but not an unsolicited one. For 
more information please visit http://gump.apache.org/nagged.html, 
and/or contact the folk at general@gump.apache.org.

Project lucene-java-analyzers-test has an issue affecting its community integration.
This issue affects 1 projects.
The current state of this project is 'Failed', with reason 'Build Failed'.
For reference only, the following projects are affected by this:
    - lucene-java-analyzers-test :  Java Based Search Engine


Full details are available at:
    http://vmgump.apache.org/gump/public/lucene-java/lucene-java-analyzers-test/index.html

That said, some information snippets are provided here.

The following annotations (debug/informational/warning/error messages) were provided:
 -INFO- Failed with reason build failed



The following work was performed:
http://vmgump.apache.org/gump/public/lucene-java/lucene-java-analyzers-test/gump_work/build_lucene-java_lucene-java-analyzers-test.html
Work Name: build_lucene-java_lucene-java-analyzers-test (Type: Build)
Work ended in a state of : Failed
Elapsed: 6 secs
Command Line: /usr/lib/jvm/java-6-openjdk/bin/java -Djava.awt.headless=true -Dbuild.sysclasspath=only -Xbootclasspath/p:/srv/gump/public/workspace/xml-commons/java/external/build/xml-apis.jar:/srv/gump/public/workspace/xml-xerces2/build/xercesImpl.jar org.apache.tools.ant.Main -Dgump.merge=/srv/gump/public/gump/work/merge.xml -Dversion=31072012 -Divy.default.ivy.user.dir=/srv/gump/public/workspace/lucene-java/.ivy2 test 
[Working Directory: /srv/gump/public/workspace/lucene-java/lucene/analysis]
CLASSPATH: /usr/lib/jvm/java-6-openjdk/lib/tools.jar:/srv/gump/public/workspace/lucene-java/lucene/build/classes/test:/srv/gump/public/workspace/lucene-java/lucene/build/classes/tools:/srv/gump/public/workspace/lucene-java/analysis/build/icu/classes/test:/srv/gump/public/workspace/lucene-java/lucene/analysis/build/smartcn/classes/test:/srv/gump/public/workspace/lucene-java/lucene/analysis/build/common/classes/test:/srv/gump/public/workspace/lucene-java/lucene/analysis/build/stempel/classes/test:/srv/gump/public/workspace/lucene-java/lucene/analysis/build/phonetic/classes/test:/srv/gump/public/workspace/lucene-java/lucene/analysis/build/morfologik/classes/test:/srv/gump/public/workspace/ant/dist/lib/ant.jar:/srv/gump/public/workspace/ant/dist/lib/ant-launcher.jar:/srv/gump/public/workspace/ant/dist/lib/ant-jmf.jar:/srv/gump/public/workspace/ant/dist/lib/ant-junit.jar:/srv/gump/public/workspace/ant/dist/lib/ant-swing.jar:/srv/gump/public/workspace/ant/dist/lib/ant-apache-resolv
 er.jar:/srv/gump/public/workspace/ant/dist/lib/ant-apache-xalan2.jar:/srv/gump/public/workspace/xml-commons/java/build/resolver.jar:/srv/gump/public/workspace/commons-codec-1.x/dist/commons-codec-31072012.jar:/srv/gump/public/workspace/icu4j/main/classes/core/out/lib/icu4j-core.jar:/srv/gump/public/workspace/icu4j/main/classes/collate/out/lib/icu4j-collate.jar:/srv/gump/public/workspace/icu4j/main/classes/currdata/out/lib/icu4j-currdata.jar:/srv/gump/public/workspace/icu4j/main/classes/langdata/out/lib/icu4j-langdata.jar:/srv/gump/public/workspace/icu4j/main/classes/regiondata/out/lib/icu4j-regiondata.jar:/srv/gump/public/workspace/icu4j/main/classes/translit/out/lib/icu4j-translit.jar:/srv/gump/public/workspace/icu4j/main/classes/charset/out/lib/icu4j-charset.jar:/srv/gump/public/workspace/icu4j/main/classes/localespi/out/lib/icu4j-localespi.jar:/srv/gump/public/workspace/ivy/build/artifact/jars/ivy-31072012.jar:/srv/gump/packages/bouncycastle-jdk14/bcpg-jdk14-145.jar:/srv/
 gump/packages/bouncycastle-jdk14/bcprov-ext-jdk14-145.jar:/srv/gump/public/workspace/httpcomponents/oac.hc3x/dist/commons-httpclient.jar:/srv/gump/packages/apache-attic/oro-2.0.8.jar:/srv/gump/packages/apache-commons/commons-vfs-1.0.jar:/srv/gump/packages/apache-attic/slide-webdavlib-2.1.jar:/srv/gump/packages/jsch/jsch-0.1.45.jar:/srv/gump/public/workspace/junit/dist/junit-31072012.jar:/srv/gump/public/workspace/junit/dist/junit-dep-31072012.jar:/srv/gump/public/workspace/lucene-java/lucene/build/core/lucene-core-31072012.jar:/srv/gump/public/workspace/lucene-java/lucene/build/analysis/icu/lucene-analyzers-icu-31072012.jar:/srv/gump/public/workspace/lucene-java/lucene/build/analysis/smartcn/lucene-analyzers-smartcn-31072012.jar:/srv/gump/public/workspace/lucene-java/lucene/build/analysis/common/lucene-analyzers-common-31072012.jar:/srv/gump/public/workspace/lucene-java/lucene/build/analysis/stempel/lucene-analyzers-stempel-31072012.jar:/srv/gump/public/workspace/lucene-java
 /lucene/build/analysis/phonetic/lucene-analyzers-phonetic-31072012.jar:/srv/gump/public/workspace/lucene-java/lucene/build/analysis/morfologik/lucene-analyzers-morfologik-31072012.jar:/srv/gump/public/workspace/lucene-java/lucene/build/test-framework/lucene-test-framework-31072012.jar:/srv/gump/public/workspace/xml-commons/java/external/build/xml-apis-ext.jar
---------------------------------------------
ivy-availability-check:

ivy-fail:

ivy-configure:
[ivy:configure] :: loading settings :: file = /srv/gump/public/workspace/lucene-java/lucene/ivy-settings.xml

resolve:

init:

compile-lucene-core:

compile-core:

common.compile-test:

install-junit4-taskdef:
  [taskdef] Could not load definitions from resource com/carrotsearch/junit4/antlib.xml. It could not be found.

-clover.disable:

-clover.setup:

clover:

validate:

common.test:
    [mkdir] Created dir: /srv/gump/public/workspace/lucene-java/lucene/build/analysis/common/test

BUILD FAILED
/srv/gump/public/workspace/lucene-java/lucene/analysis/build.xml:101: The following error occurred while executing this line:
/srv/gump/public/workspace/lucene-java/lucene/analysis/build.xml:38: The following error occurred while executing this line:
/srv/gump/public/workspace/lucene-java/lucene/module-build.xml:62: The following error occurred while executing this line:
/srv/gump/public/workspace/lucene-java/lucene/common-build.xml:1095: The following error occurred while executing this line:
/srv/gump/public/workspace/lucene-java/lucene/common-build.xml:753: Problem: failed to create task or type antlib:com.carrotsearch.junit4:pickseed
Cause: The name is undefined.
Action: Check the spelling.
Action: Check that any custom tasks/types have been declared.
Action: Check that any <presetdef>/<macrodef> declarations have taken place.
No types or tasks have been defined in this namespace yet

This appears to be an antlib declaration. 
Action: Check that the implementing library exists in one of:
        -ANT_HOME/lib
        -the IDE Ant configuration dialogs


Total time: 6 seconds
---------------------------------------------

To subscribe to this information via syndicated feeds:
- RSS: http://vmgump.apache.org/gump/public/lucene-java/lucene-java-analyzers-test/rss.xml
- Atom: http://vmgump.apache.org/gump/public/lucene-java/lucene-java-analyzers-test/atom.xml

============================== Gump Tracking Only ===
Produced by Apache Gump(TM) version 2.3.
Gump Run 05001231072012, vmgump.apache.org:vmgump:05001231072012
Gump E-mail Identifier (unique within run) #6.

*********************************************************** G U M P
[GUMP@vmgump]: Project lucene-java-contrib-test (in module lucene-java) failed
To whom it may engage...
        
This is an automated request, but not an unsolicited one. For 
more information please visit http://gump.apache.org/nagged.html, 
and/or contact the folk at general@gump.apache.org.

Project lucene-java-contrib-test has an issue affecting its community integration.
This issue affects 1 projects.
The current state of this project is 'Failed', with reason 'Build Failed'.
For reference only, the following projects are affected by this:
    - lucene-java-contrib-test :  Java Based Search Engine


Full details are available at:
    http://vmgump.apache.org/gump/public/lucene-java/lucene-java-contrib-test/index.html

That said, some information snippets are provided here.

The following annotations (debug/informational/warning/error messages) were provided:
 -DEBUG- Dependency on javacc exists, no need to add for property javacc.home.
 -INFO- Failed with reason build failed



The following work was performed:
http://vmgump.apache.org/gump/public/lucene-java/lucene-java-contrib-test/gump_work/build_lucene-java_lucene-java-contrib-test.html
Work Name: build_lucene-java_lucene-java-contrib-test (Type: Build)
Work ended in a state of : Failed
Elapsed: 8 secs
Command Line: /usr/lib/jvm/java-6-openjdk/bin/java -Djava.awt.headless=true -Dbuild.sysclasspath=only -Xbootclasspath/p:/srv/gump/public/workspace/xml-xalan/build/xalan-unbundled.jar:/srv/gump/public/workspace/xml-xalan/build/serializer.jar:/srv/gump/public/workspace/xml-commons/java/external/build/xml-apis.jar:/srv/gump/public/workspace/xml-xerces2/build/xercesImpl.jar org.apache.tools.ant.Main -Dgump.merge=/srv/gump/public/gump/work/merge.xml -Dversion=31072012 -Divy.default.ivy.user.dir=/srv/gump/public/workspace/lucene-java/.ivy2 -Djavacc.home=/srv/gump/packages/javacc-3.1 test 
[Working Directory: /srv/gump/public/workspace/lucene-java/lucene]
CLASSPATH: /usr/lib/jvm/java-6-openjdk/lib/tools.jar:/srv/gump/public/workspace/lucene-java/lucene/build/classes/tools:/srv/gump/public/workspace/lucene-java/lucene/build/classes/test:/srv/gump/public/workspace/lucene-java/lucene/build/contrib/demo/classes/test:/srv/gump/public/workspace/lucene-java/lucene/build/contrib/highlighter/classes/test:/srv/gump/public/workspace/lucene-java/lucene/build/contrib/instantiated/classes/test:/srv/gump/public/workspace/lucene-java/lucene/build/contrib/memory/classes/test:/srv/gump/public/workspace/lucene-java/lucene/build/contrib/misc/classes/test:/srv/gump/public/workspace/lucene-java/lucene/build/contrib/sandbox/classes/test:/srv/gump/public/workspace/lucene-java/lucene/build/contrib/spatial/classes/test:/srv/gump/public/workspace/lucene-java/lucene/queries/build/classes/test:/srv/gump/public/workspace/lucene-java/lucene/queryparser/build/classes/test:/srv/gump/public/workspace/ant/dist/lib/ant.jar:/srv/gump/public/workspace/ant/dist/lib
 /ant-launcher.jar:/srv/gump/public/workspace/ant/dist/lib/ant-jmf.jar:/srv/gump/public/workspace/ant/dist/lib/ant-junit.jar:/srv/gump/public/workspace/ant/dist/lib/ant-swing.jar:/srv/gump/public/workspace/ant/dist/lib/ant-apache-resolver.jar:/srv/gump/public/workspace/ant/dist/lib/ant-apache-xalan2.jar:/srv/gump/public/workspace/xml-commons/java/build/resolver.jar:/srv/gump/public/workspace/apache-commons/compress/target/commons-compress-1.5-SNAPSHOT.jar:/srv/gump/public/workspace/commons-digester-2.x/target/commons-digester-2.2-SNAPSHOT.jar:/srv/gump/public/workspace/apache-commons/logging/target/commons-logging-31072012.jar:/srv/gump/public/workspace/apache-commons/logging/target/commons-logging-api-31072012.jar:/srv/gump/packages/caucho-libs/hessian-3.0.8.jar:/srv/gump/public/workspace/icu4j/main/classes/core/out/lib/icu4j-core.jar:/srv/gump/public/workspace/icu4j/main/classes/collate/out/lib/icu4j-collate.jar:/srv/gump/public/workspace/icu4j/main/classes/currdata/out/lib
 /icu4j-currdata.jar:/srv/gump/public/workspace/icu4j/main/classes/langdata/out/lib/icu4j-langdata.jar:/srv/gump/public/workspace/icu4j/main/classes/regiondata/out/lib/icu4j-regiondata.jar:/srv/gump/public/workspace/icu4j/main/classes/translit/out/lib/icu4j-translit.jar:/srv/gump/public/workspace/icu4j/main/classes/charset/out/lib/icu4j-charset.jar:/srv/gump/public/workspace/icu4j/main/classes/localespi/out/lib/icu4j-localespi.jar:/srv/gump/packages/apache-attic/jakarta-regexp-1.5.jar:/srv/gump/public/workspace/jakarta-servletapi-5/jsr154/dist/lib/servlet-api.jar:/srv/gump/packages/javacc-3.1/bin/lib/javacc.jar:/srv/gump/public/workspace/jline/target/jline-0.9.95-SNAPSHOT.jar:/srv/gump/packages/jtidy/jtidy-r938.jar:/srv/gump/public/workspace/junit/dist/junit-31072012.jar:/srv/gump/public/workspace/junit/dist/junit-dep-31072012.jar:/srv/gump/public/workspace/lucene-java/lucene/build/core/lucene-core-31072012.jar:/srv/gump/public/workspace/lucene-java/lucene/build/analysis/icu/
 lucene-analyzers-icu-31072012.jar:/srv/gump/public/workspace/lucene-java/lucene/build/analysis/smartcn/lucene-analyzers-smartcn-31072012.jar:/srv/gump/public/workspace/lucene-java/lucene/build/analysis/common/lucene-analyzers-common-31072012.jar:/srv/gump/public/workspace/lucene-java/lucene/build/analysis/stempel/lucene-analyzers-stempel-31072012.jar:/srv/gump/public/workspace/lucene-java/lucene/build/analysis/phonetic/lucene-analyzers-phonetic-31072012.jar:/srv/gump/public/workspace/lucene-java/lucene/build/analysis/morfologik/lucene-analyzers-morfologik-31072012.jar:/srv/gump/public/workspace/lucene-java/lucene/build/queries/lucene-queries-31072012.jar:/srv/gump/public/workspace/lucene-java/lucene/build/sandbox/lucene-sandbox-31072012.jar:/srv/gump/public/workspace/lucene-java/lucene/build/queryparser/lucene-queryparser-31072012.jar:/srv/gump/public/workspace/lucene-java/lucene/build/demo/lucene-demo-31072012.jar:/srv/gump/public/workspace/lucene-java/lucene/build/memory/l
 ucene-memory-31072012.jar:/srv/gump/public/workspace/lucene-java/lucene/build/highlighter/lucene-highlighter-31072012.jar:/srv/gump/public/workspace/lucene-java/lucene/build/misc/lucene-misc-31072012.jar:/srv/gump/public/workspace/lucene-java/lucene/build/test-framework/lucene-test-framework-31072012.jar:/srv/gump/packages/nekohtml-0.9.5/nekohtml.jar:/srv/gump/public/workspace/xml-commons/java/external/build/xml-apis-ext.jar:/srv/gump/public/workspace/ivy/build/artifact/jars/ivy-31072012.jar:/srv/gump/packages/bouncycastle-jdk14/bcpg-jdk14-145.jar:/srv/gump/packages/bouncycastle-jdk14/bcprov-ext-jdk14-145.jar:/srv/gump/public/workspace/httpcomponents/oac.hc3x/dist/commons-httpclient.jar:/srv/gump/public/workspace/commons-codec-1.x/dist/commons-codec-31072012.jar:/srv/gump/packages/apache-attic/oro-2.0.8.jar:/srv/gump/packages/apache-commons/commons-vfs-1.0.jar:/srv/gump/packages/apache-attic/slide-webdavlib-2.1.jar:/srv/gump/packages/jsch/jsch-0.1.45.jar
---------------------------------------------

ivy-availability-check:

ivy-fail:

ivy-configure:
[ivy:configure] :: loading settings :: file = /srv/gump/public/workspace/lucene-java/lucene/ivy-settings.xml

resolve:

init:

-clover.disable:

-clover.setup:

clover:

common.compile-core:

compile-core:

compile-core:

compile-test:

install-junit4-taskdef:
  [taskdef] Could not load definitions from resource com/carrotsearch/junit4/antlib.xml. It could not be found.

validate:

test:

BUILD FAILED
/srv/gump/public/workspace/lucene-java/lucene/build.xml:50: The following error occurred while executing this line:
/srv/gump/public/workspace/lucene-java/lucene/common-build.xml:1095: The following error occurred while executing this line:
/srv/gump/public/workspace/lucene-java/lucene/common-build.xml:753: Problem: failed to create task or type antlib:com.carrotsearch.junit4:pickseed
Cause: The name is undefined.
Action: Check the spelling.
Action: Check that any custom tasks/types have been declared.
Action: Check that any <presetdef>/<macrodef> declarations have taken place.
No types or tasks have been defined in this namespace yet

This appears to be an antlib declaration. 
Action: Check that the implementing library exists in one of:
        -ANT_HOME/lib
        -the IDE Ant configuration dialogs


Total time: 6 seconds
---------------------------------------------

To subscribe to this information via syndicated feeds:
- RSS: http://vmgump.apache.org/gump/public/lucene-java/lucene-java-contrib-test/rss.xml
- Atom: http://vmgump.apache.org/gump/public/lucene-java/lucene-java-contrib-test/atom.xml

============================== Gump Tracking Only ===
Produced by Apache Gump(TM) version 2.3.
Gump Run 05001231072012, vmgump.apache.org:vmgump:05001231072012
Gump E-mail Identifier (unique within run) #7.

*********************************************************** G U M P
[GUMP@vmgump]: Project pdfbox-lucene (in module pdfbox) failed
To whom it may engage...
        
This is an automated request, but not an unsolicited one. For 
more information please visit http://gump.apache.org/nagged.html, 
and/or contact the folk at general@gump.apache.org.

Project pdfbox-lucene has an issue affecting its community integration.
This issue affects 1 projects.
The current state of this project is 'Failed', with reason 'Build Failed'.
For reference only, the following projects are affected by this:
    - pdfbox-lucene :  Apache PDFBox is an open source Java PDF library for working...


Full details are available at:
    http://vmgump.apache.org/gump/public/pdfbox/pdfbox-lucene/index.html

That said, some information snippets are provided here.

The following annotations (debug/informational/warning/error messages) were provided:
 -DEBUG- Sole jar output [pdfbox-lucene-*[0-9T].jar] identifier set to project name
 -DEBUG- (Apache Gump generated) Apache Maven Settings in: /srv/gump/public/workspace/pdfbox/lucene/gump_mvn_settings.xml
 -INFO- Failed with reason build failed
 -DEBUG- Maven POM in: /srv/gump/public/workspace/pdfbox/lucene/pom.xml
 -INFO- Failed to extract fallback artifacts from Gump Repository



The following work was performed:
http://vmgump.apache.org/gump/public/pdfbox/pdfbox-lucene/gump_work/build_pdfbox_pdfbox-lucene.html
Work Name: build_pdfbox_pdfbox-lucene (Type: Build)
Work ended in a state of : Failed
Elapsed: 12 secs
Command Line: /opt/maven2/bin/mvn --batch-mode --settings /srv/gump/public/workspace/pdfbox/lucene/gump_mvn_settings.xml package 
[Working Directory: /srv/gump/public/workspace/pdfbox/lucene]
M2_HOME: /opt/maven2
---------------------------------------------
/srv/gump/public/workspace/pdfbox/lucene/src/main/java/org/apache/pdfbox/lucene/IndexFiles.java:[25,42] package org.apache.lucene.analysis.standard does not exist
/srv/gump/public/workspace/pdfbox/lucene/src/main/java/org/apache/pdfbox/lucene/IndexFiles.java:[34,30] cannot find symbol
symbol  : class TermEnum
location: package org.apache.lucene.index
/srv/gump/public/workspace/pdfbox/lucene/src/main/java/org/apache/pdfbox/lucene/IndexFiles.java:[59,12] cannot find symbol
symbol  : class TermEnum
location: class org.apache.pdfbox.lucene.IndexFiles
/srv/gump/public/workspace/pdfbox/lucene/src/main/java/org/apache/pdfbox/lucene/LucenePDFDocument.java:[170,72] cannot find symbol
symbol  : variable Index
location: class org.apache.lucene.document.Field
/srv/gump/public/workspace/pdfbox/lucene/src/main/java/org/apache/pdfbox/lucene/LucenePDFDocument.java:[170,26] internal error; cannot instantiate org.apache.lucene.document.Field.<init> at org.apache.lucene.document.Field to ()
/srv/gump/public/workspace/pdfbox/lucene/src/main/java/org/apache/pdfbox/lucene/LucenePDFDocument.java:[178,26] cannot find symbol
symbol  : constructor Field(java.lang.String,java.io.Reader)
location: class org.apache.lucene.document.Field
/srv/gump/public/workspace/pdfbox/lucene/src/main/java/org/apache/pdfbox/lucene/LucenePDFDocument.java:[186,72] cannot find symbol
symbol  : variable Index
location: class org.apache.lucene.document.Field
/srv/gump/public/workspace/pdfbox/lucene/src/main/java/org/apache/pdfbox/lucene/LucenePDFDocument.java:[186,26] internal error; cannot instantiate org.apache.lucene.document.Field.<init> at org.apache.lucene.document.Field to ()
/srv/gump/public/workspace/pdfbox/lucene/src/main/java/org/apache/pdfbox/lucene/LucenePDFDocument.java:[210,72] cannot find symbol
symbol  : variable Index
location: class org.apache.lucene.document.Field
/srv/gump/public/workspace/pdfbox/lucene/src/main/java/org/apache/pdfbox/lucene/LucenePDFDocument.java:[210,26] internal error; cannot instantiate org.apache.lucene.document.Field.<init> at org.apache.lucene.document.Field to ()
/srv/gump/public/workspace/pdfbox/lucene/src/main/java/org/apache/pdfbox/lucene/LucenePDFDocument.java:[218,71] cannot find symbol
symbol  : variable Index
location: class org.apache.lucene.document.Field
/srv/gump/public/workspace/pdfbox/lucene/src/main/java/org/apache/pdfbox/lucene/LucenePDFDocument.java:[218,26] internal error; cannot instantiate org.apache.lucene.document.Field.<init> at org.apache.lucene.document.Field to ()
/srv/gump/public/workspace/pdfbox/lucene/src/main/java/org/apache/pdfbox/lucene/IndexFiles.java:[120,48] cannot find symbol
symbol  : class StandardAnalyzer
location: class org.apache.pdfbox.lucene.IndexFiles
/srv/gump/public/workspace/pdfbox/lucene/src/main/java/org/apache/pdfbox/lucene/IndexFiles.java:[120,87] cannot find symbol
symbol  : variable MaxFieldLength
location: class org.apache.lucene.index.IndexWriter
/srv/gump/public/workspace/pdfbox/lucene/src/main/java/org/apache/pdfbox/lucene/IndexFiles.java:[120,21] internal error; cannot instantiate org.apache.lucene.index.IndexWriter.<init> at org.apache.lucene.index.IndexWriter to ()
/srv/gump/public/workspace/pdfbox/lucene/src/main/java/org/apache/pdfbox/lucene/IndexFiles.java:[131,18] cannot find symbol
symbol  : method optimize()
location: class org.apache.lucene.index.IndexWriter
/srv/gump/public/workspace/pdfbox/lucene/src/main/java/org/apache/pdfbox/lucene/IndexFiles.java:[163,32] cannot find symbol
symbol  : method open(java.lang.String)
location: class org.apache.lucene.index.IndexReader
/srv/gump/public/workspace/pdfbox/lucene/src/main/java/org/apache/pdfbox/lucene/IndexFiles.java:[164,28] cannot find symbol
symbol  : method terms(org.apache.lucene.index.Term)
location: class org.apache.lucene.index.IndexReader

[INFO] ------------------------------------------------------------------------
[INFO] For more information, run Maven with the -e switch
[INFO] ------------------------------------------------------------------------
[INFO] Total time: 11 seconds
[INFO] Finished at: Tue Jul 31 17:40:26 UTC 2012
[INFO] Final Memory: 26M/63M
[INFO] ------------------------------------------------------------------------
---------------------------------------------

To subscribe to this information via syndicated feeds:
- RSS: http://vmgump.apache.org/gump/public/pdfbox/pdfbox-lucene/rss.xml
- Atom: http://vmgump.apache.org/gump/public/pdfbox/pdfbox-lucene/atom.xml

============================== Gump Tracking Only ===
Produced by Apache Gump(TM) version 2.3.
Gump Run 05001231072012, vmgump.apache.org:vmgump:05001231072012
Gump E-mail Identifier (unique within run) #10.

*********************************************************** G U M P
[GUMP@vmgump]: Project tika-parsers (in module tika) failed
To whom it may engage...
        
This is an automated request, but not an unsolicited one. For 
more information please visit http://gump.apache.org/nagged.html, 
and/or contact the folk at general@gump.apache.org.

Project tika-parsers has an issue affecting its community integration.
This issue affects 2 projects.
The current state of this project is 'Failed', with reason 'Build Failed'.
For reference only, the following projects are affected by this:
    - tika-parsers :  Apache Tika is a toolkit for detecting and extracting metada...
    - tika-parsers-test :  Apache Tika is a toolkit for detecting and extracting metada...


Full details are available at:
    http://vmgump.apache.org/gump/public/tika/tika-parsers/index.html

That said, some information snippets are provided here.

The following annotations (debug/informational/warning/error messages) were provided:
 -DEBUG- Sole jar output [tika-parsers-*[0-9T].jar] identifier set to project name
 -DEBUG- (Apache Gump generated) Apache Maven Settings in: /srv/gump/public/workspace/tika/tika-parsers/gump_mvn_settings.xml
 -INFO- Failed with reason build failed
 -DEBUG- Maven POM in: /srv/gump/public/workspace/tika/tika-parsers/pom.xml
 -DEBUG- Extracted fallback artifacts from Gump Repository



The following work was performed:
http://vmgump.apache.org/gump/public/tika/tika-parsers/gump_work/build_tika_tika-parsers.html
Work Name: build_tika_tika-parsers (Type: Build)
Work ended in a state of : Failed
Elapsed: 38 secs
Command Line: /opt/maven2/bin/mvn --batch-mode -DskipTests=true --settings /srv/gump/public/workspace/tika/tika-parsers/gump_mvn_settings.xml package 
[Working Directory: /srv/gump/public/workspace/tika/tika-parsers]
M2_HOME: /opt/maven2
---------------------------------------------
1404K downloaded  (mockito-core-1.7.jar)
Downloading: http://localhost:8192/maven2/org/apache/pdfbox/fontbox/1.7.0/fontbox-1.7.0.jar
184K downloaded  (fontbox-1.7.0.jar)
Downloading: http://localhost:8192/maven2/org/apache/poi/poi-scratchpad/3.8/poi-scratchpad-3.8.jar
1180K downloaded  (poi-scratchpad-3.8.jar)
Downloading: http://localhost:8192/maven2/org/gagravarr/vorbis-java-core/0.1/vorbis-java-core-0.1-tests.jar
2604K downloaded  (xmlbeans-2.3.0.jar)
Downloading: http://localhost:8192/maven2/org/bouncycastle/bcprov-jdk15/1.45/bcprov-jdk15-1.45.jar
44K downloaded  (org.apache.felix.scr.annotations-1.6.0.jar)
29K downloaded  (vorbis-java-core-0.1-tests.jar)
Downloading: http://localhost:8192/maven2/org/apache/pdfbox/jempbox/1.7.0/jempbox-1.7.0.jar
49K downloaded  (jempbox-1.7.0.jar)
Downloading: http://localhost:8192/maven2/org/apache/poi/poi-ooxml/3.8/poi-ooxml-3.8.jar
920K downloaded  (poi-ooxml-3.8.jar)
Downloading: http://localhost:8192/maven2/org/apache/poi/poi-ooxml-schemas/3.8/poi-ooxml-schemas-3.8.jar
14814K downloaded  (poi-ooxml-schemas-3.8.jar)
1624K downloaded  (bcprov-jdk15-1.45.jar)
Downloading: http://localhost:8192/maven2/org/gagravarr/vorbis-java-core/0.1/vorbis-java-core-0.1.jar
46K downloaded  (vorbis-java-core-0.1.jar)
4225K downloaded  (netcdf-4.2-min.jar)
[debug] execute contextualize
[INFO] [resources:resources {execution: default-resources}]
[INFO] Using 'UTF-8' encoding to copy filtered resources.
[INFO] Copying 4 resources
[INFO] Copying 3 resources
[INFO] [compiler:compile {execution: default-compile}]
[INFO] Compiling 133 source files to /srv/gump/public/workspace/tika/tika-parsers/target/classes
[INFO] -------------------------------------------------------------
[ERROR] COMPILATION ERROR : 
[INFO] -------------------------------------------------------------
[ERROR] /srv/gump/public/workspace/tika/tika-parsers/src/main/java/org/apache/tika/parser/microsoft/OutlookExtractor.java:[205,37] cannot find symbol
symbol  : constructor MAPIRtfAttribute(org.apache.poi.hsmf.datatypes.MAPIProperty,org.apache.poi.hsmf.datatypes.Types.MAPIType,byte[])
location: class org.apache.poi.hmef.attribute.MAPIRtfAttribute
[INFO] 1 error
[INFO] -------------------------------------------------------------
[INFO] ------------------------------------------------------------------------
[ERROR] BUILD FAILURE
[INFO] ------------------------------------------------------------------------
[INFO] Compilation failure
/srv/gump/public/workspace/tika/tika-parsers/src/main/java/org/apache/tika/parser/microsoft/OutlookExtractor.java:[205,37] cannot find symbol
symbol  : constructor MAPIRtfAttribute(org.apache.poi.hsmf.datatypes.MAPIProperty,org.apache.poi.hsmf.datatypes.Types.MAPIType,byte[])
location: class org.apache.poi.hmef.attribute.MAPIRtfAttribute

[INFO] ------------------------------------------------------------------------
[INFO] For more information, run Maven with the -e switch
[INFO] ------------------------------------------------------------------------
[INFO] Total time: 37 seconds
[INFO] Finished at: Tue Jul 31 19:12:03 UTC 2012
[INFO] Final Memory: 33M/107M
[INFO] ------------------------------------------------------------------------
---------------------------------------------

To subscribe to this information via syndicated feeds:
- RSS: http://vmgump.apache.org/gump/public/tika/tika-parsers/rss.xml
- Atom: http://vmgump.apache.org/gump/public/tika/tika-parsers/atom.xml

============================== Gump Tracking Only ===
Produced by Apache Gump(TM) version 2.3.
Gump Run 05001231072012, vmgump.apache.org:vmgump:05001231072012
Gump E-mail Identifier (unique within run) #11.

*********************************************************** G U M P
[GUMP@vmgump]: Project tika-reactor (in module tika) failed
To whom it may engage...
        
This is an automated request, but not an unsolicited one. For 
more information please visit http://gump.apache.org/nagged.html, 
and/or contact the folk at general@gump.apache.org.

Project tika-reactor has an issue affecting its community integration.
This issue affects 1 projects.
The current state of this project is 'Failed', with reason 'Build Failed'.
For reference only, the following projects are affected by this:
    - tika-reactor :  Apache Tika is a toolkit for detecting and extracting metada...


Full details are available at:
    http://vmgump.apache.org/gump/public/tika/tika-reactor/index.html

That said, some information snippets are provided here.

The following annotations (debug/informational/warning/error messages) were provided:
 -INFO- Optional dependency google-guava failed with reason build failed
 -INFO- Optional dependency tika-parsers failed with reason build failed
 -DEBUG- (Apache Gump generated) Apache Maven Settings in: /srv/gump/public/workspace/tika/gump_mvn_settings.xml
 -INFO- Failed with reason build failed
 -DEBUG- Maven POM in: /srv/gump/public/workspace/tika/pom.xml



The following work was performed:
http://vmgump.apache.org/gump/public/tika/tika-reactor/gump_work/build_tika_tika-reactor.html
Work Name: build_tika_tika-reactor (Type: Build)
Work ended in a state of : Failed
Elapsed: 22 secs
Command Line: /opt/maven2/bin/mvn --batch-mode -DskipTests=true --settings /srv/gump/public/workspace/tika/gump_mvn_settings.xml install 
[Working Directory: /srv/gump/public/workspace/tika]
M2_HOME: /opt/maven2
---------------------------------------------
67K downloaded  (clirr-core-0.6.jar)
[INFO] [clirr:check {execution: default}]
Downloading: http://localhost:8192/maven2/org/apache/tika/tika-core/1.0/tika-core-1.0.jar
453K downloaded  (tika-core-1.0.jar)
[WARNING] POM for 'biz.aQute:bndlib:pom:1.43.0:provided' is invalid.

Its dependencies (if any) will NOT be available to the current build.
[INFO] Succeeded with 0 errors; 0 warnings; and 0 other changes.
[INFO] [failsafe:verify {execution: default}]
[INFO] Tests are skipped.
[INFO] [install:install {execution: default-install}]
[INFO] Installing /srv/gump/public/workspace/tika/tika-core/target/tika-core-1.3-SNAPSHOT.jar to /srv/gump/public/workspace/mvnlocalrepo/shared/org/apache/tika/tika-core/1.3-SNAPSHOT/tika-core-1.3-SNAPSHOT.jar
[INFO] [bundle:install {execution: default-install}]
[INFO] Installing org/apache/tika/tika-core/1.3-SNAPSHOT/tika-core-1.3-SNAPSHOT.jar
[INFO] Writing OBR metadata
[INFO] ------------------------------------------------------------------------
[INFO] Building Apache Tika parsers
[INFO]    task-segment: [install]
[INFO] ------------------------------------------------------------------------
[INFO] [remote-resources:process {execution: default}]
[debug] execute contextualize
[INFO] [resources:resources {execution: default-resources}]
[INFO] Using 'UTF-8' encoding to copy filtered resources.
[INFO] Copying 4 resources
[INFO] Copying 3 resources
[INFO] [compiler:compile {execution: default-compile}]
[INFO] Compiling 6 source files to /srv/gump/public/workspace/tika/tika-parsers/target/classes
[INFO] -------------------------------------------------------------
[ERROR] COMPILATION ERROR : 
[INFO] -------------------------------------------------------------
[ERROR] /srv/gump/public/workspace/tika/tika-parsers/src/main/java/org/apache/tika/parser/microsoft/OutlookExtractor.java:[205,37] cannot find symbol
symbol  : constructor MAPIRtfAttribute(org.apache.poi.hsmf.datatypes.MAPIProperty,org.apache.poi.hsmf.datatypes.Types.MAPIType,byte[])
location: class org.apache.poi.hmef.attribute.MAPIRtfAttribute
[INFO] 1 error
[INFO] -------------------------------------------------------------
[INFO] ------------------------------------------------------------------------
[ERROR] BUILD FAILURE
[INFO] ------------------------------------------------------------------------
[INFO] Compilation failure
/srv/gump/public/workspace/tika/tika-parsers/src/main/java/org/apache/tika/parser/microsoft/OutlookExtractor.java:[205,37] cannot find symbol
symbol  : constructor MAPIRtfAttribute(org.apache.poi.hsmf.datatypes.MAPIProperty,org.apache.poi.hsmf.datatypes.Types.MAPIType,byte[])
location: class org.apache.poi.hmef.attribute.MAPIRtfAttribute

[INFO] ------------------------------------------------------------------------
[INFO] For more information, run Maven with the -e switch
[INFO] ------------------------------------------------------------------------
[INFO] Total time: 21 seconds
[INFO] Finished at: Tue Jul 31 19:49:01 UTC 2012
[INFO] Final Memory: 59M/142M
[INFO] ------------------------------------------------------------------------
---------------------------------------------

To subscribe to this information via syndicated feeds:
- RSS: http://vmgump.apache.org/gump/public/tika/tika-reactor/rss.xml
- Atom: http://vmgump.apache.org/gump/public/tika/tika-reactor/atom.xml

============================== Gump Tracking Only ===
Produced by Apache Gump(TM) version 2.3.
Gump Run 05001231072012, vmgump.apache.org:vmgump:05001231072012
Gump E-mail Identifier (unique within run) #12.

*********************************************************** G U M P
[GUMP@vmgump]: Project commons-jelly-tags-ant-test (in module commons-jelly) failed
To whom it may engage...
        
This is an automated request, but not an unsolicited one. For 
more information please visit http://gump.apache.org/nagged.html, 
and/or contact the folk at general@gump.apache.org.

Project commons-jelly-tags-ant-test has an issue affecting its community integration.
This issue affects 1 projects.
The current state of this project is 'Failed', with reason 'Build Failed'.
For reference only, the following projects are affected by this:
    - commons-jelly-tags-ant-test :  Commons Jelly


Full details are available at:
    http://vmgump.apache.org/gump/public/commons-jelly/commons-jelly-tags-ant-test/index.html

That said, some information snippets are provided here.

The following annotations (debug/informational/warning/error messages) were provided:
 -DEBUG- Dependency on ant exists, no need to add for property maven.jar.ant-optional.
 -DEBUG- Dependency on xml-xerces exists, no need to add for property maven.jar.xerces.
 -DEBUG- Dependency on commons-jexl-1.x exists, no need to add for property maven.jar.commons-jexl.
 -WARNING- Overriding Maven properties: [/srv/gump/public/workspace/commons-jelly/jelly-tags/ant/build.properties]
 -DEBUG- (Apache Gump generated) Apache Maven Properties in: /srv/gump/public/workspace/commons-jelly/jelly-tags/ant/build.properties
 -INFO- Failed with reason build failed
 -DEBUG- Maven POM in: /srv/gump/public/workspace/commons-jelly/jelly-tags/ant/project.xml
 -DEBUG- Maven project properties in: /srv/gump/public/workspace/commons-jelly/jelly-tags/ant/project.properties
 -INFO- Project Reports in: /srv/gump/public/workspace/commons-jelly/jelly-tags/ant/target/test-reports



The following work was performed:
http://vmgump.apache.org/gump/public/commons-jelly/commons-jelly-tags-ant-test/gump_work/build_commons-jelly_commons-jelly-tags-ant-test.html
Work Name: build_commons-jelly_commons-jelly-tags-ant-test (Type: Build)
Work ended in a state of : Failed
Elapsed: 9 secs
Command Line: maven --offline jar 
[Working Directory: /srv/gump/public/workspace/commons-jelly/jelly-tags/ant]
---------------------------------------------
    [junit] Actual expression: (${foo4.1})=(null)
    [junit] 	at org.apache.commons.jelly.tags.junit.AssertTagSupport.fail(AssertTagSupport.java:44)
    [junit] 	at org.apache.commons.jelly.tags.junit.AssertTagSupport.failNotEquals(AssertTagSupport.java:77)
    [junit] 	at org.apache.commons.jelly.tags.junit.AssertEqualsTag.doTag(AssertEqualsTag.java:56)
    [junit] 	at org.apache.commons.jelly.impl.TagScript.run(TagScript.java:267)
    [junit] 	at org.apache.commons.jelly.impl.ScriptBlock.run(ScriptBlock.java:96)
    [junit] 	at org.apache.commons.jelly.tags.junit.CaseTag$1.runTest(CaseTag.java:60)
    [junit] 
    [junit] 
    [junit] Testcase: startUpReadWrite(org.apache.commons.jelly.tags.junit.CaseTag$1):	Caused an ERROR
    [junit] file:/srv/gump/public/workspace/commons-jelly/jelly-tags/ant/target/test-classes/org/apache/commons/jelly/ant/suite.jelly:98:5: <test:assertEquals> file:/srv/gump/public/workspace/commons-jelly/jelly-tags/ant/target/test-classes/org/apache/commons/jelly/ant/suite.jelly:98:5: <test:assertEquals>  expected:[bar5] but was:[null]
    [junit] Expected expression: (bar5)=(bar5)
    [junit] Actual expression: (${foo5.1})=(null)
    [junit] org.apache.commons.jelly.JellyTagException: file:/srv/gump/public/workspace/commons-jelly/jelly-tags/ant/target/test-classes/org/apache/commons/jelly/ant/suite.jelly:98:5: <test:assertEquals> file:/srv/gump/public/workspace/commons-jelly/jelly-tags/ant/target/test-classes/org/apache/commons/jelly/ant/suite.jelly:98:5: <test:assertEquals>  expected:[bar5] but was:[null]
    [junit] Expected expression: (bar5)=(bar5)
    [junit] Actual expression: (${foo5.1})=(null)
    [junit] 	at org.apache.commons.jelly.impl.TagScript.handleException(TagScript.java:732)
    [junit] 	at org.apache.commons.jelly.impl.TagScript.run(TagScript.java:287)
    [junit] 	at org.apache.commons.jelly.impl.ScriptBlock.run(ScriptBlock.java:96)
    [junit] 	at org.apache.commons.jelly.tags.junit.CaseTag$1.runTest(CaseTag.java:60)
    [junit] Caused by: org.apache.commons.jelly.tags.junit.JellyAssertionFailedError: file:/srv/gump/public/workspace/commons-jelly/jelly-tags/ant/target/test-classes/org/apache/commons/jelly/ant/suite.jelly:98:5: <test:assertEquals>  expected:[bar5] but was:[null]
    [junit] Expected expression: (bar5)=(bar5)
    [junit] Actual expression: (${foo5.1})=(null)
    [junit] 	at org.apache.commons.jelly.tags.junit.AssertTagSupport.fail(AssertTagSupport.java:44)
    [junit] 	at org.apache.commons.jelly.tags.junit.AssertTagSupport.failNotEquals(AssertTagSupport.java:77)
    [junit] 	at org.apache.commons.jelly.tags.junit.AssertEqualsTag.doTag(AssertEqualsTag.java:56)
    [junit] 	at org.apache.commons.jelly.impl.TagScript.run(TagScript.java:267)
    [junit] Root cause
    [junit] org.apache.commons.jelly.tags.junit.JellyAssertionFailedError: file:/srv/gump/public/workspace/commons-jelly/jelly-tags/ant/target/test-classes/org/apache/commons/jelly/ant/suite.jelly:98:5: <test:assertEquals>  expected:[bar5] but was:[null]
    [junit] Expected expression: (bar5)=(bar5)
    [junit] Actual expression: (${foo5.1})=(null)
    [junit] 	at org.apache.commons.jelly.tags.junit.AssertTagSupport.fail(AssertTagSupport.java:44)
    [junit] 	at org.apache.commons.jelly.tags.junit.AssertTagSupport.failNotEquals(AssertTagSupport.java:77)
    [junit] 	at org.apache.commons.jelly.tags.junit.AssertEqualsTag.doTag(AssertEqualsTag.java:56)
    [junit] 	at org.apache.commons.jelly.impl.TagScript.run(TagScript.java:267)
    [junit] 	at org.apache.commons.jelly.impl.ScriptBlock.run(ScriptBlock.java:96)
    [junit] 	at org.apache.commons.jelly.tags.junit.CaseTag$1.runTest(CaseTag.java:60)
    [junit] 
    [junit] 
    [junit] [ERROR] TEST org.apache.commons.jelly.ant.TestJelly FAILED

BUILD FAILED
File...... /home/gump/.maven/cache/maven-test-plugin-1.6.2/plugin.jelly
Element... fail
Line...... 181
Column.... 54
There were test failures.
Total time: 9 seconds
Finished at: Tue Jul 31 19:56:34 UTC 2012

---------------------------------------------

To subscribe to this information via syndicated feeds:
- RSS: http://vmgump.apache.org/gump/public/commons-jelly/commons-jelly-tags-ant-test/rss.xml
- Atom: http://vmgump.apache.org/gump/public/commons-jelly/commons-jelly-tags-ant-test/atom.xml

============================== Gump Tracking Only ===
Produced by Apache Gump(TM) version 2.3.
Gump Run 05001231072012, vmgump.apache.org:vmgump:05001231072012
Gump E-mail Identifier (unique within run) #14.

*********************************************************** G U M P
[GUMP@vmgump]: Project cocoon-optional (in module cocoon3) failed
To whom it may engage...
        
This is an automated request, but not an unsolicited one. For 
more information please visit http://gump.apache.org/nagged.html, 
and/or contact the folk at general@gump.apache.org.

Project cocoon-optional has an issue affecting its community integration.
This issue affects 5 projects.
The current state of this project is 'Failed', with reason 'Build Failed'.
For reference only, the following projects are affected by this:
    - cocoon-all :  Java XML Framework
    - cocoon-databases :  Java XML Framework
    - cocoon-optional :  Java XML Framework
    - cocoon-optional-test :  Java XML Framework
    - cocoon3-reactor :  Java XML Framework


Full details are available at:
    http://vmgump.apache.org/gump/public/cocoon3/cocoon-optional/index.html

That said, some information snippets are provided here.

The following annotations (debug/informational/warning/error messages) were provided:
 -DEBUG- Sole jar output [cocoon-optional-*[0-9T].jar] identifier set to project name
 -INFO- Optional dependency solr prerequisite failed with reason build failed
 -INFO- Optional dependency tika-reactor failed with reason build failed
 -DEBUG- (Apache Gump generated) Apache Maven Settings in: /srv/gump/public/workspace/cocoon3/cocoon-optional/gump_mvn_settings.xml
 -INFO- Failed with reason build failed
 -DEBUG- Maven POM in: /srv/gump/public/workspace/cocoon3/cocoon-optional/pom.xml
 -DEBUG- Extracted fallback artifacts from Gump Repository



The following work was performed:
http://vmgump.apache.org/gump/public/cocoon3/cocoon-optional/gump_work/build_cocoon3_cocoon-optional.html
Work Name: build_cocoon3_cocoon-optional (Type: Build)
Work ended in a state of : Failed
Elapsed: 52 secs
Command Line: /opt/maven2/bin/mvn --batch-mode -DskipTests=true --settings /srv/gump/public/workspace/cocoon3/cocoon-optional/gump_mvn_settings.xml install 
[Working Directory: /srv/gump/public/workspace/cocoon3/cocoon-optional]
M2_HOME: /opt/maven2
---------------------------------------------
Downloading: http://localhost:8192/maven/2/org/apache/lucene/lucene-misc/3.6.0/lucene-misc-3.6.0.jar
50K downloaded  (lucene-misc-3.6.0.jar)
Downloading: http://localhost:8192/maven/2/org/apache/lucene/lucene-phonetic/3.6.0/lucene-phonetic-3.6.0.jar
[INFO] Unable to find resource 'org.apache.lucene:lucene-phonetic:jar:3.6.0' in repository maven2-repository.dev.java.net (http://download.java.net/maven/2/)
Downloading: http://localhost:8192/maven2/org/apache/lucene/lucene-phonetic/3.6.0/lucene-phonetic-3.6.0.jar
14K downloaded  (lucene-phonetic-3.6.0.jar)
Downloading: http://localhost:8192/maven/2/org/apache/lucene/lucene-spatial/3.6.0/lucene-spatial-3.6.0.jar
[INFO] Unable to find resource 'org.apache.lucene:lucene-spatial:jar:3.6.0' in repository maven2-repository.dev.java.net (http://download.java.net/maven/2/)
Downloading: http://localhost:8192/maven2/org/apache/lucene/lucene-spatial/3.6.0/lucene-spatial-3.6.0.jar
58K downloaded  (lucene-spatial-3.6.0.jar)
Downloading: http://localhost:8192/maven/2/org/apache/lucene/lucene-spellchecker/3.6.0/lucene-spellchecker-3.6.0.jar
[INFO] Unable to find resource 'org.apache.lucene:lucene-spellchecker:jar:3.6.0' in repository maven2-repository.dev.java.net (http://download.java.net/maven/2/)
Downloading: http://localhost:8192/maven2/org/apache/lucene/lucene-spellchecker/3.6.0/lucene-spellchecker-3.6.0.jar
102K downloaded  (lucene-spellchecker-3.6.0.jar)
Downloading: http://localhost:8192/maven/2/org/apache/lucene/lucene-grouping/3.6.0/lucene-grouping-3.6.0.jar
[INFO] Unable to find resource 'org.apache.lucene:lucene-grouping:jar:3.6.0' in repository maven2-repository.dev.java.net (http://download.java.net/maven/2/)
Downloading: http://localhost:8192/maven2/org/apache/lucene/lucene-grouping/3.6.0/lucene-grouping-3.6.0.jar
62K downloaded  (lucene-grouping-3.6.0.jar)
[INFO] [enforcer:enforce {execution: enforce-maven}]
[INFO] [remote-resources:process {execution: default}]
[debug] execute contextualize
[INFO] [resources:resources {execution: default-resources}]
[INFO] Using 'UTF-8' encoding to copy filtered resources.
[INFO] Copying 3 resources
[INFO] Copying 3 resources
[INFO] [compiler:compile {execution: default-compile}]
[INFO] Compiling 16 source files to /srv/gump/public/workspace/cocoon3/cocoon-optional/target/classes
[INFO] -------------------------------------------------------------
[ERROR] COMPILATION ERROR : 
[INFO] -------------------------------------------------------------
[ERROR] /srv/gump/public/workspace/cocoon3/cocoon-optional/src/main/java/org/apache/cocoon/optional/pipeline/components/sax/fop/FopSerializer.java:[37,60] cannot find symbol
symbol  : method newInstance()
location: class org.apache.fop.apps.FopFactory
[INFO] 1 error
[INFO] -------------------------------------------------------------
[INFO] ------------------------------------------------------------------------
[ERROR] BUILD FAILURE
[INFO] ------------------------------------------------------------------------
[INFO] Compilation failure
/srv/gump/public/workspace/cocoon3/cocoon-optional/src/main/java/org/apache/cocoon/optional/pipeline/components/sax/fop/FopSerializer.java:[37,60] cannot find symbol
symbol  : method newInstance()
location: class org.apache.fop.apps.FopFactory

[INFO] ------------------------------------------------------------------------
[INFO] For more information, run Maven with the -e switch
[INFO] ------------------------------------------------------------------------
[INFO] Total time: 50 seconds
[INFO] Finished at: Tue Jul 31 22:10:13 UTC 2012
[INFO] Final Memory: 55M/131M
[INFO] ------------------------------------------------------------------------
---------------------------------------------

To subscribe to this information via syndicated feeds:
- RSS: http://vmgump.apache.org/gump/public/cocoon3/cocoon-optional/rss.xml
- Atom: http://vmgump.apache.org/gump/public/cocoon3/cocoon-optional/atom.xml

============================== Gump Tracking Only ===
Produced by Apache Gump(TM) version 2.3.
Gump Run 05001231072012, vmgump.apache.org:vmgump:05001231072012
Gump E-mail Identifier (unique within run) #18.

*********************************************************** G U M P
[GUMP@vmgump]: Project james-mailbox (in module james-mailbox) failed
To whom it may engage...
        
This is an automated request, but not an unsolicited one. For 
more information please visit http://gump.apache.org/nagged.html, 
and/or contact the folk at general@gump.apache.org.

Project james-mailbox has an issue affecting its community integration.
This issue affects 2 projects.
The current state of this project is 'Failed', with reason 'Build Failed'.
For reference only, the following projects are affected by this:
    - james-mailbox :  A library providing a flexible Mailbox storage accessible by...
    - james-mailbox-test :  A library providing a flexible Mailbox storage accessible by...


Full details are available at:
    http://vmgump.apache.org/gump/public/james-mailbox/james-mailbox/index.html

That said, some information snippets are provided here.

The following annotations (debug/informational/warning/error messages) were provided:
 -INFO- Optional dependency openjpa prerequisite failed with reason build failed
 -WARNING- Overriding Maven settings: [/srv/gump/public/workspace/james-mailbox/gump_mvn_settings.xml]
 -DEBUG- (Apache Gump generated) Apache Maven Settings in: /srv/gump/public/workspace/james-mailbox/gump_mvn_settings.xml
 -INFO- Failed with reason build failed
 -DEBUG- Maven POM in: /srv/gump/public/workspace/james-mailbox/pom.xml
 -DEBUG- Extracted fallback artifacts from Gump Repository



The following work was performed:
http://vmgump.apache.org/gump/public/james-mailbox/james-mailbox/gump_work/build_james-mailbox_james-mailbox.html
Work Name: build_james-mailbox_james-mailbox (Type: Build)
Work ended in a state of : Failed
Elapsed: 31 secs
Command Line: /opt/maven3/bin/mvn --batch-mode -DskipTests=true --settings /srv/gump/public/workspace/james-mailbox/gump_mvn_settings.xml install 
[Working Directory: /srv/gump/public/workspace/james-mailbox]
M2_HOME: /opt/maven3
---------------------------------------------
[ERROR] doc.add(new Field(FIRST_TO_MAILBOX_DISPLAY_FIELD, firstToDisplay, Store.YES, Index.NOT_ANALYZED));
[ERROR] /srv/gump/public/workspace/james-mailbox/lucene/src/main/java/org/apache/james/mailbox/lucene/search/LuceneMessageSearchIndex.java:[597,24] internal error; cannot instantiate org.apache.lucene.document.Field.<init> at org.apache.lucene.document.Field to ()
[ERROR] /srv/gump/public/workspace/james-mailbox/lucene/src/main/java/org/apache/james/mailbox/lucene/search/LuceneMessageSearchIndex.java:[621,98] cannot find symbol
[ERROR] symbol: variable Index
[ERROR] doc.add(new Field(BODY_FIELD,  line.toUpperCase(Locale.ENGLISH),Store.NO, Index.ANALYZED));
[ERROR] /srv/gump/public/workspace/james-mailbox/lucene/src/main/java/org/apache/james/mailbox/lucene/search/LuceneMessageSearchIndex.java:[621,32] internal error; cannot instantiate org.apache.lucene.document.Field.<init> at org.apache.lucene.document.Field to ()
[ERROR] /srv/gump/public/workspace/james-mailbox/lucene/src/main/java/org/apache/james/mailbox/lucene/search/LuceneMessageSearchIndex.java:[802,19] cannot find symbol
[ERROR] symbol  : constructor TermRangeQuery(java.lang.String,java.lang.String,java.lang.String,boolean,boolean)
[ERROR] location: class org.apache.lucene.search.TermRangeQuery
[ERROR] /srv/gump/public/workspace/james-mailbox/lucene/src/main/java/org/apache/james/mailbox/lucene/search/LuceneMessageSearchIndex.java:[804,19] cannot find symbol
[ERROR] symbol  : constructor TermRangeQuery(java.lang.String,java.lang.String,java.lang.String,boolean,boolean)
[ERROR] location: class org.apache.lucene.search.TermRangeQuery
[ERROR] /srv/gump/public/workspace/james-mailbox/lucene/src/main/java/org/apache/james/mailbox/lucene/search/LuceneMessageSearchIndex.java:[901,52] cannot find symbol
[ERROR] symbol  : method open(org.apache.lucene.index.IndexWriter,boolean)
[ERROR] location: class org.apache.lucene.index.IndexReader
[ERROR] /srv/gump/public/workspace/james-mailbox/lucene/src/main/java/org/apache/james/mailbox/lucene/search/LuceneMessageSearchIndex.java:[932,28] cannot find symbol
[ERROR] symbol  : method close()
[ERROR] location: class org.apache.lucene.search.IndexSearcher
[ERROR] /srv/gump/public/workspace/james-mailbox/lucene/src/main/java/org/apache/james/mailbox/lucene/search/LuceneMessageSearchIndex.java:[1205,66] cannot find symbol
[ERROR] symbol  : method open(org.apache.lucene.index.IndexWriter,boolean)
[ERROR] location: class org.apache.lucene.index.IndexReader
[ERROR] /srv/gump/public/workspace/james-mailbox/lucene/src/main/java/org/apache/james/mailbox/lucene/search/LuceneMessageSearchIndex.java:[1239,132] cannot find symbol
[ERROR] symbol  : variable Index
[ERROR] location: class org.apache.james.mailbox.lucene.search.LuceneMessageSearchIndex<Id>
[ERROR] /srv/gump/public/workspace/james-mailbox/lucene/src/main/java/org/apache/james/mailbox/lucene/search/LuceneMessageSearchIndex.java:[1239,16] internal error; cannot instantiate org.apache.lucene.document.Field.<init> at org.apache.lucene.document.Field to ()
[ERROR] /srv/gump/public/workspace/james-mailbox/lucene/src/main/java/org/apache/james/mailbox/lucene/search/LuceneMessageSearchIndex.java:[1240,90] cannot find symbol
[ERROR] symbol  : variable Index
[ERROR] location: class org.apache.james.mailbox.lucene.search.LuceneMessageSearchIndex<Id>
[ERROR] /srv/gump/public/workspace/james-mailbox/lucene/src/main/java/org/apache/james/mailbox/lucene/search/LuceneMessageSearchIndex.java:[1240,16] internal error; cannot instantiate org.apache.lucene.document.Field.<init> at org.apache.lucene.document.Field to ()
[ERROR] /srv/gump/public/workspace/james-mailbox/lucene/src/main/java/org/apache/james/mailbox/lucene/search/LuceneMessageSearchIndex.java:[1241,20] cannot find symbol
[ERROR] symbol  : class NumericField
[ERROR] location: class org.apache.james.mailbox.lucene.search.LuceneMessageSearchIndex<Id>
[ERROR] /srv/gump/public/workspace/james-mailbox/lucene/src/main/java/org/apache/james/mailbox/lucene/search/LuceneMessageSearchIndex.java:[1258,72] cannot find symbol
[ERROR] symbol  : variable Index
[ERROR] location: class org.apache.james.mailbox.lucene.search.LuceneMessageSearchIndex<Id>
[ERROR] /srv/gump/public/workspace/james-mailbox/lucene/src/main/java/org/apache/james/mailbox/lucene/search/LuceneMessageSearchIndex.java:[1258,20] internal error; cannot instantiate org.apache.lucene.document.Field.<init> at org.apache.lucene.document.Field to ()
[ERROR] /srv/gump/public/workspace/james-mailbox/lucene/src/main/java/org/apache/james/mailbox/lucene/search/LuceneMessageSearchIndex.java:[1263,66] cannot find symbol
[ERROR] symbol  : variable Index
[ERROR] location: class org.apache.james.mailbox.lucene.search.LuceneMessageSearchIndex<Id>
[ERROR] /srv/gump/public/workspace/james-mailbox/lucene/src/main/java/org/apache/james/mailbox/lucene/search/LuceneMessageSearchIndex.java:[1263,20] internal error; cannot instantiate org.apache.lucene.document.Field.<init> at org.apache.lucene.document.Field to ()
[ERROR] -> [Help 1]
[ERROR] 
[ERROR] To see the full stack trace of the errors, re-run Maven with the -e switch.
[ERROR] Re-run Maven using the -X switch to enable full debug logging.
[ERROR] 
[ERROR] For more information about the errors and possible solutions, please read the following articles:
[ERROR] [Help 1] http://cwiki.apache.org/confluence/display/MAVEN/MojoFailureException
[ERROR] 
[ERROR] After correcting the problems, you can resume the build with the command
[ERROR]   mvn <goals> -rf :apache-james-mailbox-lucene
---------------------------------------------

To subscribe to this information via syndicated feeds:
- RSS: http://vmgump.apache.org/gump/public/james-mailbox/james-mailbox/rss.xml
- Atom: http://vmgump.apache.org/gump/public/james-mailbox/james-mailbox/atom.xml

============================== Gump Tracking Only ===
Produced by Apache Gump(TM) version 2.3.
Gump Run 05001231072012, vmgump.apache.org:vmgump:05001231072012
Gump E-mail Identifier (unique within run) #19.

*********************************************************** G U M P
[GUMP@vmgump]: Project camel-jms-test (in module camel) failed
To whom it may engage...
        
This is an automated request, but not an unsolicited one. For 
more information please visit http://gump.apache.org/nagged.html, 
and/or contact the folk at general@gump.apache.org.

Project camel-jms-test has an issue affecting its community integration.
This issue affects 1 projects.
The current state of this project is 'Failed', with reason 'Build Failed'.
For reference only, the following projects are affected by this:
    - camel-jms-test :  Integration framework based on known Enterprise Integration
...


Full details are available at:
    http://vmgump.apache.org/gump/public/camel/camel-jms-test/index.html

That said, some information snippets are provided here.

The following annotations (debug/informational/warning/error messages) were provided:
 -WARNING- Overriding Maven settings: [/srv/gump/public/workspace/camel/components/camel-jms/gump_mvn_settings.xml]
 -DEBUG- (Apache Gump generated) Apache Maven Settings in: /srv/gump/public/workspace/camel/components/camel-jms/gump_mvn_settings.xml
 -INFO- Failed with reason build failed
 -DEBUG- Maven POM in: /srv/gump/public/workspace/camel/components/camel-jms/pom.xml
 -INFO- Project Reports in: /srv/gump/public/workspace/camel/components/camel-jms/target/surefire-report
 -WARNING- No directory [/srv/gump/public/workspace/camel/components/camel-jms/target/surefire-report]



The following work was performed:
http://vmgump.apache.org/gump/public/camel/camel-jms-test/gump_work/build_camel_camel-jms-test.html
Work Name: build_camel_camel-jms-test (Type: Build)
Work ended in a state of : Failed
Elapsed: 21 mins 49 secs
Command Line: /opt/maven2/bin/mvn --batch-mode --settings /srv/gump/public/workspace/camel/components/camel-jms/gump_mvn_settings.xml test 
[Working Directory: /srv/gump/public/workspace/camel/components/camel-jms]
M2_HOME: /opt/maven2
---------------------------------------------
Running org.apache.camel.component.jms.tx.JMXTXUseOriginalBodyWithTXErrorHandlerTest
Tests run: 2, Failures: 0, Errors: 0, Skipped: 0, Time elapsed: 7.726 sec
Running org.apache.camel.component.jms.tx.JmsToJmsTransactedSecurityTest
Tests run: 2, Failures: 0, Errors: 0, Skipped: 0, Time elapsed: 9.783 sec
Running org.apache.camel.component.jms.tx.JmsToJmsTransactedTest
Tests run: 4, Failures: 0, Errors: 0, Skipped: 0, Time elapsed: 7.166 sec
Running org.apache.camel.component.jms.tx.QueueToProcessorTransactionTest
Tests run: 1, Failures: 0, Errors: 0, Skipped: 0, Time elapsed: 5.788 sec
Running org.apache.camel.component.jms.tx.QueueToQueueRequestReplyTransactionTest
Tests run: 1, Failures: 0, Errors: 0, Skipped: 0, Time elapsed: 11.939 sec
Running org.apache.camel.component.jms.tx.QueueToQueueTransactionTest
Tests run: 1, Failures: 0, Errors: 0, Skipped: 0, Time elapsed: 4.624 sec
Running org.apache.camel.component.jms.tx.QueueToQueueTransactionWithoutDefineTransactionManagerTest
Tests run: 1, Failures: 0, Errors: 0, Skipped: 0, Time elapsed: 3.32 sec
Running org.apache.camel.component.jms.tx.RouteIdTransactedTest
Tests run: 2, Failures: 0, Errors: 0, Skipped: 0, Time elapsed: 3.636 sec
Running org.apache.camel.component.jms.tx.TransactedAsyncUsingThreadsTest
Tests run: 2, Failures: 0, Errors: 0, Skipped: 0, Time elapsed: 4.684 sec
Running org.apache.camel.component.jms.tx.TransactionErrorHandlerBuilderAsSpringBeanTest
Tests run: 1, Failures: 0, Errors: 0, Skipped: 0, Time elapsed: 6.571 sec
Running org.apache.camel.component.jms.tx.TransactionErrorHandlerCustomerSpringParserTest
Tests run: 1, Failures: 0, Errors: 0, Skipped: 0, Time elapsed: 6.345 sec
Running org.apache.camel.component.jms.tx.TransactionInterceptSendToEndpointTest
Tests run: 1, Failures: 0, Errors: 0, Skipped: 0, Time elapsed: 5.748 sec
Running org.apache.camel.component.jms.tx.TransactionMinimalConfigurationTest
Tests run: 1, Failures: 0, Errors: 0, Skipped: 0, Time elapsed: 4.236 sec
Running org.apache.camel.component.jms.tx.XMLQueueToProcessorTransactionTest
Tests run: 1, Failures: 0, Errors: 0, Skipped: 0, Time elapsed: 5.899 sec
Running org.apache.camel.component.jms.tx.XMLQueueToQueueTransactionTest
Tests run: 1, Failures: 0, Errors: 0, Skipped: 0, Time elapsed: 5.813 sec

Results :

Failed tests: 

Tests run: 394, Failures: 1, Errors: 0, Skipped: 5

[INFO] ------------------------------------------------------------------------
[ERROR] BUILD FAILURE
[INFO] ------------------------------------------------------------------------
[INFO] There are test failures.

Please refer to /srv/gump/public/workspace/camel/components/camel-jms/target/surefire-reports for the individual test results.
[INFO] ------------------------------------------------------------------------
[INFO] For more information, run Maven with the -e switch
[INFO] ------------------------------------------------------------------------
[INFO] Total time: 21 minutes 48 seconds
[INFO] Finished at: Tue Jul 31 23:14:57 UTC 2012
[INFO] Final Memory: 34M/82M
[INFO] ------------------------------------------------------------------------
---------------------------------------------

To subscribe to this information via syndicated feeds:
- RSS: http://vmgump.apache.org/gump/public/camel/camel-jms-test/rss.xml
- Atom: http://vmgump.apache.org/gump/public/camel/camel-jms-test/atom.xml

============================== Gump Tracking Only ===
Produced by Apache Gump(TM) version 2.3.
Gump Run 05001231072012, vmgump.apache.org:vmgump:05001231072012
Gump E-mail Identifier (unique within run) #20.


--
Apache Gump
http://gump.apache.org/ [Instance: vmgump]

---------------------------------------------------------------------
To unsubscribe, e-mail: general-unsubscribe@gump.apache.org
For additional commands, e-mail: general-help@gump.apache.org


Mime
View raw message