gump-general mailing list archives

Site index · List index
Message view « Date » · « Thread »
Top « Date » · « Thread »
From g...@vmgump.apache.org
Subject BATCH: All dressed up, with nowhere to go...
Date Thu, 02 Aug 2012 22:48:42 GMT
Dear Gumpmeisters,
            
The following 3 notifys should have been sent

*********************************************************** G U M P
[GUMP@vmgump]: Project velocity-tools-generic-test (in module velocity-tools) failed
[GUMP@vmgump]: Project cocoon22-flowscript-impl (in module cocoon) failed
[GUMP@vmgump]: Project velocity-tools-reactor (in module velocity-tools) failed
*********************************************************** G U M P
[GUMP@vmgump]: Project velocity-tools-generic-test (in module velocity-tools) failed
To whom it may engage...
        
This is an automated request, but not an unsolicited one. For 
more information please visit http://gump.apache.org/nagged.html, 
and/or contact the folk at general@gump.apache.org.

Project velocity-tools-generic-test has an issue affecting its community integration.
This issue affects 1 projects.
The current state of this project is 'Failed', with reason 'Build Failed'.
For reference only, the following projects are affected by this:
    - velocity-tools-generic-test :  VelocityTools project


Full details are available at:
    http://vmgump.apache.org/gump/public/velocity-tools/velocity-tools-generic-test/index.html

That said, some information snippets are provided here.

The following annotations (debug/informational/warning/error messages) were provided:
 -WARNING- Overriding Maven settings: [/srv/gump/public/workspace/velocity-tools/velocity-tools-generic/gump_mvn_settings.xml]
 -DEBUG- (Apache Gump generated) Apache Maven Settings in: /srv/gump/public/workspace/velocity-tools/velocity-tools-generic/gump_mvn_settings.xml
 -INFO- Failed with reason build failed
 -DEBUG- Maven POM in: /srv/gump/public/workspace/velocity-tools/velocity-tools-generic/pom.xml



The following work was performed:
http://vmgump.apache.org/gump/public/velocity-tools/velocity-tools-generic-test/gump_work/build_velocity-tools_velocity-tools-generic-test.html
Work Name: build_velocity-tools_velocity-tools-generic-test (Type: Build)
Work ended in a state of : Failed
Elapsed: 9 secs
Command Line: /opt/maven2/bin/mvn --batch-mode --settings /srv/gump/public/workspace/velocity-tools/velocity-tools-generic/gump_mvn_settings.xml
test 
[Working Directory: /srv/gump/public/workspace/velocity-tools/velocity-tools-generic]
M2_HOME: /opt/maven2
---------------------------------------------
[INFO] Copying 3 resources
[INFO] [compiler:testCompile {execution: default-testCompile}]
[INFO] Nothing to compile - all classes are up to date
[INFO] [surefire:test {execution: default-test}]
[INFO] Surefire report directory: /srv/gump/public/workspace/velocity-tools/velocity-tools-generic/target/surefire-reports

-------------------------------------------------------
 T E S T S
-------------------------------------------------------
Running org.apache.velocity.tools.test.whitebox.ConfigTests
Aug 2, 2012 4:45:16 PM org.apache.commons.beanutils.converters.NumberConverter toNumber
WARNING:     IntegerConverter cannot handle conversion from 'String' to 'Number'
Tests run: 14, Failures: 0, Errors: 0, Skipped: 0, Time elapsed: 0.581 sec
Running org.apache.velocity.tools.test.whitebox.GenericToolsTests
Tests run: 7, Failures: 0, Errors: 1, Skipped: 0, Time elapsed: 0.205 sec <<< FAILURE!
Running org.apache.velocity.tools.generic.DisplayToolTests
Tests run: 36, Failures: 0, Errors: 0, Skipped: 0, Time elapsed: 0.086 sec
Running org.apache.velocity.tools.generic.LinkToolTests
Tests run: 69, Failures: 0, Errors: 0, Skipped: 0, Time elapsed: 0.139 sec
Running org.apache.velocity.tools.generic.LoopToolTests
Tests run: 21, Failures: 0, Errors: 0, Skipped: 0, Time elapsed: 0.029 sec
Running org.apache.velocity.tools.generic.DateToolTests
Tests run: 4, Failures: 0, Errors: 0, Skipped: 0, Time elapsed: 0.006 sec
Running org.apache.velocity.tools.generic.AlternatorToolTests
Tests run: 7, Failures: 0, Errors: 0, Skipped: 0, Time elapsed: 0.006 sec
Running org.apache.velocity.tools.generic.Veltools128Tests
Tests run: 2, Failures: 0, Errors: 0, Skipped: 0, Time elapsed: 0.188 sec
Running org.apache.velocity.tools.generic.ClassToolTests
Tests run: 26, Failures: 0, Errors: 0, Skipped: 0, Time elapsed: 0.043 sec

Results :

Tests in error: 
  testEscapeTool(org.apache.velocity.tools.test.whitebox.GenericToolsTests): org/apache/velocity/shaded/commons/lang/text/StrBuilder

Tests run: 186, Failures: 0, Errors: 1, Skipped: 0

[INFO] ------------------------------------------------------------------------
[ERROR] BUILD FAILURE
[INFO] ------------------------------------------------------------------------
[INFO] There are test failures.

Please refer to /srv/gump/public/workspace/velocity-tools/velocity-tools-generic/target/surefire-reports
for the individual test results.
[INFO] ------------------------------------------------------------------------
[INFO] For more information, run Maven with the -e switch
[INFO] ------------------------------------------------------------------------
[INFO] Total time: 8 seconds
[INFO] Finished at: Thu Aug 02 16:45:17 UTC 2012
[INFO] Final Memory: 21M/50M
[INFO] ------------------------------------------------------------------------
---------------------------------------------

To subscribe to this information via syndicated feeds:
- RSS: http://vmgump.apache.org/gump/public/velocity-tools/velocity-tools-generic-test/rss.xml
- Atom: http://vmgump.apache.org/gump/public/velocity-tools/velocity-tools-generic-test/atom.xml

============================== Gump Tracking Only ===
Produced by Apache Gump(TM) version 2.3.
Gump Run 06001202082012, vmgump.apache.org:vmgump:06001202082012
Gump E-mail Identifier (unique within run) #2.

*********************************************************** G U M P
[GUMP@vmgump]: Project cocoon22-flowscript-impl (in module cocoon) failed
To whom it may engage...
        
This is an automated request, but not an unsolicited one. For 
more information please visit http://gump.apache.org/nagged.html, 
and/or contact the folk at general@gump.apache.org.

Project cocoon22-flowscript-impl has an issue affecting its community integration.
This issue affects 3 projects.
The current state of this project is 'Failed', with reason 'Build Failed'.
For reference only, the following projects are affected by this:
    - cocoon22-flowscript-impl :  Java XML Framework
    - lenya-core-api :  Content Management System
    - lenya-reactor :  Content Management System


Full details are available at:
    http://vmgump.apache.org/gump/public/cocoon/cocoon22-flowscript-impl/index.html

That said, some information snippets are provided here.

The following annotations (debug/informational/warning/error messages) were provided:
 -DEBUG- (Apache Gump generated) Apache Maven Settings in: /srv/gump/public/workspace/cocoon/blocks/cocoon-flowscript/cocoon-flowscript-impl/gump_mvn_settings.xml
 -INFO- Failed with reason build failed
 -DEBUG- Maven POM in: /srv/gump/public/workspace/cocoon/blocks/cocoon-flowscript/cocoon-flowscript-impl/pom.xml
 -INFO- Failed to extract fallback artifacts from Gump Repository



The following work was performed:
http://vmgump.apache.org/gump/public/cocoon/cocoon22-flowscript-impl/gump_work/build_cocoon_cocoon22-flowscript-impl.html
Work Name: build_cocoon_cocoon22-flowscript-impl (Type: Build)
Work ended in a state of : Failed
Elapsed: 15 secs
Command Line: /opt/maven2/bin/mvn --batch-mode --settings /srv/gump/public/workspace/cocoon/blocks/cocoon-flowscript/cocoon-flowscript-impl/gump_mvn_settings.xml
install 
[Working Directory: /srv/gump/public/workspace/cocoon/blocks/cocoon-flowscript/cocoon-flowscript-impl]
M2_HOME: /opt/maven2
---------------------------------------------
[INFO] Scanning for projects...
[INFO] ------------------------------------------------------------------------
[INFO] Building Cocoon Flowscript Block Implementation
[INFO]    task-segment: [install]
[INFO] ------------------------------------------------------------------------
Downloading: http://localhost:8192/maven2/org/apache/cocoon/cocoon-expression-language-api/1.0.0/cocoon-expression-language-api-1.0.0.pom
2K downloaded  (cocoon-expression-language-api-1.0.0.pom)
Downloading: http://localhost:8192/maven2/org/apache/cocoon/cocoon-expression-language-api/1.0.0/cocoon-expression-language-api-1.0.0.jar
15K downloaded  (cocoon-expression-language-api-1.0.0.jar)
[INFO] [enforcer:enforce {execution: enforce-maven}]
[INFO] [remote-resources:process {execution: default}]
[debug] execute contextualize
[INFO] [resources:resources {execution: default-resources}]
[INFO] Using 'UTF-8' encoding to copy filtered resources.
[INFO] Copying 5 resources
[INFO] Copying 2 resources to META-INF
[INFO] Copying 3 resources
[INFO] [compiler:compile {execution: default-compile}]
[INFO] Compiling 20 source files to /srv/gump/public/workspace/cocoon/blocks/cocoon-flowscript/cocoon-flowscript-impl/target/classes
[INFO] -------------------------------------------------------------
[ERROR] COMPILATION ERROR : 
[INFO] -------------------------------------------------------------
[ERROR] /srv/gump/public/workspace/cocoon/blocks/cocoon-flowscript/cocoon-flowscript-impl/src/main/java/org/apache/cocoon/components/flow/javascript/ScriptablePropertyPointer.java:[163,19]
escape(java.lang.String) in org.apache.cocoon.components.flow.javascript.ScriptablePropertyPointer
cannot override escape(java.lang.String) in org.apache.commons.jxpath.ri.model.NodePointer;
attempting to assign weaker access privileges; was protected
[INFO] 1 error
[INFO] -------------------------------------------------------------
[INFO] ------------------------------------------------------------------------
[ERROR] BUILD FAILURE
[INFO] ------------------------------------------------------------------------
[INFO] Compilation failure
/srv/gump/public/workspace/cocoon/blocks/cocoon-flowscript/cocoon-flowscript-impl/src/main/java/org/apache/cocoon/components/flow/javascript/ScriptablePropertyPointer.java:[163,19]
escape(java.lang.String) in org.apache.cocoon.components.flow.javascript.ScriptablePropertyPointer
cannot override escape(java.lang.String) in org.apache.commons.jxpath.ri.model.NodePointer;
attempting to assign weaker access privileges; was protected

[INFO] ------------------------------------------------------------------------
[INFO] For more information, run Maven with the -e switch
[INFO] ------------------------------------------------------------------------
[INFO] Total time: 14 seconds
[INFO] Finished at: Thu Aug 02 19:34:59 UTC 2012
[INFO] Final Memory: 49M/118M
[INFO] ------------------------------------------------------------------------
---------------------------------------------

To subscribe to this information via syndicated feeds:
- RSS: http://vmgump.apache.org/gump/public/cocoon/cocoon22-flowscript-impl/rss.xml
- Atom: http://vmgump.apache.org/gump/public/cocoon/cocoon22-flowscript-impl/atom.xml

============================== Gump Tracking Only ===
Produced by Apache Gump(TM) version 2.3.
Gump Run 06001202082012, vmgump.apache.org:vmgump:06001202082012
Gump E-mail Identifier (unique within run) #3.

*********************************************************** G U M P
[GUMP@vmgump]: Project velocity-tools-reactor (in module velocity-tools) failed
To whom it may engage...
        
This is an automated request, but not an unsolicited one. For 
more information please visit http://gump.apache.org/nagged.html, 
and/or contact the folk at general@gump.apache.org.

Project velocity-tools-reactor has an issue affecting its community integration.
This issue affects 1 projects.
The current state of this project is 'Failed', with reason 'Build Failed'.
For reference only, the following projects are affected by this:
    - velocity-tools-reactor :  VelocityTools project


Full details are available at:
    http://vmgump.apache.org/gump/public/velocity-tools/velocity-tools-reactor/index.html

That said, some information snippets are provided here.

The following annotations (debug/informational/warning/error messages) were provided:
 -INFO- Optional dependency rhino prerequisite failed with reason build failed
 -INFO- Optional dependency commons-chain2 failed with reason build failed
 -INFO- Optional dependency httpunit failed with reason build failed
 -WARNING- Overriding Maven settings: [/srv/gump/public/workspace/velocity-tools/gump_mvn_settings.xml]
 -DEBUG- (Apache Gump generated) Apache Maven Settings in: /srv/gump/public/workspace/velocity-tools/gump_mvn_settings.xml
 -INFO- Failed with reason build failed
 -DEBUG- Maven POM in: /srv/gump/public/workspace/velocity-tools/pom.xml
 -INFO- Failed to extract fallback artifacts from Gump Repository



The following work was performed:
http://vmgump.apache.org/gump/public/velocity-tools/velocity-tools-reactor/gump_work/build_velocity-tools_velocity-tools-reactor.html
Work Name: build_velocity-tools_velocity-tools-reactor (Type: Build)
Work ended in a state of : Failed
Elapsed: 33 secs
Command Line: /opt/maven2/bin/mvn --batch-mode -DskipTests=true --settings /srv/gump/public/workspace/velocity-tools/gump_mvn_settings.xml
package 
[Working Directory: /srv/gump/public/workspace/velocity-tools]
M2_HOME: /opt/maven2
---------------------------------------------
25K downloaded  (sslext-1.2-0.jar)
182K downloaded  (commons-validator-1.3.1.jar)
Downloading: http://localhost:8192/maven2/org/apache/struts/struts-core/1.3.8/struts-core-1.3.8.jar
195K downloaded  (commons-digester-1.8.jar)
87K downloaded  (commons-chain-1.1.jar)
349K downloaded  (antlr-2.7.2.jar)
321K downloaded  (struts-core-1.3.8.jar)
Downloading: http://localhost:8192/maven2/org/apache/struts/struts-taglib/1.3.8/struts-taglib-1.3.8.jar
245K downloaded  (struts-taglib-1.3.8.jar)
Downloading: http://localhost:8192/maven2/org/apache/struts/struts-tiles/1.3.8/struts-tiles-1.3.8.jar
116K downloaded  (struts-tiles-1.3.8.jar)
[debug] execute contextualize
[INFO] [resources:resources {execution: default-resources}]
[INFO] Using 'UTF-8' encoding to copy filtered resources.
[INFO] Copying 0 resource
[INFO] Copying 3 resources
[INFO] [compiler:compile {execution: default-compile}]
[INFO] Compiling 10 source files to /srv/gump/public/workspace/velocity-tools/velocity-tools-struts/target/classes
[INFO] -------------------------------------------------------------
[ERROR] COMPILATION ERROR : 
[INFO] -------------------------------------------------------------
[ERROR] /srv/gump/public/workspace/velocity-tools/velocity-tools-struts/src/main/java/org/apache/velocity/tools/struts/ValidatorTool.java:[33,30]
package org.apache.commons.lang does not exist
[ERROR] /srv/gump/public/workspace/velocity-tools/velocity-tools-struts/src/main/java/org/apache/velocity/tools/struts/ValidatorTool.java:[526,30]
cannot find symbol
symbol  : variable StringEscapeUtils
location: class org.apache.velocity.tools.struts.ValidatorTool
[ERROR] /srv/gump/public/workspace/velocity-tools/velocity-tools-struts/src/main/java/org/apache/velocity/tools/struts/ValidatorTool.java:[555,42]
cannot find symbol
symbol  : variable StringEscapeUtils
location: class org.apache.velocity.tools.struts.ValidatorTool
[INFO] 3 errors 
[INFO] -------------------------------------------------------------
[INFO] ------------------------------------------------------------------------
[ERROR] BUILD FAILURE
[INFO] ------------------------------------------------------------------------
[INFO] Compilation failure

/srv/gump/public/workspace/velocity-tools/velocity-tools-struts/src/main/java/org/apache/velocity/tools/struts/ValidatorTool.java:[33,30]
package org.apache.commons.lang does not exist
/srv/gump/public/workspace/velocity-tools/velocity-tools-struts/src/main/java/org/apache/velocity/tools/struts/ValidatorTool.java:[526,30]
cannot find symbol
symbol  : variable StringEscapeUtils
location: class org.apache.velocity.tools.struts.ValidatorTool
/srv/gump/public/workspace/velocity-tools/velocity-tools-struts/src/main/java/org/apache/velocity/tools/struts/ValidatorTool.java:[555,42]
cannot find symbol
symbol  : variable StringEscapeUtils
location: class org.apache.velocity.tools.struts.ValidatorTool

[INFO] ------------------------------------------------------------------------
[INFO] For more information, run Maven with the -e switch
[INFO] ------------------------------------------------------------------------
[INFO] Total time: 31 seconds
[INFO] Finished at: Thu Aug 02 19:40:52 UTC 2012
[INFO] Final Memory: 64M/154M
[INFO] ------------------------------------------------------------------------
---------------------------------------------

To subscribe to this information via syndicated feeds:
- RSS: http://vmgump.apache.org/gump/public/velocity-tools/velocity-tools-reactor/rss.xml
- Atom: http://vmgump.apache.org/gump/public/velocity-tools/velocity-tools-reactor/atom.xml

============================== Gump Tracking Only ===
Produced by Apache Gump(TM) version 2.3.
Gump Run 06001202082012, vmgump.apache.org:vmgump:06001202082012
Gump E-mail Identifier (unique within run) #4.


--
Apache Gump
http://gump.apache.org/ [Instance: vmgump]

---------------------------------------------------------------------
To unsubscribe, e-mail: general-unsubscribe@gump.apache.org
For additional commands, e-mail: general-help@gump.apache.org


Mime
View raw message