gump-general mailing list archives

Site index · List index
Message view « Date » · « Thread »
Top « Date » · « Thread »
From g...@vmgump.apache.org
Subject BATCH: All dressed up, with nowhere to go...
Date Thu, 01 May 2014 10:05:11 GMT
Dear Gumpmeisters,
            
The following 11 notifys should have been sent

*********************************************************** G U M P
[GUMP@vmgump]: Project ooxml-schemas (in module poi) failed
[GUMP@vmgump]: Project commons-collections (in module commons-collections-3.x) failed
[GUMP@vmgump]: Project commons-exec (in module apache-commons) failed
[GUMP@vmgump]: Project google-guava-parent (in module google-guava) failed
[GUMP@vmgump]: Project pdfbox-parent (in module pdfbox) failed
[GUMP@vmgump]: Project tika-parent (in module tika) failed
[GUMP@vmgump]: Project commons-jxpath (in module apache-commons) failed
[GUMP@vmgump]: Project rat (in module rat) failed
[GUMP@vmgump]: Project commons-cli (in module apache-commons) failed
[GUMP@vmgump]: Project google-guava (in module google-guava) failed
[GUMP@vmgump]: Project checkstyle (in module checkstyle) failed
*********************************************************** G U M P
[GUMP@vmgump]: Project ooxml-schemas (in module poi) failed
To whom it may engage...
        
This is an automated request, but not an unsolicited one. For 
more information please visit http://gump.apache.org/nagged.html, 
and/or contact the folk at general@gump.apache.org.

Project ooxml-schemas has an issue affecting its community integration.
This issue affects 5 projects.
The current state of this project is 'Failed', with reason 'Build Failed'.
For reference only, the following projects are affected by this:
    - ooxml-schemas :  POI
    - org.apache.poi :  POI
    - poi :  POI
    - poi-ooxml-schemas :  POI
    - poi-test :  POI


Full details are available at:
    http://vmgump.apache.org/gump/public/poi/ooxml-schemas/index.html

That said, some information snippets are provided here.

The following annotations (debug/informational/warning/error messages) were provided:
 -DEBUG- Sole jar output [ooxml-schemas-[0-9]*[0-9T].jar] identifier set to project name
 -INFO- Failed with reason build failed
 -INFO- Failed to extract fallback artifacts from Gump Repository



The following work was performed:
http://vmgump.apache.org/gump/public/poi/ooxml-schemas/gump_work/build_poi_ooxml-schemas.html
Work Name: build_poi_ooxml-schemas (Type: Build)
Work ended in a state of : Failed
Elapsed: 1 min 3 secs
Command Line: /usr/lib/jvm/java-7-oracle/bin/java -Djava.awt.headless=true -Dbuild.sysclasspath=only -Dant.build.clonevm=true org.apache.tools.ant.Main -Dgump.merge=/srv/gump/public/gump/work/merge.xml compile-ooxml-xsds 
[Working Directory: /srv/gump/public/workspace/poi]
CLASSPATH: /usr/lib/jvm/java-7-oracle/lib/tools.jar:/srv/gump/public/workspace/ant/dist/lib/ant.jar:/srv/gump/public/workspace/ant/dist/lib/ant-launcher.jar:/srv/gump/public/workspace/ant/dist/lib/ant-jmf.jar:/srv/gump/public/workspace/ant/dist/lib/ant-junit.jar:/srv/gump/public/workspace/ant/dist/lib/ant-junit4.jar:/srv/gump/public/workspace/ant/dist/lib/ant-swing.jar:/srv/gump/public/workspace/ant/dist/lib/ant-apache-resolver.jar:/srv/gump/public/workspace/ant/dist/lib/ant-apache-xalan2.jar:/srv/gump/public/workspace/xml-commons/java/build/resolver.jar:/srv/gump/public/workspace/poi/ooxml-lib/xmlbeans-2.3.0.jar
---------------------------------------------
Buildfile: /srv/gump/public/workspace/poi/build.xml

check-jars:

fetch-jars:

check-ooxml-xsds:

fetch-ooxml-xsds:

check-compiled-ooxml-xsds:

compile-ooxml-xsds:
    [mkdir] Created dir: /srv/gump/public/workspace/poi/build/ooxml-xsds
    [unzip] Expanding: /srv/gump/public/workspace/poi/ooxml-lib/OfficeOpenXML-XMLSchema.zip into /srv/gump/public/workspace/poi/build/ooxml-xsds
  [xmlbean] Time to build schema type system: 7.76 seconds
  [xmlbean] Time to generate code: 7.139 seconds
  [xmlbean] Compiling 4382 source files to /tmp/xbean7409426025686070993.d/classes
Killed
---------------------------------------------

To subscribe to this information via syndicated feeds:
- RSS: http://vmgump.apache.org/gump/public/poi/ooxml-schemas/rss.xml
- Atom: http://vmgump.apache.org/gump/public/poi/ooxml-schemas/atom.xml

============================== Gump Tracking Only ===
Produced by Apache Gump(TM) version 2.3.
Gump Run 20140501060006, vmgump.apache.org:vmgump:20140501060006
Gump E-mail Identifier (unique within run) #1.

*********************************************************** G U M P
[GUMP@vmgump]: Project commons-collections (in module commons-collections-3.x) failed
To whom it may engage...
        
This is an automated request, but not an unsolicited one. For 
more information please visit http://gump.apache.org/nagged.html, 
and/or contact the folk at general@gump.apache.org.

Project commons-collections has an issue affecting its community integration.
This issue affects 22 projects.
The current state of this project is 'Failed', with reason 'Build Failed'.
For reference only, the following projects are affected by this:
    - commons-beanutils :  Bean Utilities
    - commons-collections :  Collections
    - commons-collections-test :  Collections
    - commons-collections-testframework :  Apache Commons Collections 3.x
    - commons-dbcp :  Object Pooling
    - commons-digester :  XML to Java Object Configuration
    - commons-modeler :  Modeler MBeans
    - commons-pool :  Object Pooling
    - commons-validator :  Validation Framework
    - forrest-core :  Apache Forrest software is a publishing framework that trans...
    - forrest-rat :  Apache Forrest software is a publishing framework that trans...
    - forrest-test :  Apache Forrest software is a publishing framework that trans...
    - forrest-test-basic :  Apache Forrest software is a publishing framework that trans...
    - forrest-test-deploy-plugins :  Apache Forrest software is a publishing framework that trans...
    - tomcat-tc6 :  Java Servlet 2.5 & Server Pages JSP 2.1 implementation (for ...
    - tomcat-tc7.0.x :  Tomcat 7.x, a web server implementing Java Servlet 3.0,
    ...
    - tomcat-tc7.0.x-dbcp :  Tomcat 7.x, a web server implementing Java Servlet 3.0,
    ...
    - tomcat-tc7.0.x-test :  Tomcat 7.x, a web server implementing Java Servlet 3.0,
    ...
    - tomcat-tc7.0.x-validate :  Tomcat 7.x, a web server implementing Java Servlet 3.0,
    ...
    - tomcat-trunk-validate :  Tomcat 8.x, a web server implementing the Java Servlet 3.1,
...
    - xml-fop-test :  XSL-FO (Formatting Objects) processor
    - xmlgraphics-commons-test :  Apache XML Graphics Commons - Common Components for Batik an...


Full details are available at:
    http://vmgump.apache.org/gump/public/commons-collections-3.x/commons-collections/index.html

That said, some information snippets are provided here.

The following annotations (debug/informational/warning/error messages) were provided:
 -DEBUG- (Apache Gump generated) Apache Maven Settings in: /srv/gump/public/workspace/commons-collections-3.x/gump_mvn_settings.xml
 -INFO- Failed with reason build failed
 -DEBUG- Maven POM in: /srv/gump/public/workspace/commons-collections-3.x/pom.xml
 -DEBUG- Extracted fallback artifacts from Gump Repository



The following work was performed:
http://vmgump.apache.org/gump/public/commons-collections-3.x/commons-collections/gump_work/build_commons-collections-3.x_commons-collections.html
Work Name: build_commons-collections-3.x_commons-collections (Type: Build)
Work ended in a state of : Failed
Elapsed: 4 secs
Command Line: /opt/maven2/bin/mvn --batch-mode -DskipTests=true --settings /srv/gump/public/workspace/commons-collections-3.x/gump_mvn_settings.xml package 
[Working Directory: /srv/gump/public/workspace/commons-collections-3.x]
M2_HOME: /opt/maven2
---------------------------------------------
[INFO] Scanning for projects...
[INFO] ------------------------------------------------------------------------
[INFO] Building Commons Collections
[INFO]    task-segment: [package]
[INFO] ------------------------------------------------------------------------
Downloading: http://localhost:8192/maven2/org/apache/maven/plugins/maven-resources-plugin/2.3/maven-resources-plugin-2.3.pom
[WARNING] Unable to get resource 'org.apache.maven.plugins:maven-resources-plugin:pom:2.3' from repository central (http://repo1.maven.org/maven2): Error transferring file: Connection refused
Downloading: http://localhost:8192/maven2/org/apache/maven/plugins/maven-resources-plugin/2.3/maven-resources-plugin-2.3.pom
[WARNING] Unable to get resource 'org.apache.maven.plugins:maven-resources-plugin:pom:2.3' from repository central (http://repo1.maven.org/maven2): Error transferring file: Connection refused
[INFO] ------------------------------------------------------------------------
[ERROR] BUILD ERROR
[INFO] ------------------------------------------------------------------------
[INFO] Error building POM (may not be this project's POM).


Project ID: org.apache.maven.plugins:maven-resources-plugin

Reason: POM 'org.apache.maven.plugins:maven-resources-plugin' not found in repository: Unable to download the artifact from any repository

  org.apache.maven.plugins:maven-resources-plugin:pom:2.3

from the specified remote repositories:
  gump-central (http://localhost:8192/maven2),
  gump-apache.snapshots (http://localhost:8192/repo/m2-snapshot-repository)

 for project org.apache.maven.plugins:maven-resources-plugin


[INFO] ------------------------------------------------------------------------
[INFO] For more information, run Maven with the -e switch
[INFO] ------------------------------------------------------------------------
[INFO] Total time: 1 second
[INFO] Finished at: Thu May 01 08:39:36 UTC 2014
[INFO] Final Memory: 3M/15M
[INFO] ------------------------------------------------------------------------
---------------------------------------------

To subscribe to this information via syndicated feeds:
- RSS: http://vmgump.apache.org/gump/public/commons-collections-3.x/commons-collections/rss.xml
- Atom: http://vmgump.apache.org/gump/public/commons-collections-3.x/commons-collections/atom.xml

============================== Gump Tracking Only ===
Produced by Apache Gump(TM) version 2.3.
Gump Run 20140501060006, vmgump.apache.org:vmgump:20140501060006
Gump E-mail Identifier (unique within run) #2.

*********************************************************** G U M P
[GUMP@vmgump]: Project commons-exec (in module apache-commons) failed
To whom it may engage...
        
This is an automated request, but not an unsolicited one. For 
more information please visit http://gump.apache.org/nagged.html, 
and/or contact the folk at general@gump.apache.org.

Project commons-exec has an issue affecting its community integration.
This issue affects 1 projects.
The current state of this project is 'Failed', with reason 'Build Failed'.
For reference only, the following projects are affected by this:
    - commons-exec :  Commons Exec Package


Full details are available at:
    http://vmgump.apache.org/gump/public/apache-commons/commons-exec/index.html

That said, some information snippets are provided here.

The following annotations (debug/informational/warning/error messages) were provided:
 -DEBUG- Sole jar output [commons-exec-*[0-9T].jar] identifier set to project name
 -INFO- Optional dependency commons-collections failed with reason build failed
 -DEBUG- (Apache Gump generated) Apache Maven Settings in: /srv/gump/public/workspace/apache-commons/exec/gump_mvn_settings.xml
 -INFO- Failed with reason build failed
 -DEBUG- Maven POM in: /srv/gump/public/workspace/apache-commons/exec/pom.xml
 -INFO- Failed to extract fallback artifacts from Gump Repository



The following work was performed:
http://vmgump.apache.org/gump/public/apache-commons/commons-exec/gump_work/build_apache-commons_commons-exec.html
Work Name: build_apache-commons_commons-exec (Type: Build)
Work ended in a state of : Failed
Elapsed: 1 sec
Command Line: /opt/maven2/bin/mvn --batch-mode -DskipTests=true --settings /srv/gump/public/workspace/apache-commons/exec/gump_mvn_settings.xml package 
[Working Directory: /srv/gump/public/workspace/apache-commons/exec]
M2_HOME: /opt/maven2
---------------------------------------------
	at org.apache.maven.cli.compat.CompatibleMain.main(CompatibleMain.java:60)
	at sun.reflect.NativeMethodAccessorImpl.invoke0(Native Method)
	at sun.reflect.NativeMethodAccessorImpl.invoke(NativeMethodAccessorImpl.java:57)
	at sun.reflect.DelegatingMethodAccessorImpl.invoke(DelegatingMethodAccessorImpl.java:43)
	at java.lang.reflect.Method.invoke(Method.java:606)
	at org.codehaus.classworlds.Launcher.launchEnhanced(Launcher.java:315)
	at org.codehaus.classworlds.Launcher.launch(Launcher.java:255)
	at org.codehaus.classworlds.Launcher.mainWithExitCode(Launcher.java:430)
	at org.codehaus.classworlds.Launcher.main(Launcher.java:375)
Caused by: org.apache.maven.project.ProjectBuildingException: Cannot find parent: org.apache.commons:commons-parent for project: org.apache.commons:commons-exec:jar:1.3-SNAPSHOT for project org.apache.commons:commons-exec:jar:1.3-SNAPSHOT
	at org.apache.maven.project.DefaultMavenProjectBuilder.assembleLineage(DefaultMavenProjectBuilder.java:1396)
	at org.apache.maven.project.DefaultMavenProjectBuilder.buildInternal(DefaultMavenProjectBuilder.java:823)
	at org.apache.maven.project.DefaultMavenProjectBuilder.buildFromSourceFileInternal(DefaultMavenProjectBuilder.java:508)
	at org.apache.maven.project.DefaultMavenProjectBuilder.build(DefaultMavenProjectBuilder.java:200)
	at org.apache.maven.DefaultMaven.getProject(DefaultMaven.java:604)
	at org.apache.maven.DefaultMaven.collectProjects(DefaultMaven.java:487)
	at org.apache.maven.DefaultMaven.getProjects(DefaultMaven.java:391)
	... 12 more
Caused by: org.apache.maven.project.ProjectBuildingException: POM 'org.apache.commons:commons-parent' not found in repository: Unable to download the artifact from any repository

  org.apache.commons:commons-parent:pom:32

from the specified remote repositories:
  gump-central (http://localhost:8192/maven2)

 for project org.apache.commons:commons-parent
	at org.apache.maven.project.DefaultMavenProjectBuilder.findModelFromRepository(DefaultMavenProjectBuilder.java:605)
	at org.apache.maven.project.DefaultMavenProjectBuilder.assembleLineage(DefaultMavenProjectBuilder.java:1392)
	... 18 more
Caused by: org.apache.maven.artifact.resolver.ArtifactNotFoundException: Unable to download the artifact from any repository

  org.apache.commons:commons-parent:pom:32

from the specified remote repositories:
  gump-central (http://localhost:8192/maven2)


	at org.apache.maven.artifact.resolver.DefaultArtifactResolver.resolve(DefaultArtifactResolver.java:228)
	at org.apache.maven.artifact.resolver.DefaultArtifactResolver.resolve(DefaultArtifactResolver.java:90)
	at org.apache.maven.project.DefaultMavenProjectBuilder.findModelFromRepository(DefaultMavenProjectBuilder.java:558)
	... 19 more
Caused by: org.apache.maven.wagon.ResourceDoesNotExistException: Unable to download the artifact from any repository
	at org.apache.maven.artifact.manager.DefaultWagonManager.getArtifact(DefaultWagonManager.java:404)
	at org.apache.maven.artifact.resolver.DefaultArtifactResolver.resolve(DefaultArtifactResolver.java:216)
	... 21 more
[INFO] ------------------------------------------------------------------------
[INFO] Total time: < 1 second
[INFO] Finished at: Thu May 01 08:39:38 UTC 2014
[INFO] Final Memory: 3M/15M
[INFO] ------------------------------------------------------------------------
---------------------------------------------

To subscribe to this information via syndicated feeds:
- RSS: http://vmgump.apache.org/gump/public/apache-commons/commons-exec/rss.xml
- Atom: http://vmgump.apache.org/gump/public/apache-commons/commons-exec/atom.xml

============================== Gump Tracking Only ===
Produced by Apache Gump(TM) version 2.3.
Gump Run 20140501060006, vmgump.apache.org:vmgump:20140501060006
Gump E-mail Identifier (unique within run) #3.

*********************************************************** G U M P
[GUMP@vmgump]: Project google-guava-parent (in module google-guava) failed
To whom it may engage...
        
This is an automated request, but not an unsolicited one. For 
more information please visit http://gump.apache.org/nagged.html, 
and/or contact the folk at general@gump.apache.org.

Project google-guava-parent has an issue affecting its community integration.
This issue affects 1 projects.
The current state of this project is 'Failed', with reason 'Build Failed'.
For reference only, the following projects are affected by this:
    - google-guava-parent :  Guava is a suite of core and expanded libraries that include...


Full details are available at:
    http://vmgump.apache.org/gump/public/google-guava/google-guava-parent/index.html

That said, some information snippets are provided here.

The following annotations (debug/informational/warning/error messages) were provided:
 -INFO- Optional dependency commons-collections failed with reason build failed
 -DEBUG- (Apache Gump generated) Apache Maven Settings in: /srv/gump/public/workspace/google-guava/gump_mvn_settings.xml
 -INFO- Failed with reason build failed
 -DEBUG- Maven POM in: /srv/gump/public/workspace/google-guava/pom.xml
 -DEBUG- Extracted fallback artifacts from Gump Repository



The following work was performed:
http://vmgump.apache.org/gump/public/google-guava/google-guava-parent/gump_work/build_google-guava_google-guava-parent.html
Work Name: build_google-guava_google-guava-parent (Type: Build)
Work ended in a state of : Failed
Elapsed: 4 secs
Command Line: /opt/maven3/bin/mvn --batch-mode -Dpackaging=pom -DgroupId=com.google.guava -Dfile=pom.xml -DartifactId=guava-parent -Dversion=18.0-SNAPSHOT --settings /srv/gump/public/workspace/google-guava/gump_mvn_settings.xml install:install-file 
[Working Directory: /srv/gump/public/workspace/google-guava]
M2_HOME: /opt/maven3
---------------------------------------------
[INFO] Scanning for projects...
Downloading: http://localhost:8192/maven2/org/apache/felix/maven-bundle-plugin/2.3.7/maven-bundle-plugin-2.3.7.pom
[ERROR] The build could not read 1 project -> [Help 1]
[ERROR]   
[ERROR]   The project com.google.guava:guava:18.0-SNAPSHOT (/srv/gump/public/workspace/google-guava/guava/pom.xml) has 2 errors
[ERROR]     Unresolveable build extension: Plugin org.apache.felix:maven-bundle-plugin:2.3.7 or one of its dependencies could not be resolved: Failed to collect dependencies for org.apache.felix:maven-bundle-plugin:jar:2.3.7 (): Failed to read artifact descriptor for org.apache.felix:maven-bundle-plugin:jar:2.3.7: Could not transfer artifact org.apache.felix:maven-bundle-plugin:pom:2.3.7 from/to gump-central (http://localhost:8192/maven2): Connection to http://localhost:8192 refused: Connection refused -> [Help 2]
[ERROR]     Unknown packaging: bundle @ line 12, column 14
[ERROR] 
[ERROR] To see the full stack trace of the errors, re-run Maven with the -e switch.
[ERROR] Re-run Maven using the -X switch to enable full debug logging.
[ERROR] 
[ERROR] For more information about the errors and possible solutions, please read the following articles:
[ERROR] [Help 1] http://cwiki.apache.org/confluence/display/MAVEN/ProjectBuildingException
[ERROR] [Help 2] http://cwiki.apache.org/confluence/display/MAVEN/PluginResolutionException
---------------------------------------------

To subscribe to this information via syndicated feeds:
- RSS: http://vmgump.apache.org/gump/public/google-guava/google-guava-parent/rss.xml
- Atom: http://vmgump.apache.org/gump/public/google-guava/google-guava-parent/atom.xml

============================== Gump Tracking Only ===
Produced by Apache Gump(TM) version 2.3.
Gump Run 20140501060006, vmgump.apache.org:vmgump:20140501060006
Gump E-mail Identifier (unique within run) #4.

*********************************************************** G U M P
[GUMP@vmgump]: Project pdfbox-parent (in module pdfbox) failed
To whom it may engage...
        
This is an automated request, but not an unsolicited one. For 
more information please visit http://gump.apache.org/nagged.html, 
and/or contact the folk at general@gump.apache.org.

Project pdfbox-parent has an issue affecting its community integration.
This issue affects 2 projects.
The current state of this project is 'Failed', with reason 'Build Failed'.
For reference only, the following projects are affected by this:
    - fontbox :  Apache PDFBox is an open source Java PDF library for working...
    - pdfbox-parent :  Apache PDFBox is an open source Java PDF library for working...


Full details are available at:
    http://vmgump.apache.org/gump/public/pdfbox/pdfbox-parent/index.html

That said, some information snippets are provided here.

The following annotations (debug/informational/warning/error messages) were provided:
 -INFO- Optional dependency commons-collections failed with reason build failed
 -DEBUG- (Apache Gump generated) Apache Maven Settings in: /srv/gump/public/workspace/pdfbox/parent/gump_mvn_settings.xml
 -INFO- Failed with reason build failed
 -DEBUG- Maven POM in: /srv/gump/public/workspace/pdfbox/parent/pom.xml



The following work was performed:
http://vmgump.apache.org/gump/public/pdfbox/pdfbox-parent/gump_work/build_pdfbox_pdfbox-parent.html
Work Name: build_pdfbox_pdfbox-parent (Type: Build)
Work ended in a state of : Failed
Elapsed: 5 secs
Command Line: /opt/maven2/bin/mvn --batch-mode -Dpackaging=pom -DgroupId=org.apache.pdfbox -Dfile=pom.xml -DartifactId=pdfbox-parent -Dversion=2.0.0-SNAPSHOT --settings /srv/gump/public/workspace/pdfbox/parent/gump_mvn_settings.xml install:install-file 
[Working Directory: /srv/gump/public/workspace/pdfbox/parent]
M2_HOME: /opt/maven2
---------------------------------------------
	at java.lang.reflect.Method.invoke(Method.java:606)
	at org.codehaus.classworlds.Launcher.launchEnhanced(Launcher.java:315)
	at org.codehaus.classworlds.Launcher.launch(Launcher.java:255)
	at org.codehaus.classworlds.Launcher.mainWithExitCode(Launcher.java:430)
	at org.codehaus.classworlds.Launcher.main(Launcher.java:375)
Caused by: org.apache.maven.project.ProjectBuildingException: Cannot find parent: org.apache:apache for project: org.apache.pdfbox:pdfbox-parent:pom:2.0.0-SNAPSHOT for project org.apache.pdfbox:pdfbox-parent:pom:2.0.0-SNAPSHOT
	at org.apache.maven.project.DefaultMavenProjectBuilder.assembleLineage(DefaultMavenProjectBuilder.java:1396)
	at org.apache.maven.project.DefaultMavenProjectBuilder.buildInternal(DefaultMavenProjectBuilder.java:823)
	at org.apache.maven.project.DefaultMavenProjectBuilder.buildFromSourceFileInternal(DefaultMavenProjectBuilder.java:508)
	at org.apache.maven.project.DefaultMavenProjectBuilder.build(DefaultMavenProjectBuilder.java:200)
	at org.apache.maven.DefaultMaven.getProject(DefaultMaven.java:604)
	at org.apache.maven.DefaultMaven.collectProjects(DefaultMaven.java:487)
	at org.apache.maven.DefaultMaven.getProjects(DefaultMaven.java:391)
	... 12 more
Caused by: org.apache.maven.project.ProjectBuildingException: POM 'org.apache:apache' not found in repository: Unable to download the artifact from any repository

  org.apache:apache:pom:14

from the specified remote repositories:
  gump-central (http://localhost:8192/maven2),
  jbig2.googlecode (http://jbig2-imageio.googlecode.com/svn/maven-repository/),
  mygrid-repository (http://www.mygrid.org.uk/maven/repository)

 for project org.apache:apache
	at org.apache.maven.project.DefaultMavenProjectBuilder.findModelFromRepository(DefaultMavenProjectBuilder.java:605)
	at org.apache.maven.project.DefaultMavenProjectBuilder.assembleLineage(DefaultMavenProjectBuilder.java:1392)
	... 18 more
Caused by: org.apache.maven.artifact.resolver.ArtifactNotFoundException: Unable to download the artifact from any repository

  org.apache:apache:pom:14

from the specified remote repositories:
  gump-central (http://localhost:8192/maven2),
  jbig2.googlecode (http://jbig2-imageio.googlecode.com/svn/maven-repository/),
  mygrid-repository (http://www.mygrid.org.uk/maven/repository)


	at org.apache.maven.artifact.resolver.DefaultArtifactResolver.resolve(DefaultArtifactResolver.java:228)
	at org.apache.maven.artifact.resolver.DefaultArtifactResolver.resolve(DefaultArtifactResolver.java:90)
	at org.apache.maven.project.DefaultMavenProjectBuilder.findModelFromRepository(DefaultMavenProjectBuilder.java:558)
	... 19 more
Caused by: org.apache.maven.wagon.ResourceDoesNotExistException: Unable to download the artifact from any repository
	at org.apache.maven.artifact.manager.DefaultWagonManager.getArtifact(DefaultWagonManager.java:404)
	at org.apache.maven.artifact.resolver.DefaultArtifactResolver.resolve(DefaultArtifactResolver.java:216)
	... 21 more
[INFO] ------------------------------------------------------------------------
[INFO] Total time: 4 seconds
[INFO] Finished at: Thu May 01 08:41:37 UTC 2014
[INFO] Final Memory: 3M/15M
[INFO] ------------------------------------------------------------------------
---------------------------------------------

To subscribe to this information via syndicated feeds:
- RSS: http://vmgump.apache.org/gump/public/pdfbox/pdfbox-parent/rss.xml
- Atom: http://vmgump.apache.org/gump/public/pdfbox/pdfbox-parent/atom.xml

============================== Gump Tracking Only ===
Produced by Apache Gump(TM) version 2.3.
Gump Run 20140501060006, vmgump.apache.org:vmgump:20140501060006
Gump E-mail Identifier (unique within run) #5.

*********************************************************** G U M P
[GUMP@vmgump]: Project tika-parent (in module tika) failed
To whom it may engage...
        
This is an automated request, but not an unsolicited one. For 
more information please visit http://gump.apache.org/nagged.html, 
and/or contact the folk at general@gump.apache.org.

Project tika-parent has an issue affecting its community integration.
This issue affects 5 projects.
The current state of this project is 'Failed', with reason 'Build Failed'.
For reference only, the following projects are affected by this:
    - tika-core :  Apache Tika is a toolkit for detecting and extracting metada...
    - tika-parent :  Apache Tika is a toolkit for detecting and extracting metada...
    - tika-parsers :  Apache Tika is a toolkit for detecting and extracting metada...
    - tika-parsers-test :  Apache Tika is a toolkit for detecting and extracting metada...
    - tika-reactor :  Apache Tika is a toolkit for detecting and extracting metada...


Full details are available at:
    http://vmgump.apache.org/gump/public/tika/tika-parent/index.html

That said, some information snippets are provided here.

The following annotations (debug/informational/warning/error messages) were provided:
 -INFO- Optional dependency commons-collections failed with reason build failed
 -DEBUG- (Apache Gump generated) Apache Maven Settings in: /srv/gump/public/workspace/tika/tika-parent/gump_mvn_settings.xml
 -INFO- Failed with reason build failed
 -DEBUG- Maven POM in: /srv/gump/public/workspace/tika/tika-parent/pom.xml



The following work was performed:
http://vmgump.apache.org/gump/public/tika/tika-parent/gump_work/build_tika_tika-parent.html
Work Name: build_tika_tika-parent (Type: Build)
Work ended in a state of : Failed
Elapsed: 2 secs
Command Line: /opt/maven2/bin/mvn --batch-mode -Dpackaging=pom -DgroupId=org.apache.tika -Dfile=pom.xml -DartifactId=tika-parent -Dversion=1.6-SNAPSHOT --settings /srv/gump/public/workspace/tika/tika-parent/gump_mvn_settings.xml install:install-file 
[Working Directory: /srv/gump/public/workspace/tika/tika-parent]
M2_HOME: /opt/maven2
---------------------------------------------
[INFO] Scanning for projects...
Downloading: http://localhost:8192/maven2/org/apache/maven/plugins/maven-compiler-plugin/2.3.2/maven-compiler-plugin-2.3.2.pom
[WARNING] Unable to get resource 'org.apache.maven.plugins:maven-compiler-plugin:pom:2.3.2' from repository central (http://repo1.maven.org/maven2): Error transferring file: Connection refused
Downloading: http://localhost:8192/maven2/org/apache/maven/plugins/maven-compiler-plugin/2.3.2/maven-compiler-plugin-2.3.2.pom
[WARNING] Unable to get resource 'org.apache.maven.plugins:maven-compiler-plugin:pom:2.3.2' from repository central (http://repo1.maven.org/maven2): Error transferring file: Connection refused
[INFO] ------------------------------------------------------------------------
[ERROR] BUILD ERROR
[INFO] ------------------------------------------------------------------------
[INFO] Error building POM (may not be this project's POM).


Project ID: org.apache.maven.plugins:maven-compiler-plugin

Reason: POM 'org.apache.maven.plugins:maven-compiler-plugin' not found in repository: Unable to download the artifact from any repository

  org.apache.maven.plugins:maven-compiler-plugin:pom:2.3.2

from the specified remote repositories:
  gump-central (http://localhost:8192/maven2),
  gump-apache.snapshots (http://localhost:8192/repo/m2-snapshot-repository)

 for project org.apache.maven.plugins:maven-compiler-plugin


[INFO] ------------------------------------------------------------------------
[INFO] For more information, run Maven with the -e switch
[INFO] ------------------------------------------------------------------------
[INFO] Total time: < 1 second
[INFO] Finished at: Thu May 01 08:52:08 UTC 2014
[INFO] Final Memory: 4M/15M
[INFO] ------------------------------------------------------------------------
---------------------------------------------

To subscribe to this information via syndicated feeds:
- RSS: http://vmgump.apache.org/gump/public/tika/tika-parent/rss.xml
- Atom: http://vmgump.apache.org/gump/public/tika/tika-parent/atom.xml

============================== Gump Tracking Only ===
Produced by Apache Gump(TM) version 2.3.
Gump Run 20140501060006, vmgump.apache.org:vmgump:20140501060006
Gump E-mail Identifier (unique within run) #7.

*********************************************************** G U M P
[GUMP@vmgump]: Project commons-jxpath (in module apache-commons) failed
To whom it may engage...
        
This is an automated request, but not an unsolicited one. For 
more information please visit http://gump.apache.org/nagged.html, 
and/or contact the folk at general@gump.apache.org.

Project commons-jxpath has an issue affecting its community integration.
This issue affects 1 projects.
The current state of this project is 'Failed', with reason 'Build Failed'.
For reference only, the following projects are affected by this:
    - commons-jxpath :  XPath traversal of JavaBeans


Full details are available at:
    http://vmgump.apache.org/gump/public/apache-commons/commons-jxpath/index.html

That said, some information snippets are provided here.

The following annotations (debug/informational/warning/error messages) were provided:
 -DEBUG- Sole jar output [commons-jxpath-*[0-9T].jar] identifier set to project name
 -INFO- Optional dependency commons-beanutils prerequisite failed with reason build failed
 -DEBUG- (Apache Gump generated) Apache Maven Settings in: /srv/gump/public/workspace/apache-commons/jxpath/gump_mvn_settings.xml
 -INFO- Failed with reason build failed
 -DEBUG- Maven POM in: /srv/gump/public/workspace/apache-commons/jxpath/pom.xml
 -DEBUG- Extracted fallback artifacts from Gump Repository



The following work was performed:
http://vmgump.apache.org/gump/public/apache-commons/commons-jxpath/gump_work/build_apache-commons_commons-jxpath.html
Work Name: build_apache-commons_commons-jxpath (Type: Build)
Work ended in a state of : Failed
Elapsed: 1 sec
Command Line: /opt/maven2/bin/mvn --batch-mode -DskipTests=true --settings /srv/gump/public/workspace/apache-commons/jxpath/gump_mvn_settings.xml package 
[Working Directory: /srv/gump/public/workspace/apache-commons/jxpath]
M2_HOME: /opt/maven2
---------------------------------------------
	at org.apache.maven.cli.compat.CompatibleMain.main(CompatibleMain.java:60)
	at sun.reflect.NativeMethodAccessorImpl.invoke0(Native Method)
	at sun.reflect.NativeMethodAccessorImpl.invoke(NativeMethodAccessorImpl.java:57)
	at sun.reflect.DelegatingMethodAccessorImpl.invoke(DelegatingMethodAccessorImpl.java:43)
	at java.lang.reflect.Method.invoke(Method.java:606)
	at org.codehaus.classworlds.Launcher.launchEnhanced(Launcher.java:315)
	at org.codehaus.classworlds.Launcher.launch(Launcher.java:255)
	at org.codehaus.classworlds.Launcher.mainWithExitCode(Launcher.java:430)
	at org.codehaus.classworlds.Launcher.main(Launcher.java:375)
Caused by: org.apache.maven.project.ProjectBuildingException: Cannot find parent: org.apache.commons:commons-parent for project: commons-jxpath:commons-jxpath:jar:1.4-SNAPSHOT for project commons-jxpath:commons-jxpath:jar:1.4-SNAPSHOT
	at org.apache.maven.project.DefaultMavenProjectBuilder.assembleLineage(DefaultMavenProjectBuilder.java:1396)
	at org.apache.maven.project.DefaultMavenProjectBuilder.buildInternal(DefaultMavenProjectBuilder.java:823)
	at org.apache.maven.project.DefaultMavenProjectBuilder.buildFromSourceFileInternal(DefaultMavenProjectBuilder.java:508)
	at org.apache.maven.project.DefaultMavenProjectBuilder.build(DefaultMavenProjectBuilder.java:200)
	at org.apache.maven.DefaultMaven.getProject(DefaultMaven.java:604)
	at org.apache.maven.DefaultMaven.collectProjects(DefaultMaven.java:487)
	at org.apache.maven.DefaultMaven.getProjects(DefaultMaven.java:391)
	... 12 more
Caused by: org.apache.maven.project.ProjectBuildingException: POM 'org.apache.commons:commons-parent' not found in repository: Unable to download the artifact from any repository

  org.apache.commons:commons-parent:pom:28

from the specified remote repositories:
  gump-central (http://localhost:8192/maven2)

 for project org.apache.commons:commons-parent
	at org.apache.maven.project.DefaultMavenProjectBuilder.findModelFromRepository(DefaultMavenProjectBuilder.java:605)
	at org.apache.maven.project.DefaultMavenProjectBuilder.assembleLineage(DefaultMavenProjectBuilder.java:1392)
	... 18 more
Caused by: org.apache.maven.artifact.resolver.ArtifactNotFoundException: Unable to download the artifact from any repository

  org.apache.commons:commons-parent:pom:28

from the specified remote repositories:
  gump-central (http://localhost:8192/maven2)


	at org.apache.maven.artifact.resolver.DefaultArtifactResolver.resolve(DefaultArtifactResolver.java:228)
	at org.apache.maven.artifact.resolver.DefaultArtifactResolver.resolve(DefaultArtifactResolver.java:90)
	at org.apache.maven.project.DefaultMavenProjectBuilder.findModelFromRepository(DefaultMavenProjectBuilder.java:558)
	... 19 more
Caused by: org.apache.maven.wagon.ResourceDoesNotExistException: Unable to download the artifact from any repository
	at org.apache.maven.artifact.manager.DefaultWagonManager.getArtifact(DefaultWagonManager.java:404)
	at org.apache.maven.artifact.resolver.DefaultArtifactResolver.resolve(DefaultArtifactResolver.java:216)
	... 21 more
[INFO] ------------------------------------------------------------------------
[INFO] Total time: < 1 second
[INFO] Finished at: Thu May 01 08:53:25 UTC 2014
[INFO] Final Memory: 3M/15M
[INFO] ------------------------------------------------------------------------
---------------------------------------------

To subscribe to this information via syndicated feeds:
- RSS: http://vmgump.apache.org/gump/public/apache-commons/commons-jxpath/rss.xml
- Atom: http://vmgump.apache.org/gump/public/apache-commons/commons-jxpath/atom.xml

============================== Gump Tracking Only ===
Produced by Apache Gump(TM) version 2.3.
Gump Run 20140501060006, vmgump.apache.org:vmgump:20140501060006
Gump E-mail Identifier (unique within run) #8.

*********************************************************** G U M P
[GUMP@vmgump]: Project rat (in module rat) failed
To whom it may engage...
        
This is an automated request, but not an unsolicited one. For 
more information please visit http://gump.apache.org/nagged.html, 
and/or contact the folk at general@gump.apache.org.

Project rat has an issue affecting its community integration.
This issue affects 1 projects.
The current state of this project is 'Failed', with reason 'Build Failed'.
For reference only, the following projects are affected by this:
    - rat :  Release Audit Tool


Full details are available at:
    http://vmgump.apache.org/gump/public/rat/rat/index.html

That said, some information snippets are provided here.

The following annotations (debug/informational/warning/error messages) were provided:
 -INFO- Optional dependency commons-beanutils prerequisite failed with reason build failed
 -INFO- Optional dependency commons-collections failed with reason build failed
 -DEBUG- (Apache Gump generated) Apache Maven Settings in: /srv/gump/public/workspace/rat/gump_mvn_settings.xml
 -INFO- Failed with reason build failed
 -DEBUG- Maven POM in: /srv/gump/public/workspace/rat/pom.xml
 -DEBUG- Extracted fallback artifacts from Gump Repository



The following work was performed:
http://vmgump.apache.org/gump/public/rat/rat/gump_work/build_rat_rat.html
Work Name: build_rat_rat (Type: Build)
Work ended in a state of : Failed
Elapsed: 2 secs
Command Line: /opt/maven2/bin/mvn --batch-mode -DskipTests=true --settings /srv/gump/public/workspace/rat/gump_mvn_settings.xml package 
[Working Directory: /srv/gump/public/workspace/rat]
M2_HOME: /opt/maven2
---------------------------------------------
[INFO] Reactor build order: 
[INFO]   Apache Creadur Rat
[INFO]   Apache Creadur Rat::Core
[INFO]   Apache Creadur Rat::Plugin4Maven
[INFO]   Apache Creadur Rat::Tasks4Ant
[INFO]   Apache Creadur Rat::Command Line
Downloading: http://localhost:8192/maven2/org/apache/maven/wagon/wagon-ssh/1.0-beta-7/wagon-ssh-1.0-beta-7.pom
[WARNING] Unable to get resource 'org.apache.maven.wagon:wagon-ssh:pom:1.0-beta-7' from repository central (http://repo1.maven.org/maven2): Error transferring file: Connection refused
Downloading: http://localhost:8192/maven2/org/apache/maven/wagon/wagon-ssh/1.0-beta-7/wagon-ssh-1.0-beta-7.jar
[WARNING] Unable to get resource 'org.apache.maven.wagon:wagon-ssh:jar:1.0-beta-7' from repository central (http://repo1.maven.org/maven2): Error transferring file: Connection refused
[INFO] ------------------------------------------------------------------------
[ERROR] BUILD ERROR
[INFO] ------------------------------------------------------------------------
[INFO] Failed to resolve artifact.

Missing:
----------
1) org.apache.maven.wagon:wagon-ssh:jar:1.0-beta-7

  Try downloading the file manually from the project website.

  Then, install it using the command: 
      mvn install:install-file -DgroupId=org.apache.maven.wagon -DartifactId=wagon-ssh -Dversion=1.0-beta-7 -Dpackaging=jar -Dfile=/path/to/file

  Alternatively, if you host your own repository you can deploy the file there: 
      mvn deploy:deploy-file -DgroupId=org.apache.maven.wagon -DartifactId=wagon-ssh -Dversion=1.0-beta-7 -Dpackaging=jar -Dfile=/path/to/file -Durl=[url] -DrepositoryId=[id]

  Path to dependency: 
  	1) org.apache.rat:apache-rat-project:pom:0.11-SNAPSHOT
  	2) org.apache.maven.wagon:wagon-ssh:jar:1.0-beta-7

----------
1 required artifact is missing.

for artifact: 
  org.apache.rat:apache-rat-project:pom:0.11-SNAPSHOT

from the specified remote repositories:
  gump-central (http://localhost:8192/maven2),
  gump-apache.snapshots (http://localhost:8192/repo/m2-snapshot-repository)



[INFO] ------------------------------------------------------------------------
[INFO] For more information, run Maven with the -e switch
[INFO] ------------------------------------------------------------------------
[INFO] Total time: 1 second
[INFO] Finished at: Thu May 01 08:53:46 UTC 2014
[INFO] Final Memory: 3M/15M
[INFO] ------------------------------------------------------------------------
---------------------------------------------

To subscribe to this information via syndicated feeds:
- RSS: http://vmgump.apache.org/gump/public/rat/rat/rss.xml
- Atom: http://vmgump.apache.org/gump/public/rat/rat/atom.xml

============================== Gump Tracking Only ===
Produced by Apache Gump(TM) version 2.3.
Gump Run 20140501060006, vmgump.apache.org:vmgump:20140501060006
Gump E-mail Identifier (unique within run) #9.

*********************************************************** G U M P
[GUMP@vmgump]: Project commons-cli (in module apache-commons) failed
To whom it may engage...
        
This is an automated request, but not an unsolicited one. For 
more information please visit http://gump.apache.org/nagged.html, 
and/or contact the folk at general@gump.apache.org.

Project commons-cli has an issue affecting its community integration.
This issue affects 1 projects.
The current state of this project is 'Failed', with reason 'Build Failed'.
For reference only, the following projects are affected by this:
    - commons-cli :  Commons CLI Package


Full details are available at:
    http://vmgump.apache.org/gump/public/apache-commons/commons-cli/index.html

That said, some information snippets are provided here.

The following annotations (debug/informational/warning/error messages) were provided:
 -DEBUG- Sole jar output [commons-cli-*[0-9T].jar] identifier set to project name
 -INFO- Optional dependency commons-collections failed with reason build failed
 -DEBUG- (Apache Gump generated) Apache Maven Settings in: /srv/gump/public/workspace/apache-commons/cli/gump_mvn_settings.xml
 -INFO- Failed with reason build failed
 -DEBUG- Maven POM in: /srv/gump/public/workspace/apache-commons/cli/pom.xml
 -DEBUG- Extracted fallback artifacts from Gump Repository



The following work was performed:
http://vmgump.apache.org/gump/public/apache-commons/commons-cli/gump_work/build_apache-commons_commons-cli.html
Work Name: build_apache-commons_commons-cli (Type: Build)
Work ended in a state of : Failed
Elapsed: 4 secs
Command Line: /opt/maven2/bin/mvn --batch-mode --settings /srv/gump/public/workspace/apache-commons/cli/gump_mvn_settings.xml package 
[Working Directory: /srv/gump/public/workspace/apache-commons/cli]
M2_HOME: /opt/maven2
---------------------------------------------
[INFO] Scanning for projects...
[INFO] ------------------------------------------------------------------------
[INFO] Building Apache Commons CLI
[INFO]    task-segment: [package]
[INFO] ------------------------------------------------------------------------
Downloading: http://localhost:8192/maven2/junit-addons/junit-addons/1.4/junit-addons-1.4.pom
[WARNING] Unable to get resource 'junit-addons:junit-addons:pom:1.4' from repository central (http://repo1.maven.org/maven2): Error transferring file: Connection refused
Downloading: http://localhost:8192/maven2/junit-addons/junit-addons/1.4/junit-addons-1.4.jar
[WARNING] Unable to get resource 'junit-addons:junit-addons:jar:1.4' from repository central (http://repo1.maven.org/maven2): Error transferring file: Connection refused
[INFO] ------------------------------------------------------------------------
[ERROR] BUILD ERROR
[INFO] ------------------------------------------------------------------------
[INFO] Failed to resolve artifact.

Missing:
----------
1) junit-addons:junit-addons:jar:1.4

  Try downloading the file manually from the project website.

  Then, install it using the command: 
      mvn install:install-file -DgroupId=junit-addons -DartifactId=junit-addons -Dversion=1.4 -Dpackaging=jar -Dfile=/path/to/file

  Alternatively, if you host your own repository you can deploy the file there: 
      mvn deploy:deploy-file -DgroupId=junit-addons -DartifactId=junit-addons -Dversion=1.4 -Dpackaging=jar -Dfile=/path/to/file -Durl=[url] -DrepositoryId=[id]

  Path to dependency: 
  	1) commons-cli:commons-cli:jar:1.3-SNAPSHOT
  	2) junit-addons:junit-addons:jar:1.4

----------
1 required artifact is missing.

for artifact: 
  commons-cli:commons-cli:jar:1.3-SNAPSHOT

from the specified remote repositories:
  gump-central (http://localhost:8192/maven2),
  gump-apache.snapshots (http://localhost:8192/repo/m2-snapshot-repository)



[INFO] ------------------------------------------------------------------------
[INFO] For more information, run Maven with the -e switch
[INFO] ------------------------------------------------------------------------
[INFO] Total time: 3 seconds
[INFO] Finished at: Thu May 01 08:53:54 UTC 2014
[INFO] Final Memory: 11M/27M
[INFO] ------------------------------------------------------------------------
---------------------------------------------

To subscribe to this information via syndicated feeds:
- RSS: http://vmgump.apache.org/gump/public/apache-commons/commons-cli/rss.xml
- Atom: http://vmgump.apache.org/gump/public/apache-commons/commons-cli/atom.xml

============================== Gump Tracking Only ===
Produced by Apache Gump(TM) version 2.3.
Gump Run 20140501060006, vmgump.apache.org:vmgump:20140501060006
Gump E-mail Identifier (unique within run) #10.

*********************************************************** G U M P
[GUMP@vmgump]: Project google-guava (in module google-guava) failed
To whom it may engage...
        
This is an automated request, but not an unsolicited one. For 
more information please visit http://gump.apache.org/nagged.html, 
and/or contact the folk at general@gump.apache.org.

Project google-guava has an issue affecting its community integration.
This issue affects 1 projects.
The current state of this project is 'Failed', with reason 'Build Failed'.
For reference only, the following projects are affected by this:
    - google-guava :  Guava is a suite of core and expanded libraries that include...


Full details are available at:
    http://vmgump.apache.org/gump/public/google-guava/google-guava/index.html

That said, some information snippets are provided here.

The following annotations (debug/informational/warning/error messages) were provided:
 -INFO- Optional dependency google-guava-parent failed with reason build failed
 -DEBUG- (Apache Gump generated) Apache Maven Settings in: /srv/gump/public/workspace/google-guava/guava/gump_mvn_settings.xml
 -INFO- Failed with reason build failed
 -DEBUG- Maven POM in: /srv/gump/public/workspace/google-guava/guava/pom.xml
 -DEBUG- Extracted fallback artifacts from Gump Repository



The following work was performed:
http://vmgump.apache.org/gump/public/google-guava/google-guava/gump_work/build_google-guava_google-guava.html
Work Name: build_google-guava_google-guava (Type: Build)
Work ended in a state of : Failed
Elapsed: 3 secs
Command Line: /opt/maven3/bin/mvn --batch-mode --settings /srv/gump/public/workspace/google-guava/guava/gump_mvn_settings.xml package 
[Working Directory: /srv/gump/public/workspace/google-guava/guava]
M2_HOME: /opt/maven3
---------------------------------------------
[INFO] Scanning for projects...
Downloading: http://localhost:8192/maven2/org/apache/felix/maven-bundle-plugin/2.3.7/maven-bundle-plugin-2.3.7.pom
[ERROR] The build could not read 1 project -> [Help 1]
[ERROR]   
[ERROR]   The project com.google.guava:guava:18.0-SNAPSHOT (/srv/gump/public/workspace/google-guava/guava/pom.xml) has 2 errors
[ERROR]     Unresolveable build extension: Plugin org.apache.felix:maven-bundle-plugin:2.3.7 or one of its dependencies could not be resolved: Failed to collect dependencies for org.apache.felix:maven-bundle-plugin:jar:2.3.7 (): Failed to read artifact descriptor for org.apache.felix:maven-bundle-plugin:jar:2.3.7: Could not transfer artifact org.apache.felix:maven-bundle-plugin:pom:2.3.7 from/to gump-central (http://localhost:8192/maven2): Connection to http://localhost:8192 refused: Connection refused -> [Help 2]
[ERROR]     Unknown packaging: bundle @ line 12, column 14
[ERROR] 
[ERROR] To see the full stack trace of the errors, re-run Maven with the -e switch.
[ERROR] Re-run Maven using the -X switch to enable full debug logging.
[ERROR] 
[ERROR] For more information about the errors and possible solutions, please read the following articles:
[ERROR] [Help 1] http://cwiki.apache.org/confluence/display/MAVEN/ProjectBuildingException
[ERROR] [Help 2] http://cwiki.apache.org/confluence/display/MAVEN/PluginResolutionException
---------------------------------------------

To subscribe to this information via syndicated feeds:
- RSS: http://vmgump.apache.org/gump/public/google-guava/google-guava/rss.xml
- Atom: http://vmgump.apache.org/gump/public/google-guava/google-guava/atom.xml

============================== Gump Tracking Only ===
Produced by Apache Gump(TM) version 2.3.
Gump Run 20140501060006, vmgump.apache.org:vmgump:20140501060006
Gump E-mail Identifier (unique within run) #11.

*********************************************************** G U M P
[GUMP@vmgump]: Project checkstyle (in module checkstyle) failed
To whom it may engage...
        
This is an automated request, but not an unsolicited one. For 
more information please visit http://gump.apache.org/nagged.html, 
and/or contact the folk at general@gump.apache.org.

Project checkstyle has an issue affecting its community integration.
This issue affects 1 projects.
The current state of this project is 'Failed', with reason 'Build Failed'.
For reference only, the following projects are affected by this:
    - checkstyle :  Java style checker


Full details are available at:
    http://vmgump.apache.org/gump/public/checkstyle/checkstyle/index.html

That said, some information snippets are provided here.

The following annotations (debug/informational/warning/error messages) were provided:
 -INFO- Optional dependency commons-validator prerequisite failed with reason build failed
 -INFO- Optional dependency commons-beanutils prerequisite failed with reason build failed
 -INFO- Optional dependency commons-exec failed with reason build failed
 -INFO- Optional dependency commons-cli failed with reason build failed
 -INFO- Optional dependency google-guava failed with reason build failed
 -DEBUG- (Apache Gump generated) Apache Maven Settings in: /srv/gump/public/workspace/checkstyle/gump_mvn_settings.xml
 -INFO- Failed with reason build failed
 -DEBUG- Maven POM in: /srv/gump/public/workspace/checkstyle/pom.xml
 -INFO- Failed to extract fallback artifacts from Gump Repository



The following work was performed:
http://vmgump.apache.org/gump/public/checkstyle/checkstyle/gump_work/build_checkstyle_checkstyle.html
Work Name: build_checkstyle_checkstyle (Type: Build)
Work ended in a state of : Failed
Elapsed: 2 secs
Command Line: /opt/maven3/bin/mvn --batch-mode -DskipTests=true --settings /srv/gump/public/workspace/checkstyle/gump_mvn_settings.xml install 
[Working Directory: /srv/gump/public/workspace/checkstyle]
M2_HOME: /opt/maven3
---------------------------------------------
[INFO] Scanning for projects...
[INFO]                                                                         
[INFO] ------------------------------------------------------------------------
[INFO] Building checkstyle 5.7-SNAPSHOT
[INFO] ------------------------------------------------------------------------
Downloading: http://localhost:8192/maven2/org/apache/maven/plugins/maven-enforcer-plugin/1.0.1/maven-enforcer-plugin-1.0.1.pom
[INFO] ------------------------------------------------------------------------
[INFO] BUILD FAILURE
[INFO] ------------------------------------------------------------------------
[INFO] Total time: 0.623s
[INFO] Finished at: Thu May 01 08:54:16 UTC 2014
[INFO] Final Memory: 5M/15M
[INFO] ------------------------------------------------------------------------
[ERROR] Plugin org.apache.maven.plugins:maven-enforcer-plugin:1.0.1 or one of its dependencies could not be resolved: Failed to read artifact descriptor for org.apache.maven.plugins:maven-enforcer-plugin:jar:1.0.1: Could not transfer artifact org.apache.maven.plugins:maven-enforcer-plugin:pom:1.0.1 from/to gump-central (http://localhost:8192/maven2): Connection to http://localhost:8192 refused: Connection refused -> [Help 1]
[ERROR] 
[ERROR] To see the full stack trace of the errors, re-run Maven with the -e switch.
[ERROR] Re-run Maven using the -X switch to enable full debug logging.
[ERROR] 
[ERROR] For more information about the errors and possible solutions, please read the following articles:
[ERROR] [Help 1] http://cwiki.apache.org/confluence/display/MAVEN/PluginResolutionException
---------------------------------------------

To subscribe to this information via syndicated feeds:
- RSS: http://vmgump.apache.org/gump/public/checkstyle/checkstyle/rss.xml
- Atom: http://vmgump.apache.org/gump/public/checkstyle/checkstyle/atom.xml

============================== Gump Tracking Only ===
Produced by Apache Gump(TM) version 2.3.
Gump Run 20140501060006, vmgump.apache.org:vmgump:20140501060006
Gump E-mail Identifier (unique within run) #12.


--
Apache Gump
http://gump.apache.org/ [Instance: vmgump]

---------------------------------------------------------------------
To unsubscribe, e-mail: general-unsubscribe@gump.apache.org
For additional commands, e-mail: general-help@gump.apache.org


Mime
View raw message