gump-general mailing list archives

Site index · List index
Message view « Date » · « Thread »
Top « Date » · « Thread »
From g...@vmgump.apache.org
Subject BATCH: All dressed up, with nowhere to go...
Date Sun, 18 May 2014 02:51:49 GMT
Dear Gumpmeisters,
            
The following 4 notifys should have been sent

*********************************************************** G U M P
[GUMP@vmgump]: Project test-ant (in module ant) failed
[GUMP@vmgump]: Module xml-fop failed
[GUMP@vmgump]: Project tika-parsers (in module tika) failed
[GUMP@vmgump]: Project tika-reactor (in module tika) failed
*********************************************************** G U M P
[GUMP@vmgump]: Project test-ant (in module ant) failed
To whom it may engage...
        
This is an automated request, but not an unsolicited one. For 
more information please visit http://gump.apache.org/nagged.html, 
and/or contact the folk at general@gump.apache.org.

Project test-ant has an issue affecting its community integration.
This issue affects 1 projects,
 and has been outstanding for 40 runs.
The current state of this project is 'Failed', with reason 'Build Failed'.
For reference only, the following projects are affected by this:
    - test-ant :  Java based build tool


Full details are available at:
    http://vmgump.apache.org/gump/public/ant/test-ant/index.html

That said, some information snippets are provided here.

The following annotations (debug/informational/warning/error messages) were provided:
 -WARNING- Bad *Optional* Dependency. Project: bsh : unknown to *this* workspace
 -INFO- Failed with reason build failed



The following work was performed:
http://vmgump.apache.org/gump/public/ant/test-ant/gump_work/build_ant_test-ant.html
Work Name: build_ant_test-ant (Type: Build)
Work ended in a state of : Failed
Elapsed: 9 mins 36 secs
Command Line: /usr/lib/jvm/java-7-oracle/bin/java -Djava.awt.headless=true -Dbuild.sysclasspath=only
-Xbootclasspath/p:/srv/gump/public/workspace/xml-xerces2/build/xercesImpl.jar:/srv/gump/public/workspace/xml-commons/java/external/build/xml-apis.jar:/srv/gump/public/workspace/xml-xalan/build/xalan-unbundled.jar:/srv/gump/public/workspace/xml-xalan/build/serializer.jar
org.apache.tools.ant.Main -Dgump.merge=/srv/gump/public/gump/work/merge.xml -Dtest.haltonfailure=false
-Dant.home=/srv/gump/public/workspace/ant/dist run-tests 
[Working Directory: /srv/gump/public/workspace/ant]
CLASSPATH: /usr/lib/jvm/java-7-oracle/lib/tools.jar:/srv/gump/public/workspace/ant/build/testcases:/srv/gump/public/workspace/ant/src/tests/junit:/srv/gump/public/workspace/ant/src/etc/testcases:/srv/gump/public/workspace/ant/src/etc/testcases/taskdefs/optional/out:/srv/gump/public/workspace/ant/src/tests/antunit/filters:/srv/gump/public/workspace/ant/src/tests/antunit/taskdefs/importtests:/srv/gump/public/workspace/ant/src/tests/antunit/filters/foo:/srv/gump/public/workspace/ant/src/tests/antunit/taskdefs/foo:/srv/gump/public/workspace/ant/build/antunit/tmp/testinput/build:/srv/gump/public/workspace/ant/build/antunit/tmp/testoutput:/srv/gump/public/workspace/ant/build/antunit/tmp/test.jar:/srv/gump/public/workspace/ant/build/antunit/tmp/test1.jar:/srv/gump/public/workspace/ant/build/antunit/tmp/test2.jar:/srv/gump/public/workspace/ant/build/antunit/tmp/test3.jar:/srv/gump/public/workspace/ant/build/antunit/tmp/test4.jar:/srv/gump/public/workspace/ant/build/antunit/tmp/test5.
 jar:/srv/gump/public/workspace/ant/build/antunit/tmp/resources:/srv/gump/public/workspace/ant/build/lib/ant.jar:/srv/gump/public/workspace/ant/build/lib/ant-launcher.jar:/srv/gump/public/workspace/ant/build/lib/ant-antlr.jar:/srv/gump/public/workspace/ant/build/lib/ant-apache-bcel.jar:/srv/gump/public/workspace/ant/build/lib/ant-apache-bsf.jar:/srv/gump/public/workspace/ant/build/lib/ant-apache-log4j.jar:/srv/gump/public/workspace/ant/build/lib/ant-apache-oro.jar:/srv/gump/public/workspace/ant/build/lib/ant-apache-regexp.jar:/srv/gump/public/workspace/ant/build/lib/ant-apache-resolver.jar:/srv/gump/public/workspace/ant/build/lib/ant-apache-xalan2.jar:/srv/gump/public/workspace/ant/build/lib/ant-commons-logging.jar:/srv/gump/public/workspace/ant/build/lib/ant-commons-net.jar:/srv/gump/public/workspace/ant/build/lib/ant-jai.jar:/srv/gump/public/workspace/ant/build/lib/ant-javamail.jar:/srv/gump/public/workspace/ant/build/lib/ant-jdepend.jar:/srv/gump/public/workspace/ant/build
 /lib/ant-jmf.jar:/srv/gump/public/workspace/ant/build/lib/ant-jsch.jar:/srv/gump/public/workspace/ant/build/lib/ant-junit.jar:/srv/gump/public/workspace/ant/build/lib/ant-junit4.jar:/srv/gump/public/workspace/ant/build/lib/ant-swing.jar:/srv/gump/packages/antlr/antlr-3.1.3.jar:/srv/gump/public/workspace/apache-commons/bcel/target/bcel-6.0-SNAPSHOT.jar:/srv/gump/public/workspace/apache-commons/logging/target/commons-logging-20140518.jar:/srv/gump/public/workspace/apache-commons/logging/target/commons-logging-api-20140518.jar:/srv/gump/public/workspace/apache-commons/net/target/commons-net-3.4-SNAPSHOT.jar:/srv/gump/public/workspace/apache-commons/net/target/commons-net-ftp-3.4-SNAPSHOT.jar:/srv/gump/packages/jaf-1.1ea/activation.jar:/srv/gump/public/workspace/jakarta-bsf/build/lib/bsf.jar:/srv/gump/packages/apache-attic/jakarta-regexp-1.5.jar:/srv/gump/public/workspace/jakarta-servletapi-5/jsr154/dist/lib/servlet-api.jar:/srv/gump/packages/javamail-1.4/mail.jar:/srv/gump/pack
 ages/javamail-1.4/lib/mailapi.jar:/srv/gump/packages/jdepend-2.6/lib/jdepend.jar:/srv/gump/packages/jsch/jsch-0.1.45.jar:/srv/gump/public/workspace/logging-log4j-12/target/log4j-1.2.18-SNAPSHOT.jar:/srv/gump/packages/apache-attic/oro-2.0.8.jar:/srv/gump/public/workspace/ant-antlibs/antunit/build/ant-antunit-20140518.jar:/srv/gump/public/workspace/hamcrest/hamcrest-java/build/hamcrest-core-20140518.jar:/srv/gump/public/workspace/hamcrest/hamcrest-java/build/hamcrest-generator-20140518.jar:/srv/gump/public/workspace/hamcrest/hamcrest-java/build/hamcrest-library-20140518.jar:/srv/gump/public/workspace/junit/target/junit-4.12-SNAPSHOT.jar:/srv/gump/public/workspace/xml-commons/java/external/build/xml-apis-ext.jar:/srv/gump/public/workspace/commons-codec-1.x/dist/commons-codec-20140518.jar
---------------------------------------------
[au:antunit] Target: testStringTokenizer took 0.002 sec
[au:antunit] Target: testExplicitLines took 0.002 sec
[au:antunit] Build File: /srv/gump/public/workspace/ant/src/tests/antunit/types/selectors/depend-test.xml
[au:antunit] Tests run: 1, Failures: 0, Errors: 0, Time elapsed: 0.021 sec
[au:antunit] Target: testMapperByTypedef took 0.016 sec
[au:antunit] Build File: /srv/gump/public/workspace/ant/src/tests/antunit/types/selectors/different-test.xml
[au:antunit] Tests run: 1, Failures: 0, Errors: 0, Time elapsed: 0.007 sec
[au:antunit] Target: testMapperByTypedef took 0.004 sec
[au:antunit] Build File: /srv/gump/public/workspace/ant/src/tests/antunit/types/selectors/filename-test.xml
[au:antunit] Tests run: 2, Failures: 0, Errors: 0, Time elapsed: 0.019 sec
[au:antunit] Target: testRegex took 0.004 sec
[au:antunit] Target: testPattern took 0.003 sec
[au:antunit] Build File: /srv/gump/public/workspace/ant/src/tests/antunit/types/selectors/modified-test.xml
[au:antunit] Tests run: 1, Failures: 0, Errors: 0, Time elapsed: 0.02 sec
[au:antunit] Target: testUpdate took 0.015 sec
[au:antunit] Build File: /srv/gump/public/workspace/ant/src/tests/antunit/types/selectors/present-test.xml
[au:antunit] Tests run: 1, Failures: 0, Errors: 0, Time elapsed: 0.008 sec
[au:antunit] Target: testMapperByTypedef took 0.004 sec
[au:antunit] Build File: /srv/gump/public/workspace/ant/src/tests/antunit/types/selectors/readwrite-test.xml
[au:antunit] Tests run: 4, Failures: 0, Errors: 0, Time elapsed: 0.053 sec
[au:antunit] Target: testWritable took 0.004 sec
[au:antunit] Target: testAsConditions took 0.008 sec
[au:antunit] Target: testReadable took 0.002 sec
[au:antunit] Target: testUnwritable took 0.005 sec
[au:antunit] Build File: /srv/gump/public/workspace/ant/src/tests/antunit/types/selectors/select-test.xml
[au:antunit] Tests run: 4, Failures: 0, Errors: 0, Time elapsed: 0.025 sec
[au:antunit] Target: testIfFalse took 0.004 sec
[au:antunit] Target: testIfNotSet took 0.002 sec
[au:antunit] Target: testIfTrue took 0.002 sec
[au:antunit] Target: testIfSet took 0.003 sec
[au:antunit] Build File: /srv/gump/public/workspace/ant/src/tests/antunit/types/tarfileset-test.xml
[au:antunit] Tests run: 2, Failures: 0, Errors: 0, Time elapsed: 0.012 sec
[au:antunit] Target: testMissingArchive took 0 sec
[au:antunit] Target: testMissingArchiveDoesntMatter took 0 sec
[au:antunit] Build File: /srv/gump/public/workspace/ant/src/tests/antunit/types/zipfileset-test.xml
[au:antunit] Tests run: 5, Failures: 0, Errors: 0, Time elapsed: 0.029 sec
[au:antunit] Target: testMissingArchive took 0 sec
[au:antunit] Target: test-refid-check-encoding took 0 sec
[au:antunit] Target: test-refid-modify took 0.011 sec
[au:antunit] Target: test-refid-check-prefix took 0.001 sec
[au:antunit] Target: testMissingArchiveDoesntMatter took 0 sec

check-failed:

run-tests:

BUILD FAILED
/srv/gump/public/workspace/ant/build.xml:1607: Unit tests failed

Total time: 9 minutes 36 seconds
---------------------------------------------

To subscribe to this information via syndicated feeds:
- RSS: http://vmgump.apache.org/gump/public/ant/test-ant/rss.xml
- Atom: http://vmgump.apache.org/gump/public/ant/test-ant/atom.xml

============================== Gump Tracking Only ===
Produced by Apache Gump(TM) version 2.3.
Gump Run 20140518000007, vmgump.apache.org:vmgump:20140518000007
Gump E-mail Identifier (unique within run) #2.

*********************************************************** G U M P
[GUMP@vmgump]: Module xml-fop failed
To whom it may engage...
        
This is an automated request, but not an unsolicited one. For 
more information please visit http://gump.apache.org/nagged.html, 
and/or contact the folk at general@gump.apache.org.

Module xml-fop has an issue affecting its community integration,
 and has been outstanding for 39 runs.
The current state of this module is 'Failed', with reason 'Synchronize Failed'.

Full details are available at:
    http://vmgump.apache.org/gump/public/xml-fop/index.html

That said, some information snippets are provided here.

The following annotations (debug/informational/warning/error messages) were provided:
 -INFO- Failed with reason synchronize failed
 -ERROR- Synchronize Failed: Can't copy ['/srv/gump/public/workspace/cvs/xml-fop/lib'] to
['/srv/gump/public/workspace/xml-fop/lib']: [Can't copy ['/srv/gump/public/workspace/cvs/xml-fop/lib/fontbox-1.8.5.jar']
to ['/srv/gump/public/workspace/xml-fop/lib/fontbox-1.8.5.jar']: [[Errno 2] No such file or
directory: '/srv/gump/public/workspace/xml-fop/lib/fontbox-1.8.5.jar']]



The following work was performed:
http://vmgump.apache.org/gump/public/xml-fop/gump_work/update_xml-fop.html
Work Name: update_xml-fop (Type: Update)
Work ended in a state of : Success
Elapsed: 4 secs
Command Line: svn --quiet update --non-interactive xml-fop 
[Working Directory: /srv/gump/public/workspace/cvs]
---------------------------------------------
No output
---------------------------------------------

To subscribe to this information via syndicated feeds:
- RSS: http://vmgump.apache.org/gump/public/xml-fop/rss.xml
- Atom: http://vmgump.apache.org/gump/public/xml-fop/atom.xml

============================== Gump Tracking Only ===
Produced by Apache Gump(TM) version 2.3.
Gump Run 20140518000007, vmgump.apache.org:vmgump:20140518000007
Gump E-mail Identifier (unique within run) #3.

*********************************************************** G U M P
[GUMP@vmgump]: Project tika-parsers (in module tika) failed
To whom it may engage...
        
This is an automated request, but not an unsolicited one. For 
more information please visit http://gump.apache.org/nagged.html, 
and/or contact the folk at general@gump.apache.org.

Project tika-parsers has an issue affecting its community integration.
This issue affects 2 projects,
 and has been outstanding for 14 runs.
The current state of this project is 'Failed', with reason 'Build Failed'.
For reference only, the following projects are affected by this:
    - tika-parsers :  Apache Tika is a toolkit for detecting and extracting metada...
    - tika-parsers-test :  Apache Tika is a toolkit for detecting and extracting metada...


Full details are available at:
    http://vmgump.apache.org/gump/public/tika/tika-parsers/index.html

That said, some information snippets are provided here.

The following annotations (debug/informational/warning/error messages) were provided:
 -DEBUG- Sole jar output [tika-parsers-*[0-9T].jar] identifier set to project name
 -DEBUG- (Apache Gump generated) Apache Maven Settings in: /srv/gump/public/workspace/tika/tika-parsers/gump_mvn_settings.xml
 -INFO- Failed with reason build failed
 -DEBUG- Maven POM in: /srv/gump/public/workspace/tika/tika-parsers/pom.xml
 -INFO- Failed to extract fallback artifacts from Gump Repository



The following work was performed:
http://vmgump.apache.org/gump/public/tika/tika-parsers/gump_work/build_tika_tika-parsers.html
Work Name: build_tika_tika-parsers (Type: Build)
Work ended in a state of : Failed
Elapsed: 35 secs
Command Line: /opt/maven2/bin/mvn --batch-mode -DskipTests=true --settings /srv/gump/public/workspace/tika/tika-parsers/gump_mvn_settings.xml
package 
[Working Directory: /srv/gump/public/workspace/tika/tika-parsers]
M2_HOME: /opt/maven2
---------------------------------------------
1259K downloaded  (poi-scratchpad-3.10-FINAL.jar)
[INFO] Unable to find resource 'org.apache.pdfbox:fontbox:jar:1.8.5' in repository jbig2.googlecode
(http://jbig2-imageio.googlecode.com/svn/maven-repository/)
Downloading: http://www.mygrid.org.uk/maven/repository/org/apache/pdfbox/fontbox/1.8.5/fontbox-1.8.5.jar
Downloading: http://localhost:8192/maven2/org/apache/james/apache-mime4j-dom/0.7.2/apache-mime4j-dom-0.7.2.jar
Downloading: http://localhost:8192/maven2/org/gagravarr/vorbis-java-core/0.6/vorbis-java-core-0.6.jar
9K downloaded  (slf4j-log4j12-1.5.6.jar)
297K downloaded  (apache-mime4j-dom-0.7.2.jar)
4225K downloaded  (netcdf-4.2-min.jar)
74K downloaded  (vorbis-java-core-0.6.jar)
Downloading: http://localhost:8192/maven2/org/bouncycastle/bcprov-jdk15/1.45/bcprov-jdk15-1.45.jar
Downloading: http://localhost:8192/maven2/org/apache/poi/poi-ooxml/3.10-FINAL/poi-ooxml-3.10-FINAL.jar
1050K downloaded  (poi-ooxml-3.10-FINAL.jar)
Downloading: http://localhost:8192/maven2/org/apache/poi/poi-ooxml-schemas/3.10-FINAL/poi-ooxml-schemas-3.10-FINAL.jar
4830K downloaded  (poi-ooxml-schemas-3.10-FINAL.jar)
[INFO] Unable to find resource 'org.apache.pdfbox:fontbox:jar:1.8.5' in repository mygrid-repository
(http://www.mygrid.org.uk/maven/repository)
Downloading: http://localhost:8192/maven2/org/apache/pdfbox/fontbox/1.8.5/fontbox-1.8.5.jar
225K downloaded  (fontbox-1.8.5.jar)
Downloading: http://jbig2-imageio.googlecode.com/svn/maven-repository//org/apache/pdfbox/jempbox/1.8.5/jempbox-1.8.5.jar
[INFO] Unable to find resource 'org.apache.pdfbox:jempbox:jar:1.8.5' in repository jbig2.googlecode
(http://jbig2-imageio.googlecode.com/svn/maven-repository/)
Downloading: http://www.mygrid.org.uk/maven/repository/org/apache/pdfbox/jempbox/1.8.5/jempbox-1.8.5.jar
1624K downloaded  (bcprov-jdk15-1.45.jar)
[INFO] Unable to find resource 'org.apache.pdfbox:jempbox:jar:1.8.5' in repository mygrid-repository
(http://www.mygrid.org.uk/maven/repository)
Downloading: http://localhost:8192/maven2/org/apache/pdfbox/jempbox/1.8.5/jempbox-1.8.5.jar
49K downloaded  (jempbox-1.8.5.jar)
[debug] execute contextualize
[INFO] [resources:resources {execution: default-resources}]
[INFO] Using 'UTF-8' encoding to copy filtered resources.
[INFO] Copying 5 resources
[INFO] Copying 3 resources
[INFO] [compiler:compile {execution: default-compile}]
[INFO] Compiling 139 source files to /srv/gump/public/workspace/tika/tika-parsers/target/classes
[INFO] -------------------------------------------------------------
[ERROR] COMPILATION ERROR : 
[INFO] -------------------------------------------------------------
[ERROR] /srv/gump/public/workspace/tika/tika-parsers/src/main/java/org/apache/tika/parser/font/AdobeFontMetricParser.java:[62,27]
error: cannot find symbol
[INFO] 1 error
[INFO] -------------------------------------------------------------
[INFO] ------------------------------------------------------------------------
[ERROR] BUILD FAILURE
[INFO] ------------------------------------------------------------------------
[INFO] Compilation failure
/srv/gump/public/workspace/tika/tika-parsers/src/main/java/org/apache/tika/parser/font/AdobeFontMetricParser.java:[62,27]
error: cannot find symbol

[INFO] ------------------------------------------------------------------------
[INFO] For more information, run Maven with the -e switch
[INFO] ------------------------------------------------------------------------
[INFO] Total time: 34 seconds
[INFO] Finished at: Sun May 18 01:01:09 UTC 2014
[INFO] Final Memory: 30M/90M
[INFO] ------------------------------------------------------------------------
---------------------------------------------

To subscribe to this information via syndicated feeds:
- RSS: http://vmgump.apache.org/gump/public/tika/tika-parsers/rss.xml
- Atom: http://vmgump.apache.org/gump/public/tika/tika-parsers/atom.xml

============================== Gump Tracking Only ===
Produced by Apache Gump(TM) version 2.3.
Gump Run 20140518000007, vmgump.apache.org:vmgump:20140518000007
Gump E-mail Identifier (unique within run) #5.

*********************************************************** G U M P
[GUMP@vmgump]: Project tika-reactor (in module tika) failed
To whom it may engage...
        
This is an automated request, but not an unsolicited one. For 
more information please visit http://gump.apache.org/nagged.html, 
and/or contact the folk at general@gump.apache.org.

Project tika-reactor has an issue affecting its community integration.
This issue affects 1 projects,
 and has been outstanding for 14 runs.
The current state of this project is 'Failed', with reason 'Build Failed'.
For reference only, the following projects are affected by this:
    - tika-reactor :  Apache Tika is a toolkit for detecting and extracting metada...


Full details are available at:
    http://vmgump.apache.org/gump/public/tika/tika-reactor/index.html

That said, some information snippets are provided here.

The following annotations (debug/informational/warning/error messages) were provided:
 -INFO- Optional dependency tika-parsers failed with reason build failed
 -DEBUG- (Apache Gump generated) Apache Maven Settings in: /srv/gump/public/workspace/tika/gump_mvn_settings.xml
 -INFO- Failed with reason build failed
 -DEBUG- Maven POM in: /srv/gump/public/workspace/tika/pom.xml



The following work was performed:
http://vmgump.apache.org/gump/public/tika/tika-reactor/gump_work/build_tika_tika-reactor.html
Work Name: build_tika_tika-reactor (Type: Build)
Work ended in a state of : Failed
Elapsed: 23 secs
Command Line: /opt/maven2/bin/mvn --batch-mode -DskipTests=true --settings /srv/gump/public/workspace/tika/gump_mvn_settings.xml
install 
[Working Directory: /srv/gump/public/workspace/tika]
MAVEN_OPTS: -Xmx512m 
M2_HOME: /opt/maven2
---------------------------------------------
[INFO] [clirr:check {execution: default}]
Downloading: http://localhost:8192/maven2/org/apache/tika/tika-core/1.0/tika-core-1.0.jar
484K downloaded  (tika-core-1.0.jar)
Downloading: http://localhost:8192/maven2/org/apache/tika/tika-core/1.0/tika-core-1.0.pom
4K downloaded  (tika-core-1.0.pom)
Downloading: http://localhost:8192/maven2/org/apache/tika/tika-parent/1.0/tika-parent-1.0.pom
9K downloaded  (tika-parent-1.0.pom)
[WARNING] POM for 'biz.aQute:bndlib:pom:1.43.0:provided' is invalid.

Its dependencies (if any) will NOT be available to the current build.
[INFO] Succeeded with 0 errors; 0 warnings; and 0 other changes.
[INFO] [failsafe:verify {execution: default}]
[INFO] Tests are skipped.
[INFO] [install:install {execution: default-install}]
[INFO] Installing /srv/gump/public/workspace/tika/tika-core/target/tika-core-1.6-SNAPSHOT.jar
to /srv/gump/public/workspace/mvnlocalrepo/shared/org/apache/tika/tika-core/1.6-SNAPSHOT/tika-core-1.6-SNAPSHOT.jar
[INFO] Installing /srv/gump/public/workspace/tika/tika-core/target/tika-core-1.6-SNAPSHOT-tests.jar
to /srv/gump/public/workspace/mvnlocalrepo/shared/org/apache/tika/tika-core/1.6-SNAPSHOT/tika-core-1.6-SNAPSHOT-tests.jar
[INFO] [bundle:install {execution: default-install}]
[INFO] Installing org/apache/tika/tika-core/1.6-SNAPSHOT/tika-core-1.6-SNAPSHOT.jar
[INFO] Writing OBR metadata
[INFO] ------------------------------------------------------------------------
[INFO] Building Apache Tika parsers
[INFO]    task-segment: [install]
[INFO] ------------------------------------------------------------------------
[INFO] [remote-resources:process {execution: default}]
[debug] execute contextualize
[INFO] [resources:resources {execution: default-resources}]
[INFO] Using 'UTF-8' encoding to copy filtered resources.
[INFO] Copying 5 resources
[INFO] Copying 3 resources
[INFO] [compiler:compile {execution: default-compile}]
[INFO] Compiling 48 source files to /srv/gump/public/workspace/tika/tika-parsers/target/classes
[INFO] -------------------------------------------------------------
[ERROR] COMPILATION ERROR : 
[INFO] -------------------------------------------------------------
[ERROR] /srv/gump/public/workspace/tika/tika-parsers/src/main/java/org/apache/tika/parser/font/AdobeFontMetricParser.java:[62,27]
error: cannot find symbol
[INFO] 1 error
[INFO] -------------------------------------------------------------
[INFO] ------------------------------------------------------------------------
[ERROR] BUILD FAILURE
[INFO] ------------------------------------------------------------------------
[INFO] Compilation failure
/srv/gump/public/workspace/tika/tika-parsers/src/main/java/org/apache/tika/parser/font/AdobeFontMetricParser.java:[62,27]
error: cannot find symbol

[INFO] ------------------------------------------------------------------------
[INFO] For more information, run Maven with the -e switch
[INFO] ------------------------------------------------------------------------
[INFO] Total time: 23 seconds
[INFO] Finished at: Sun May 18 01:01:33 UTC 2014
[INFO] Final Memory: 58M/152M
[INFO] ------------------------------------------------------------------------
---------------------------------------------

To subscribe to this information via syndicated feeds:
- RSS: http://vmgump.apache.org/gump/public/tika/tika-reactor/rss.xml
- Atom: http://vmgump.apache.org/gump/public/tika/tika-reactor/atom.xml

============================== Gump Tracking Only ===
Produced by Apache Gump(TM) version 2.3.
Gump Run 20140518000007, vmgump.apache.org:vmgump:20140518000007
Gump E-mail Identifier (unique within run) #6.


--
Apache Gump
http://gump.apache.org/ [Instance: vmgump]

---------------------------------------------------------------------
To unsubscribe, e-mail: general-unsubscribe@gump.apache.org
For additional commands, e-mail: general-help@gump.apache.org


Mime
View raw message