gump-general mailing list archives

Site index · List index
Message view « Date » · « Thread »
Top « Date » · « Thread »
From g...@vmgump.apache.org
Subject BATCH: All dressed up, with nowhere to go...
Date Wed, 11 Mar 2015 11:00:26 GMT
Dear Gumpmeisters,
            
The following 3 notifys should have been sent

*********************************************************** G U M P
[GUMP@vmgump]: Project logging-log4j-12-tests (in module logging-log4j-12) failed
[GUMP@vmgump]: Project tika-parsers (in module tika) failed
[GUMP@vmgump]: Project tika-reactor (in module tika) failed
*********************************************************** G U M P
[GUMP@vmgump]: Project logging-log4j-12-tests (in module logging-log4j-12) failed
To whom it may engage...
        
This is an automated request, but not an unsolicited one. For 
more information please visit http://gump.apache.org/nagged.html, 
and/or contact the folk at general@gump.apache.org.

Project logging-log4j-12-tests has an issue affecting its community integration.
This issue affects 1 projects,
 and has been outstanding for 308 runs.
The current state of this project is 'Failed', with reason 'Build Failed'.
For reference only, the following projects are affected by this:
    - logging-log4j-12-tests :  Fast and flexible logging package for Java


Full details are available at:
    http://vmgump.apache.org/gump/public/logging-log4j-12/logging-log4j-12-tests/index.html

That said, some information snippets are provided here.

The following annotations (debug/informational/warning/error messages) were provided:
 -WARNING- Overriding Maven settings: [/srv/gump/public/workspace/logging-log4j-12/gump_mvn_settings.xml]
 -DEBUG- (Apache Gump generated) Apache Maven Settings in: /srv/gump/public/workspace/logging-log4j-12/gump_mvn_settings.xml
 -INFO- Failed with reason build failed
 -DEBUG- Maven POM in: /srv/gump/public/workspace/logging-log4j-12/pom.xml



The following work was performed:
http://vmgump.apache.org/gump/public/logging-log4j-12/logging-log4j-12-tests/gump_work/build_logging-log4j-12_logging-log4j-12-tests.html
Work Name: build_logging-log4j-12_logging-log4j-12-tests (Type: Build)
Work ended in a state of : Failed
Elapsed: 3 mins 31 secs
Command Line: /opt/maven2/bin/mvn --batch-mode --settings /srv/gump/public/workspace/logging-log4j-12/gump_mvn_settings.xml
test 
[Working Directory: /srv/gump/public/workspace/logging-log4j-12]
M2_HOME: /opt/maven2
---------------------------------------------
log4j: root level set to TRACE
log4j: Class name: [org.apache.log4j.FileAppender]
log4j: Setting property [append] to [false].
log4j: Setting property [file] to [output/temp].
log4j: Parsing layout of class: "org.apache.log4j.PatternLayout"
log4j: Setting property [conversionPattern] to [%-5p %c{2} - %m
].
log4j: setFile called: output/temp, false
log4j: setFile ended
log4j: Adding appender named [TEMP] to category [root].
Tests run: 4, Failures: 0, Errors: 0, Skipped: 0, Time elapsed: 1.311 sec
Running org.apache.log4j.LevelTest
Tests run: 24, Failures: 0, Errors: 0, Skipped: 0, Time elapsed: 0.955 sec
Running org.apache.log4j.xml.DOMTestCase
/srv/gump/public/workspace/logging-log4j-12/tests/input/xml/defaultInit.xml
log4j: reset attribute= "false".
log4j: Threshold ="null".
log4j: Level value for root is  [OFF].
log4j: root level set to OFF
log4j: Class name: [org.apache.log4j.ConsoleAppender]
log4j: Parsing layout of class: "org.apache.log4j.PatternLayout"
log4j: Setting property [conversionPattern] to [%-5p %c{2} - %m%n].
log4j: Adding appender named [D1] to category [root].
Tests run: 10, Failures: 0, Errors: 0, Skipped: 0, Time elapsed: 4.302 sec
Running org.apache.log4j.or.ORTestCase
Tests run: 10, Failures: 0, Errors: 0, Skipped: 0, Time elapsed: 0.274 sec
Running org.apache.log4j.RFATestCase
Tests run: 6, Failures: 0, Errors: 0, Skipped: 0, Time elapsed: 1.177 sec
Running org.apache.log4j.TTCCLayoutTest
Tests run: 30, Failures: 0, Errors: 0, Skipped: 0, Time elapsed: 1.114 sec

Results :

Tests in error: 

Tests run: 238, Failures: 0, Errors: 1, Skipped: 0

[INFO] ------------------------------------------------------------------------
[ERROR] BUILD FAILURE
[INFO] ------------------------------------------------------------------------
[INFO] There are test failures.

Please refer to /srv/gump/public/workspace/logging-log4j-12/target/surefire-reports for the
individual test results.
[INFO] ------------------------------------------------------------------------
[INFO] For more information, run Maven with the -e switch
[INFO] ------------------------------------------------------------------------
[INFO] Total time: 3 minutes 28 seconds
[INFO] Finished at: Wed Mar 11 00:32:41 UTC 2015
[INFO] Final Memory: 22M/56M
[INFO] ------------------------------------------------------------------------
---------------------------------------------

To subscribe to this information via syndicated feeds:
- RSS: http://vmgump.apache.org/gump/public/logging-log4j-12/logging-log4j-12-tests/rss.xml
- Atom: http://vmgump.apache.org/gump/public/logging-log4j-12/logging-log4j-12-tests/atom.xml

============================== Gump Tracking Only ===
Produced by Apache Gump(TM) version 2.3.
Gump Run 20150311000004, vmgump.apache.org:vmgump:20150311000004
Gump E-mail Identifier (unique within run) #1.

*********************************************************** G U M P
[GUMP@vmgump]: Project tika-parsers (in module tika) failed
To whom it may engage...
        
This is an automated request, but not an unsolicited one. For 
more information please visit http://gump.apache.org/nagged.html, 
and/or contact the folk at general@gump.apache.org.

Project tika-parsers has an issue affecting its community integration.
This issue affects 2 projects,
 and has been outstanding for 195 runs.
The current state of this project is 'Failed', with reason 'Build Failed'.
For reference only, the following projects are affected by this:
    - tika-parsers :  Apache Tika is a toolkit for detecting and extracting metada...
    - tika-parsers-test :  Apache Tika is a toolkit for detecting and extracting metada...


Full details are available at:
    http://vmgump.apache.org/gump/public/tika/tika-parsers/index.html

That said, some information snippets are provided here.

The following annotations (debug/informational/warning/error messages) were provided:
 -DEBUG- Sole jar output [tika-parsers-*[0-9T].jar] identifier set to project name
 -DEBUG- (Apache Gump generated) Apache Maven Settings in: /srv/gump/public/workspace/tika/tika-parsers/gump_mvn_settings.xml
 -INFO- Failed with reason build failed
 -DEBUG- Maven POM in: /srv/gump/public/workspace/tika/tika-parsers/pom.xml
 -INFO- Failed to extract fallback artifacts from Gump Repository



The following work was performed:
http://vmgump.apache.org/gump/public/tika/tika-parsers/gump_work/build_tika_tika-parsers.html
Work Name: build_tika_tika-parsers (Type: Build)
Work ended in a state of : Failed
Elapsed: 52 secs
Command Line: /opt/maven3/bin/mvn --batch-mode -DskipTests=true --settings /srv/gump/public/workspace/tika/tika-parsers/gump_mvn_settings.xml
package 
[Working Directory: /srv/gump/public/workspace/tika/tika-parsers]
M2_HOME: /opt/maven3
---------------------------------------------
[INFO] Downloading: http://localhost:8192/maven2/edu/ucar/jj2000/5.2/jj2000-5.2.jar
[INFO] Downloaded: http://localhost:8192/maven2/com/google/protobuf/protobuf-java/2.5.0/protobuf-java-2.5.0.jar
(521 KB at 1046.1 KB/sec)
[INFO] Downloading: http://localhost:8192/maven2/org/itadaki/bzip2/0.9.1/bzip2-0.9.1.jar
[INFO] Downloaded: http://localhost:8192/maven2/org/jdom/jdom2/2.0.4/jdom2-2.0.4.jar (292
KB at 629.3 KB/sec)
[INFO] Downloading: http://localhost:8192/maven2/edu/ucar/cdm/4.5.4/cdm-4.5.4.jar
[INFO] Downloading: http://localhost:8192/maven2/edu/ucar/udunits/4.5.4/udunits-4.5.4.jar
[INFO] Downloaded: http://localhost:8192/maven2/org/jsoup/jsoup/1.7.2/jsoup-1.7.2.jar (287
KB at 651.8 KB/sec)
[INFO] Downloading: http://localhost:8192/maven2/org/apache/httpcomponents/httpcore/4.2.5/httpcore-4.2.5.jar
[INFO] Downloading: http://localhost:8192/maven2/joda-time/joda-time/2.2/joda-time-2.2.jar
[INFO] Downloading: http://localhost:8192/maven2/org/quartz-scheduler/quartz/2.2.0/quartz-2.2.0.jar
[INFO] Downloaded: http://localhost:8192/maven2/edu/ucar/grib/4.5.4/grib-4.5.4.jar (5007 KB
at 2606.2 KB/sec)
[INFO] Downloading: http://localhost:8192/maven2/c3p0/c3p0/0.9.1.1/c3p0-0.9.1.1.jar
[INFO] Downloaded: http://localhost:8192/maven2/edu/ucar/cdm/4.5.4/cdm-4.5.4.jar (4084 KB
at 2845.9 KB/sec)
[INFO] Downloading: http://localhost:8192/maven2/net/sf/ehcache/ehcache-core/2.6.2/ehcache-core-2.6.2.jar
[INFO] Downloaded: http://localhost:8192/maven2/org/apache/httpcomponents/httpcore/4.2.5/httpcore-4.2.5.jar
(223 KB at 160.4 KB/sec)
[INFO] Downloading: http://localhost:8192/maven2/com/beust/jcommander/1.35/jcommander-1.35.jar
[INFO] Downloaded: http://localhost:8192/maven2/joda-time/joda-time/2.2/joda-time-2.2.jar
(561 KB at 407.0 KB/sec)
[INFO] Downloading: http://localhost:8192/maven2/edu/ucar/httpservices/4.5.4/httpservices-4.5.4.jar
[INFO] Downloaded: http://localhost:8192/maven2/org/quartz-scheduler/quartz/2.2.0/quartz-2.2.0.jar
(639 KB at 1400.1 KB/sec)
[INFO] Downloading: http://localhost:8192/maven2/org/apache/httpcomponents/httpclient/4.2.6/httpclient-4.2.6.jar
[INFO] Downloaded: http://localhost:8192/maven2/c3p0/c3p0/0.9.1.1/c3p0-0.9.1.1.jar (595 KB
at 1463.3 KB/sec)
[INFO] Downloading: http://localhost:8192/maven2/org/apache/httpcomponents/httpmime/4.2.6/httpmime-4.2.6.jar
[INFO] Downloaded: http://localhost:8192/maven2/com/beust/jcommander/1.35/jcommander-1.35.jar
(60 KB at 191.4 KB/sec)
[INFO] Downloading: http://localhost:8192/maven2/com/google/guava/guava/10.0.1/guava-10.0.1.jar
[INFO] Downloaded: http://localhost:8192/maven2/edu/ucar/httpservices/4.5.4/httpservices-4.5.4.jar
(61 KB at 134.6 KB/sec)
[INFO] Downloaded: http://localhost:8192/maven2/net/sf/ehcache/ehcache-core/2.6.2/ehcache-core-2.6.2.jar
(1307 KB at 1893.9 KB/sec)
[INFO] Downloaded: http://localhost:8192/maven2/org/apache/httpcomponents/httpclient/4.2.6/httpclient-4.2.6.jar
(426 KB at 911.0 KB/sec)
[INFO] Downloaded: http://localhost:8192/maven2/org/apache/httpcomponents/httpmime/4.2.6/httpmime-4.2.6.jar
(27 KB at 51.6 KB/sec)
[INFO] Downloaded: http://localhost:8192/maven2/com/google/guava/guava/10.0.1/guava-10.0.1.jar
(2204 KB at 4212.9 KB/sec)
[INFO] Downloading: https://artifacts.unidata.ucar.edu/content/repositories/unidata/edu/ucar/jj2000/5.2/jj2000-5.2.jar
[INFO] Downloading: https://artifacts.unidata.ucar.edu/content/repositories/unidata/org/itadaki/bzip2/0.9.1/bzip2-0.9.1.jar
[INFO] Downloaded: https://artifacts.unidata.ucar.edu/content/repositories/unidata/org/itadaki/bzip2/0.9.1/bzip2-0.9.1.jar
(53 KB at 153.9 KB/sec)
[INFO] Downloaded: https://artifacts.unidata.ucar.edu/content/repositories/unidata/edu/ucar/jj2000/5.2/jj2000-5.2.jar
(518 KB at 579.6 KB/sec)
[INFO] Downloading: http://download.oracle.com/maven/edu/ucar/udunits/4.5.4/udunits-4.5.4.jar
[INFO] Downloading: https://artifacts.unidata.ucar.edu/content/repositories/unidata/edu/ucar/udunits/4.5.4/udunits-4.5.4.jar
[INFO] Downloaded: https://artifacts.unidata.ucar.edu/content/repositories/unidata/edu/ucar/udunits/4.5.4/udunits-4.5.4.jar
(122 KB at 464.9 KB/sec)
[INFO] ------------------------------------------------------------------------
[INFO] BUILD FAILURE
[INFO] ------------------------------------------------------------------------
[INFO] Total time: 41.301 s
[INFO] Finished at: 2015-03-11T03:32:21+00:00
[INFO] Final Memory: 10M/25M
[INFO] ------------------------------------------------------------------------
[ERROR] Failed to execute goal on project tika-parsers: Could not resolve dependencies for
project org.apache.tika:tika-parsers:bundle:1.8-SNAPSHOT: Could not find artifact org.apache.tika:tika-core:jar:tests:1.8-SNAPSHOT
in gump-apache.snapshots (http://localhost:8192/repo/m2-snapshot-repository) -> [Help 1]
[ERROR] 
[ERROR] To see the full stack trace of the errors, re-run Maven with the -e switch.
[ERROR] Re-run Maven using the -X switch to enable full debug logging.
[ERROR] 
[ERROR] For more information about the errors and possible solutions, please read the following
articles:
[ERROR] [Help 1] http://cwiki.apache.org/confluence/display/MAVEN/DependencyResolutionException
---------------------------------------------

To subscribe to this information via syndicated feeds:
- RSS: http://vmgump.apache.org/gump/public/tika/tika-parsers/rss.xml
- Atom: http://vmgump.apache.org/gump/public/tika/tika-parsers/atom.xml

============================== Gump Tracking Only ===
Produced by Apache Gump(TM) version 2.3.
Gump Run 20150311000004, vmgump.apache.org:vmgump:20150311000004
Gump E-mail Identifier (unique within run) #2.

*********************************************************** G U M P
[GUMP@vmgump]: Project tika-reactor (in module tika) failed
To whom it may engage...
        
This is an automated request, but not an unsolicited one. For 
more information please visit http://gump.apache.org/nagged.html, 
and/or contact the folk at general@gump.apache.org.

Project tika-reactor has an issue affecting its community integration.
This issue affects 1 projects,
 and has been outstanding for 195 runs.
The current state of this project is 'Failed', with reason 'Build Failed'.
For reference only, the following projects are affected by this:
    - tika-reactor :  Apache Tika is a toolkit for detecting and extracting metada...


Full details are available at:
    http://vmgump.apache.org/gump/public/tika/tika-reactor/index.html

That said, some information snippets are provided here.

The following annotations (debug/informational/warning/error messages) were provided:
 -INFO- Optional dependency tika-parsers failed with reason build failed
 -DEBUG- (Apache Gump generated) Apache Maven Settings in: /srv/gump/public/workspace/tika/gump_mvn_settings.xml
 -INFO- Failed with reason build failed
 -DEBUG- Maven POM in: /srv/gump/public/workspace/tika/pom.xml



The following work was performed:
http://vmgump.apache.org/gump/public/tika/tika-reactor/gump_work/build_tika_tika-reactor.html
Work Name: build_tika_tika-reactor (Type: Build)
Work ended in a state of : Failed
Elapsed: 1 min 56 secs
Command Line: /opt/maven3/bin/mvn --batch-mode -DskipTests=true --settings /srv/gump/public/workspace/tika/gump_mvn_settings.xml
install 
[Working Directory: /srv/gump/public/workspace/tika]
MAVEN_OPTS: -Xmx512m 
M2_HOME: /opt/maven3
---------------------------------------------
[INFO] 5 errors 
[INFO] -------------------------------------------------------------
[INFO] ------------------------------------------------------------------------
[INFO] Reactor Summary:
[INFO] 
[INFO] Apache Tika parent ................................. SUCCESS [ 14.631 s]
[INFO] Apache Tika core ................................... SUCCESS [ 50.769 s]
[INFO] Apache Tika parsers ................................ FAILURE [ 37.469 s]
[INFO] Apache Tika XMP .................................... SKIPPED
[INFO] Apache Tika serialization .......................... SKIPPED
[INFO] Apache Tika application ............................ SKIPPED
[INFO] Apache Tika OSGi bundle ............................ SKIPPED
[INFO] Apache Tika server ................................. SKIPPED
[INFO] Apache Tika translate .............................. SKIPPED
[INFO] Apache Tika examples ............................... SKIPPED
[INFO] Apache Tika Java-7 Components ...................... SKIPPED
[INFO] Apache Tika ........................................ SKIPPED
[INFO] ------------------------------------------------------------------------
[INFO] BUILD FAILURE
[INFO] ------------------------------------------------------------------------
[INFO] Total time: 01:48 min
[INFO] Finished at: 2015-03-11T03:34:17+00:00
[INFO] Final Memory: 41M/139M
[INFO] ------------------------------------------------------------------------
[ERROR] Failed to execute goal org.apache.maven.plugins:maven-compiler-plugin:3.2:compile
(default-compile) on project tika-parsers: Compilation failure: Compilation failure:
[ERROR] /srv/gump/public/workspace/tika/tika-parsers/src/main/java/org/apache/tika/parser/font/AdobeFontMetricParser.java:[26,30]
cannot find symbol
[ERROR] symbol:   class FontMetric
[ERROR] location: package org.apache.fontbox.afm
[ERROR] /srv/gump/public/workspace/tika/tika-parsers/src/main/java/org/apache/tika/parser/font/AdobeFontMetricParser.java:[70,8]
cannot find symbol
[ERROR] symbol:   class FontMetric
[ERROR] location: class org.apache.tika.parser.font.AdobeFontMetricParser
[ERROR] /srv/gump/public/workspace/tika/tika-parsers/src/main/java/org/apache/tika/parser/font/AdobeFontMetricParser.java:[75,28]
cannot find symbol
[ERROR] symbol:   method getResult()
[ERROR] location: variable parser of type org.apache.fontbox.afm.AFMParser
[ERROR] /srv/gump/public/workspace/tika/tika-parsers/src/main/java/org/apache/tika/parser/font/TrueTypeParser.java:[67,26]
cannot find symbol
[ERROR] symbol:   method parseTTF(java.io.File)
[ERROR] location: variable parser of type org.apache.fontbox.ttf.TTFParser
[ERROR] /srv/gump/public/workspace/tika/tika-parsers/src/main/java/org/apache/tika/parser/font/TrueTypeParser.java:[69,26]
cannot find symbol
[ERROR] symbol:   method parseTTF(java.io.InputStream)
[ERROR] location: variable parser of type org.apache.fontbox.ttf.TTFParser
[ERROR] -> [Help 1]
[ERROR] 
[ERROR] To see the full stack trace of the errors, re-run Maven with the -e switch.
[ERROR] Re-run Maven using the -X switch to enable full debug logging.
[ERROR] 
[ERROR] For more information about the errors and possible solutions, please read the following
articles:
[ERROR] [Help 1] http://cwiki.apache.org/confluence/display/MAVEN/MojoFailureException
[ERROR] 
[ERROR] After correcting the problems, you can resume the build with the command
[ERROR]   mvn <goals> -rf :tika-parsers
---------------------------------------------

To subscribe to this information via syndicated feeds:
- RSS: http://vmgump.apache.org/gump/public/tika/tika-reactor/rss.xml
- Atom: http://vmgump.apache.org/gump/public/tika/tika-reactor/atom.xml

============================== Gump Tracking Only ===
Produced by Apache Gump(TM) version 2.3.
Gump Run 20150311000004, vmgump.apache.org:vmgump:20150311000004
Gump E-mail Identifier (unique within run) #3.


--
Apache Gump
http://gump.apache.org/ [Instance: vmgump]

---------------------------------------------------------------------
To unsubscribe, e-mail: general-unsubscribe@gump.apache.org
For additional commands, e-mail: general-help@gump.apache.org


Mime
View raw message