gump-general mailing list archives

Site index · List index
Message view « Date » · « Thread »
Top « Date » · « Thread »
From g...@vmgump.apache.org
Subject BATCH: All dressed up, with nowhere to go...
Date Fri, 06 Nov 2015 09:32:57 GMT
Dear Gumpmeisters,
            
The following 2 notifys should have been sent

*********************************************************** G U M P
[GUMP@vmgump]: Project compress-antlib-test (in module antlibs-compress) failed
[GUMP@vmgump]: Project commons-bcel6 (in module apache-commons) failed
*********************************************************** G U M P
[GUMP@vmgump]: Project compress-antlib-test (in module antlibs-compress) failed
To whom it may engage...
        
This is an automated request, but not an unsolicited one. For 
more information please visit http://gump.apache.org/nagged.html, 
and/or contact the folk at general@gump.apache.org.

Project compress-antlib-test has an issue affecting its community integration.
This issue affects 1 projects,
 and has been outstanding for 61 runs.
The current state of this project is 'Failed', with reason 'Build Failed'.
For reference only, the following projects are affected by this:
    - compress-antlib-test :  The Apache Compress Antlib contains tasks and resources that...


Full details are available at:
    http://vmgump.apache.org/gump/public/antlibs-compress/compress-antlib-test/index.html

That said, some information snippets are provided here.

The following annotations (debug/informational/warning/error messages) were provided:
 -DEBUG- Dependency on ant exists, no need to add for property ant.home.
 -INFO- Failed with reason build failed



The following work was performed:
http://vmgump.apache.org/gump/public/antlibs-compress/compress-antlib-test/gump_work/build_antlibs-compress_compress-antlib-test.html
Work Name: build_antlibs-compress_compress-antlib-test (Type: Build)
Work ended in a state of : Failed
Elapsed: 5 mins 14 secs
Command Line: /usr/lib/jvm/java-8-oracle/bin/java -Djava.awt.headless=true -Dbuild.sysclasspath=only
-Xbootclasspath/p:/srv/gump/public/workspace/xml-xerces2/build/xercesImpl.jar:/srv/gump/public/workspace/xml-commons/java/external/build/xml-apis.jar
org.apache.tools.ant.Main -Dgump.merge=/srv/gump/public/gump/work/merge.xml -Dant.home=/srv/gump/public/workspace/ant/dist
test 
[Working Directory: /srv/gump/public/workspace/antlibs-compress]
CLASSPATH: /usr/lib/jvm/java-8-oracle/lib/tools.jar:/srv/gump/public/workspace/antlibs-compress/ivy/ivy.jar:/srv/gump/public/workspace/antlibs-compress/build/ant-compress-20151106.jar:/srv/gump/public/workspace/ant/dist/lib/ant.jar:/srv/gump/public/workspace/ant/dist/lib/ant-launcher.jar:/srv/gump/public/workspace/ant/dist/lib/ant-jmf.jar:/srv/gump/public/workspace/ant/dist/lib/ant-junit.jar:/srv/gump/public/workspace/ant/dist/lib/ant-junit4.jar:/srv/gump/public/workspace/ant/dist/lib/ant-swing.jar:/srv/gump/public/workspace/ant/dist/lib/ant-apache-resolver.jar:/srv/gump/public/workspace/ant/dist/lib/ant-apache-xalan2.jar:/srv/gump/public/workspace/commons-compress/target/commons-compress-1.11-SNAPSHOT.jar:/srv/gump/public/workspace/xz-java/build/jar-20151106/xz.jar:/srv/gump/public/workspace/antlibs-antunit/build/ant-antunit-20151106.jar:/srv/gump/public/workspace/xml-commons/java/external/build/xml-apis-ext.jar
---------------------------------------------
[au:antunit] Target: testWithDirectories took 0.016 sec
[au:antunit] Target: testFullpath took 0.012 sec
[au:antunit] Target: testPreserve0Permissions took 0.012 sec
[au:antunit] Target: testForceCreateOfUpToDate took 4.123 sec
[au:antunit] Target: testNoDirectoriesByDefault took 0.053 sec
[au:antunit] Target: testPlainFileSet took 0.011 sec
[au:antunit] Target: testReplaceOfUpToDate took 4.015 sec
[au:antunit] Target: testCoreZipFileSet  FAILED
[au:antunit] 	at line 35, column 24
[au:antunit] 	Message: Assertion failed
[au:antunit] 	took 0.02 sec
[au:antunit] Target: testAntlibTarFileSet took 0.02 sec
[au:antunit] Target: testCreateOfOutOfDate took 4.037 sec
[au:antunit] Target: testFileSetPermissionsWin took 0.025 sec
[au:antunit] Target: testAddDuplicates took 0.012 sec
[au:antunit] Target: testRemoveLeadingSlashes took 0.056 sec
[au:antunit] Target: testPrefixWithSlash took 0.02 sec
[au:antunit] Target: testWithImplicitDirectories took 0.027 sec
[au:antunit] Target: testForceReplaceOfUpToDate took 4.034 sec
[au:antunit] Target: test0PermissionsGetReplaced took 0.024 sec
[au:antunit] Target: testFailDuplicates took 0.004 sec
[au:antunit] Build File: /srv/gump/public/workspace/antlibs-compress/src/tests/antunit/zipentry-test.xml
[au:antunit] Tests run: 3, Failures: 1, Errors: 0, Time elapsed: 0.077 sec
[au:antunit] Target: testResourceProperties  FAILED
[au:antunit] 	at line 59, column 20
[au:antunit] 	Message: Assertion failed
[au:antunit] 	took 0.011 sec
[au:antunit] Target: testUncompressSource took 0.006 sec
[au:antunit] Target: testZipSource took 0.039 sec
[au:antunit] Build File: /srv/gump/public/workspace/antlibs-compress/src/tests/antunit/zipfileset-test.xml
[au:antunit] Tests run: 9, Failures: 0, Errors: 0, Time elapsed: 0.303 sec
[au:antunit] Target: testSkipUnreadableEntries took 0.007 sec
[au:antunit] Target: testMissingArchive took 0.002 sec
[au:antunit] Target: testUncompressSource took 0.005 sec
[au:antunit] Target: test-refid-check-encoding took 0.003 sec
[au:antunit] Target: testZipSource took 0.003 sec
[au:antunit] Target: test-refid-modify took 0.056 sec
[au:antunit] Target: test-refid-check-prefix took 0.004 sec
[au:antunit] Target: testMissingArchiveDoesntMatter took 0.003 sec
[au:antunit] Target: testFailsOnUnreadableEntries took 0.007 sec
[au:antunit] Build File: /srv/gump/public/workspace/antlibs-compress/src/tests/antunit/zresource-test.xml
[au:antunit] Tests run: 1, Failures: 0, Errors: 0, Time elapsed: 0.013 sec
[au:antunit] Target: testNativeZ took 0.012 sec

test:

BUILD FAILED
/srv/gump/public/workspace/antlibs-compress/common/build.xml:209: At least one AntUnit test
has failed.

Total time: 5 minutes 14 seconds
---------------------------------------------

To subscribe to this information via syndicated feeds:
- RSS: http://vmgump.apache.org/gump/public/antlibs-compress/compress-antlib-test/rss.xml
- Atom: http://vmgump.apache.org/gump/public/antlibs-compress/compress-antlib-test/atom.xml

============================== Gump Tracking Only ===
Produced by Apache Gump(TM) version 2.3.
Gump Run 20151106000005, vmgump.apache.org:vmgump:20151106000005
Gump E-mail Identifier (unique within run) #1.

*********************************************************** G U M P
[GUMP@vmgump]: Project commons-bcel6 (in module apache-commons) failed
To whom it may engage...
        
This is an automated request, but not an unsolicited one. For 
more information please visit http://gump.apache.org/nagged.html, 
and/or contact the folk at general@gump.apache.org.

Project commons-bcel6 has an issue affecting its community integration.
This issue affects 1 projects,
 and has been outstanding for 110 runs.
The current state of this project is 'Failed', with reason 'Build Failed'.
For reference only, the following projects are affected by this:
    - commons-bcel6 :  Byte Code Engineering Library


Full details are available at:
    http://vmgump.apache.org/gump/public/apache-commons/commons-bcel6/index.html

That said, some information snippets are provided here.

The following annotations (debug/informational/warning/error messages) were provided:
 -DEBUG- Sole jar output [commons-bcel6-[0-9]*[0-9T].jar] identifier set to project name
 -DEBUG- (Apache Gump generated) Apache Maven Settings in: /srv/gump/public/workspace/apache-commons/bcel/gump_mvn_settings.xml
 -INFO- Failed with reason build failed
 -DEBUG- Maven POM in: /srv/gump/public/workspace/apache-commons/bcel/pom.xml
 -INFO- Failed to extract fallback artifacts from Gump Repository



The following work was performed:
http://vmgump.apache.org/gump/public/apache-commons/commons-bcel6/gump_work/build_apache-commons_commons-bcel6.html
Work Name: build_apache-commons_commons-bcel6 (Type: Build)
Work ended in a state of : Failed
Elapsed: 56 secs
Command Line: /opt/maven3/bin/mvn --batch-mode --settings /srv/gump/public/workspace/apache-commons/bcel/gump_mvn_settings.xml
package 
[Working Directory: /srv/gump/public/workspace/apache-commons/bcel]
M2_HOME: /opt/maven3
---------------------------------------------
main:
     [copy] Copying 2 files to /srv/gump/public/workspace/apache-commons/bcel/target/apidocs/META-INF
[INFO] Executed tasks
[INFO] 
[INFO] --- maven-remote-resources-plugin:1.5:process (default) @ commons-bcel6 ---
[INFO] 
[INFO] --- buildnumber-maven-plugin:1.3:create (default) @ commons-bcel6 ---
[INFO] Executing: /bin/sh -c cd /srv/gump/public/workspace/apache-commons/bcel &&
svn --non-interactive info
[INFO] Working directory: /srv/gump/public/workspace/apache-commons/bcel
[INFO] Storing buildNumber: ?????? at timestamp: 1446777062047
[INFO] Executing: /bin/sh -c cd /srv/gump/public/workspace/apache-commons/bcel &&
svn --non-interactive info
[INFO] Working directory: /srv/gump/public/workspace/apache-commons/bcel
[INFO] Storing buildScmBranch: UNKNOWN_BRANCH
[INFO] 
[INFO] --- maven-resources-plugin:2.7:resources (default-resources) @ commons-bcel6 ---
[INFO] Using 'ISO-8859-1' encoding to copy filtered resources.
[INFO] skip non existing resourceDirectory /srv/gump/public/workspace/apache-commons/bcel/src/main/resources
[INFO] Copying 2 resources to META-INF
[INFO] 
[INFO] --- maven-compiler-plugin:3.2:compile (default-compile) @ commons-bcel6 ---
[INFO] Changes detected - recompiling the module!
[INFO] Compiling 374 source files to /srv/gump/public/workspace/apache-commons/bcel/target/classes
[INFO] /srv/gump/public/workspace/apache-commons/bcel/src/main/java/org/apache/commons/bcel6/util/ClassLoader.java:
Some input files use or override a deprecated API.
[INFO] /srv/gump/public/workspace/apache-commons/bcel/src/main/java/org/apache/commons/bcel6/util/ClassLoader.java:
Recompile with -Xlint:deprecation for details.
[INFO] 
[INFO] --- maven-bundle-plugin:2.5.3:manifest (bundle-manifest) @ commons-bcel6 ---
[INFO] 
[INFO] --- animal-sniffer-maven-plugin:1.13:check (checkAPIcompatibility) @ commons-bcel6
---
[INFO] Checking unresolved references to org.codehaus.mojo.signature:java17:1.0
[INFO] Downloading: http://localhost:8192/maven2/org/codehaus/mojo/signature/java17/1.0/java17-1.0.signature
[INFO] ------------------------------------------------------------------------
[INFO] BUILD FAILURE
[INFO] ------------------------------------------------------------------------
[INFO] Total time: 51.798 s
[INFO] Finished at: 2015-11-06T02:31:42+00:00
[INFO] Final Memory: 24M/71M
[INFO] ------------------------------------------------------------------------
[ERROR] Failed to execute goal org.codehaus.mojo:animal-sniffer-maven-plugin:1.13:check (checkAPIcompatibility)
on project commons-bcel6: Failed to obtain signature: org.codehaus.mojo.signature:java17:1.0:
Could not transfer artifact org.codehaus.mojo.signature:java17:signature:1.0 from/to gump-central
(http://localhost:8192/maven2): TransferFailedException
[ERROR] org.codehaus.mojo.signature:java17:signature:1.0
[ERROR] 
[ERROR] from the specified remote repositories:
[ERROR] gump-apache.snapshots (http://localhost:8192/repo/m2-snapshot-repository, releases=false,
snapshots=true),
[ERROR] gump-central (http://localhost:8192/maven2, releases=true, snapshots=false): ClientProtocolException:
Status line contains invalid status code: HTTP/1.1 :01 :01
[ERROR] -> [Help 1]
[ERROR] 
[ERROR] To see the full stack trace of the errors, re-run Maven with the -e switch.
[ERROR] Re-run Maven using the -X switch to enable full debug logging.
[ERROR] 
[ERROR] For more information about the errors and possible solutions, please read the following
articles:
[ERROR] [Help 1] http://cwiki.apache.org/confluence/display/MAVEN/MojoExecutionException
---------------------------------------------

To subscribe to this information via syndicated feeds:
- RSS: http://vmgump.apache.org/gump/public/apache-commons/commons-bcel6/rss.xml
- Atom: http://vmgump.apache.org/gump/public/apache-commons/commons-bcel6/atom.xml

============================== Gump Tracking Only ===
Produced by Apache Gump(TM) version 2.3.
Gump Run 20151106000005, vmgump.apache.org:vmgump:20151106000005
Gump E-mail Identifier (unique within run) #2.


--
Apache Gump
http://gump.apache.org/ [Instance: vmgump]

---------------------------------------------------------------------
To unsubscribe, e-mail: general-unsubscribe@gump.apache.org
For additional commands, e-mail: general-help@gump.apache.org


Mime
View raw message