gump-general mailing list archives

Site index · List index
Message view « Date » · « Thread »
Top « Date » · « Thread »
From g...@vmgump.apache.org
Subject BATCH: All dressed up, with nowhere to go...
Date Sun, 07 Feb 2016 07:26:45 GMT
Dear Gumpmeisters,
            
The following 5 notifys should have been sent

*********************************************************** G U M P
[GUMP@vmgump]: Project openssl-make-test (in module openssl-master) failed
[GUMP@vmgump]: Project apache-httpd-make (in module apache-httpd) failed
[GUMP@vmgump]: Project compress-antlib-test (in module antlibs-compress) failed
[GUMP@vmgump]: Module commons-lang-trunk failed
[GUMP@vmgump]: Project commons-lang3 (in module commons-lang-trunk) failed
*********************************************************** G U M P
[GUMP@vmgump]: Project openssl-make-test (in module openssl-master) failed
To whom it may engage...
        
This is an automated request, but not an unsolicited one. For 
more information please visit http://gump.apache.org/nagged.html, 
and/or contact the folk at general@gump.apache.org.

Project openssl-make-test has an issue affecting its community integration.
This issue affects 10 projects,
 and has been outstanding for 2 runs.
The current state of this project is 'Failed', with reason 'Build Timed Out'.
For reference only, the following projects are affected by this:
    - openssl-make-install :  OpenSSL Encryption Library
    - openssl-make-test :  OpenSSL Encryption Library
    - tomcat-native-configure :  Tomcat native library using Apache Portable Runtime
    - tomcat-native-make :  Tomcat native library using Apache Portable Runtime
    - tomcat-native-make-install :  Tomcat native library using Apache Portable Runtime
    - tomcat-tc7.0.x-test-apr :  Tomcat 7.x, a web server implementing Java Servlet 3.0,
    ...
    - tomcat-tc8.0.x-test-apr :  Tomcat 8.x, a web server implementing the Java Servlet 3.1,
...
    - tomcat-trunk-test-apr :  Tomcat 9.x, a web server implementing the Java Servlet 4.0,
...
    - tomcat-trunk-test-nio :  Tomcat 9.x, a web server implementing the Java Servlet 4.0,
...
    - tomcat-trunk-test-nio2 :  Tomcat 9.x, a web server implementing the Java Servlet 4.0,
...


Full details are available at:
    http://vmgump.apache.org/gump/public/openssl-master/openssl-make-test/index.html

That said, some information snippets are provided here.

The following annotations (debug/informational/warning/error messages) were provided:
 -INFO- Failed with reason build timed out



The following work was performed:
http://vmgump.apache.org/gump/public/openssl-master/openssl-make-test/gump_work/build_openssl-master_openssl-make-test.html
Work Name: build_openssl-master_openssl-make-test (Type: Build)
Work ended in a state of : Failed
Elapsed: 1 hour 3 secs
Command Line: make test 
[Working Directory: /srv/gump/public/workspace/openssl-master]
---------------------------------------------
make[3]: Entering directory `/srv/gump/public/workspace/openssl-master/apps'
make[3]: Nothing to be done for `all'.
make[3]: Leaving directory `/srv/gump/public/workspace/openssl-master/apps'
make[2]: Leaving directory `/srv/gump/public/workspace/openssl-master'
TOP=.. PERL=/usr/bin/perl /usr/bin/perl run_tests.pl alltests
../test/recipes/00-check_testexes.t ....... skipped: because MINFO not found. If you want
this test to run, please do 'perl util/mkfiles.pl > MINFO'
../test/recipes/01-test_ordinals.t ........ ok
../test/recipes/05-test_bf.t .............. ok
../test/recipes/05-test_cast.t ............ ok
../test/recipes/05-test_des.t ............. ok
../test/recipes/05-test_hmac.t ............ ok
../test/recipes/05-test_idea.t ............ ok
../test/recipes/05-test_md2.t ............. skipped: md2 is not supported by this OpenSSL
build
../test/recipes/05-test_md4.t ............. ok
../test/recipes/05-test_md5.t ............. ok
../test/recipes/05-test_mdc2.t ............ ok
../test/recipes/05-test_rand.t ............ ok
../test/recipes/05-test_rc2.t ............. ok
../test/recipes/05-test_rc4.t ............. ok
../test/recipes/05-test_rc5.t ............. skipped: rc5 is not supported by this OpenSSL
build
../test/recipes/05-test_rmd.t ............. ok
../test/recipes/05-test_sha1.t ............ ok
../test/recipes/05-test_sha256.t .......... ok
../test/recipes/05-test_sha512.t .......... ok
../test/recipes/05-test_wp.t .............. ok
../test/recipes/10-test_bn.t .............. ok
../test/recipes/10-test_exp.t ............. ok
../test/recipes/15-test_dh.t .............. ok
../test/recipes/15-test_dsa.t ............. ok
../test/recipes/15-test_ec.t .............. ok
../test/recipes/15-test_ecdh.t ............ ok
../test/recipes/15-test_ecdsa.t ........... ok
../test/recipes/15-test_rsa.t ............. ok
../test/recipes/20-test_enc.t ............. ok
../test/recipes/25-test_crl.t ............. ok
../test/recipes/25-test_gen.t ............. ok
../test/recipes/25-test_pkcs7.t ........... ok
../test/recipes/25-test_req.t ............. ok
../test/recipes/25-test_sid.t ............. ok
../test/recipes/25-test_verify.t .......... ok
../test/recipes/25-test_x509.t ............ ok
../test/recipes/30-test_engine.t .......... ok
../test/recipes/30-test_evp.t ............. ok
../test/recipes/30-test_evp_extra.t ....... ok
../test/recipes/30-test_pbelu.t ........... ok
../test/recipes/40-test_rehash.t .......... ok
../test/recipes/70-test_clienthello.t ..... ok
../test/recipes/70-test_packet.t .......... ok
../test/recipes/70-test_sslcertstatus.t ... ok
../test/recipes/70-test_sslextension.t .... ok
---------------------------------------------

To subscribe to this information via syndicated feeds:
- RSS: http://vmgump.apache.org/gump/public/openssl-master/openssl-make-test/rss.xml
- Atom: http://vmgump.apache.org/gump/public/openssl-master/openssl-make-test/atom.xml

============================== Gump Tracking Only ===
Produced by Apache Gump(TM) version 2.3.
Gump Run 20160207000008, vmgump.apache.org:vmgump:20160207000008
Gump E-mail Identifier (unique within run) #1.

*********************************************************** G U M P
[GUMP@vmgump]: Project apache-httpd-make (in module apache-httpd) failed
To whom it may engage...
        
This is an automated request, but not an unsolicited one. For 
more information please visit http://gump.apache.org/nagged.html, 
and/or contact the folk at general@gump.apache.org.

Project apache-httpd-make has an issue affecting its community integration.
This issue affects 5 projects,
 and has been outstanding for 3 runs.
The current state of this project is 'Failed', with reason 'Build Failed'.
For reference only, the following projects are affected by this:
    - apache-httpd-make :  Apache HTTP Server
    - apache-httpd-make-install :  Apache HTTP Server
    - tomcat-jk-native :  Connectors to various web servers
    - tomcat-jk-native-buildconf :  Connectors to various web servers
    - tomcat-jk-native-configure :  Connectors to various web servers


Full details are available at:
    http://vmgump.apache.org/gump/public/apache-httpd/apache-httpd-make/index.html

That said, some information snippets are provided here.

The following annotations (debug/informational/warning/error messages) were provided:
 -INFO- Failed with reason build failed



The following work was performed:
http://vmgump.apache.org/gump/public/apache-httpd/apache-httpd-make/gump_work/build_apache-httpd_apache-httpd-make.html
Work Name: build_apache-httpd_apache-httpd-make (Type: Build)
Work ended in a state of : Failed
Elapsed: 5 mins 13 secs
Command Line: make 
[Working Directory: /srv/gump/public/workspace/apache-httpd]
---------------------------------------------
                    ^
ssl_engine_vars.c:1338:1: error: expected declaration or statement at end of input
 }
 ^
ssl_engine_vars.c:1338:1: error: expected declaration or statement at end of input
ssl_engine_vars.c:1338:1: error: expected declaration or statement at end of input
ssl_engine_vars.c:1338:1: error: expected declaration or statement at end of input
ssl_engine_vars.c: At top level:
ssl_engine_vars.c:45:14: warning: 'ssl_var_lookup_ssl_cert_san' used but never defined [enabled
by default]
 static char *ssl_var_lookup_ssl_cert_san(apr_pool_t *p, X509 *xs, char *var);
              ^
ssl_engine_vars.c:46:14: warning: 'ssl_var_lookup_ssl_cert_valid' used but never defined [enabled
by default]
 static char *ssl_var_lookup_ssl_cert_valid(apr_pool_t *p, ASN1_TIME *tm);
              ^
ssl_engine_vars.c:47:14: warning: 'ssl_var_lookup_ssl_cert_remain' used but never defined
[enabled by default]
 static char *ssl_var_lookup_ssl_cert_remain(apr_pool_t *p, ASN1_TIME *tm);
              ^
ssl_engine_vars.c:48:14: warning: 'ssl_var_lookup_ssl_cert_serial' used but never defined
[enabled by default]
 static char *ssl_var_lookup_ssl_cert_serial(apr_pool_t *p, X509 *xs);
              ^
ssl_engine_vars.c:49:14: warning: 'ssl_var_lookup_ssl_cert_chain' used but never defined [enabled
by default]
 static char *ssl_var_lookup_ssl_cert_chain(apr_pool_t *p, STACK_OF(X509) *sk, char *var);
              ^
ssl_engine_vars.c:50:14: warning: 'ssl_var_lookup_ssl_cert_rfc4523_cea' used but never defined
[enabled by default]
 static char *ssl_var_lookup_ssl_cert_rfc4523_cea(apr_pool_t *p, SSL *ssl);
              ^
ssl_engine_vars.c:51:14: warning: 'ssl_var_lookup_ssl_cert_PEM' used but never defined [enabled
by default]
 static char *ssl_var_lookup_ssl_cert_PEM(apr_pool_t *p, X509 *xs);
              ^
ssl_engine_vars.c:52:14: warning: 'ssl_var_lookup_ssl_cert_verify' used but never defined
[enabled by default]
 static char *ssl_var_lookup_ssl_cert_verify(apr_pool_t *p, SSLConnRec *sslconn);
              ^
ssl_engine_vars.c:53:14: warning: 'ssl_var_lookup_ssl_cipher' used but never defined [enabled
by default]
 static char *ssl_var_lookup_ssl_cipher(apr_pool_t *p, SSLConnRec *sslconn, char *var);
              ^
ssl_engine_vars.c:55:14: warning: 'ssl_var_lookup_ssl_version' used but never defined [enabled
by default]
 static char *ssl_var_lookup_ssl_version(apr_pool_t *p, char *var);
              ^
ssl_engine_vars.c:56:14: warning: 'ssl_var_lookup_ssl_compress_meth' used but never defined
[enabled by default]
 static char *ssl_var_lookup_ssl_compress_meth(SSL *ssl);
              ^
make[4]: *** [ssl_engine_vars.slo] Error 1
make[4]: Leaving directory `/srv/gump/public/workspace/apache-httpd/modules/ssl'
make[3]: *** [shared-build-recursive] Error 1
make[3]: Leaving directory `/srv/gump/public/workspace/apache-httpd/modules/ssl'
make[2]: *** [shared-build-recursive] Error 1
make[2]: Leaving directory `/srv/gump/public/workspace/apache-httpd/modules'
make[1]: *** [shared-build-recursive] Error 1
make[1]: Leaving directory `/srv/gump/public/workspace/apache-httpd'
make: *** [all-recursive] Error 1
---------------------------------------------

To subscribe to this information via syndicated feeds:
- RSS: http://vmgump.apache.org/gump/public/apache-httpd/apache-httpd-make/rss.xml
- Atom: http://vmgump.apache.org/gump/public/apache-httpd/apache-httpd-make/atom.xml

============================== Gump Tracking Only ===
Produced by Apache Gump(TM) version 2.3.
Gump Run 20160207000008, vmgump.apache.org:vmgump:20160207000008
Gump E-mail Identifier (unique within run) #2.

*********************************************************** G U M P
[GUMP@vmgump]: Project compress-antlib-test (in module antlibs-compress) failed
To whom it may engage...
        
This is an automated request, but not an unsolicited one. For 
more information please visit http://gump.apache.org/nagged.html, 
and/or contact the folk at general@gump.apache.org.

Project compress-antlib-test has an issue affecting its community integration.
This issue affects 1 projects,
 and has been outstanding for 5 runs.
The current state of this project is 'Failed', with reason 'Build Failed'.
For reference only, the following projects are affected by this:
    - compress-antlib-test :  The Apache Compress Antlib contains tasks and resources that...


Full details are available at:
    http://vmgump.apache.org/gump/public/antlibs-compress/compress-antlib-test/index.html

That said, some information snippets are provided here.

The following annotations (debug/informational/warning/error messages) were provided:
 -DEBUG- Dependency on ant exists, no need to add for property ant.home.
 -INFO- Failed with reason build failed



The following work was performed:
http://vmgump.apache.org/gump/public/antlibs-compress/compress-antlib-test/gump_work/build_antlibs-compress_compress-antlib-test.html
Work Name: build_antlibs-compress_compress-antlib-test (Type: Build)
Work ended in a state of : Failed
Elapsed: 5 mins 22 secs
Command Line: /usr/lib/jvm/java-8-oracle/bin/java -Djava.awt.headless=true -Dbuild.sysclasspath=only
-Xbootclasspath/p:/srv/gump/public/workspace/xml-xerces2/build/xercesImpl.jar:/srv/gump/public/workspace/xml-commons/java/external/build/xml-apis.jar
org.apache.tools.ant.Main -Dgump.merge=/srv/gump/public/gump/work/merge.xml -Dant.home=/srv/gump/public/workspace/ant/dist
test 
[Working Directory: /srv/gump/public/workspace/antlibs-compress]
CLASSPATH: /usr/lib/jvm/java-8-oracle/lib/tools.jar:/srv/gump/public/workspace/antlibs-compress/ivy/ivy.jar:/srv/gump/public/workspace/antlibs-compress/build/ant-compress-20160207.jar:/srv/gump/public/workspace/ant/dist/lib/ant.jar:/srv/gump/public/workspace/ant/dist/lib/ant-launcher.jar:/srv/gump/public/workspace/ant/dist/lib/ant-jmf.jar:/srv/gump/public/workspace/ant/dist/lib/ant-junit.jar:/srv/gump/public/workspace/ant/dist/lib/ant-junit4.jar:/srv/gump/public/workspace/ant/dist/lib/ant-swing.jar:/srv/gump/public/workspace/ant/dist/lib/ant-apache-resolver.jar:/srv/gump/public/workspace/ant/dist/lib/ant-apache-xalan2.jar:/srv/gump/public/workspace/commons-compress/target/commons-compress-1.11-SNAPSHOT.jar:/srv/gump/public/workspace/xz-java/build/jar-20160207/xz.jar:/srv/gump/public/workspace/antlibs-antunit/build/ant-antunit-20160207.jar:/srv/gump/public/workspace/xml-commons/java/external/build/xml-apis-ext.jar
---------------------------------------------
[au:antunit] Target: testWithDirectories took 0.025 sec
[au:antunit] Target: testFullpath took 0.026 sec
[au:antunit] Target: testPreserve0Permissions took 0.028 sec
[au:antunit] Target: testForceCreateOfUpToDate took 4.057 sec
[au:antunit] Target: testNoDirectoriesByDefault took 0.179 sec
[au:antunit] Target: testPlainFileSet took 0.058 sec
[au:antunit] Target: testReplaceOfUpToDate took 4.052 sec
[au:antunit] Target: testCoreZipFileSet  FAILED
[au:antunit] 	at line 35, column 24
[au:antunit] 	Message: Assertion failed
[au:antunit] 	took 0.017 sec
[au:antunit] Target: testAntlibTarFileSet took 0.018 sec
[au:antunit] Target: testCreateOfOutOfDate took 4.045 sec
[au:antunit] Target: testFileSetPermissionsWin took 0.042 sec
[au:antunit] Target: testAddDuplicates took 0.022 sec
[au:antunit] Target: testRemoveLeadingSlashes took 0.027 sec
[au:antunit] Target: testPrefixWithSlash took 0.04 sec
[au:antunit] Target: testWithImplicitDirectories took 0.031 sec
[au:antunit] Target: testForceReplaceOfUpToDate took 4.12 sec
[au:antunit] Target: test0PermissionsGetReplaced took 0.058 sec
[au:antunit] Target: testFailDuplicates took 0.014 sec
[au:antunit] Build File: /srv/gump/public/workspace/antlibs-compress/src/tests/antunit/zipentry-test.xml
[au:antunit] Tests run: 3, Failures: 1, Errors: 0, Time elapsed: 0.076 sec
[au:antunit] Target: testResourceProperties  FAILED
[au:antunit] 	at line 59, column 20
[au:antunit] 	Message: Assertion failed
[au:antunit] 	took 0.047 sec
[au:antunit] Target: testUncompressSource took 0.009 sec
[au:antunit] Target: testZipSource took 0.007 sec
[au:antunit] Build File: /srv/gump/public/workspace/antlibs-compress/src/tests/antunit/zipfileset-test.xml
[au:antunit] Tests run: 9, Failures: 0, Errors: 0, Time elapsed: 0.273 sec
[au:antunit] Target: testSkipUnreadableEntries took 0.009 sec
[au:antunit] Target: testMissingArchive took 0.006 sec
[au:antunit] Target: testUncompressSource took 0.009 sec
[au:antunit] Target: test-refid-check-encoding took 0.006 sec
[au:antunit] Target: testZipSource took 0.005 sec
[au:antunit] Target: test-refid-modify took 0.04 sec
[au:antunit] Target: test-refid-check-prefix took 0.003 sec
[au:antunit] Target: testMissingArchiveDoesntMatter took 0.003 sec
[au:antunit] Target: testFailsOnUnreadableEntries took 0.01 sec
[au:antunit] Build File: /srv/gump/public/workspace/antlibs-compress/src/tests/antunit/zresource-test.xml
[au:antunit] Tests run: 1, Failures: 0, Errors: 0, Time elapsed: 0.014 sec
[au:antunit] Target: testNativeZ took 0.013 sec

test:

BUILD FAILED
/srv/gump/public/workspace/antlibs-compress/common/build.xml:209: At least one AntUnit test
has failed.

Total time: 5 minutes 22 seconds
---------------------------------------------

To subscribe to this information via syndicated feeds:
- RSS: http://vmgump.apache.org/gump/public/antlibs-compress/compress-antlib-test/rss.xml
- Atom: http://vmgump.apache.org/gump/public/antlibs-compress/compress-antlib-test/atom.xml

============================== Gump Tracking Only ===
Produced by Apache Gump(TM) version 2.3.
Gump Run 20160207000008, vmgump.apache.org:vmgump:20160207000008
Gump E-mail Identifier (unique within run) #3.

*********************************************************** G U M P
[GUMP@vmgump]: Module commons-lang-trunk failed
To whom it may engage...
        
This is an automated request, but not an unsolicited one. For 
more information please visit http://gump.apache.org/nagged.html, 
and/or contact the folk at general@gump.apache.org.

Module commons-lang-trunk has an issue affecting its community integration,
 and has been outstanding for 12 runs.
The current state of this module is 'Failed', with reason 'Update Failed'.

Full details are available at:
    http://vmgump.apache.org/gump/public/commons-lang-trunk/index.html

That said, some information snippets are provided here.

The following annotations (debug/informational/warning/error messages) were provided:
 -INFO- Failed with reason update failed



The following work was performed:
http://vmgump.apache.org/gump/public/commons-lang-trunk/gump_work/update_commons-lang-trunk.html
Work Name: update_commons-lang-trunk (Type: Update)
Work ended in a state of : Failed
Elapsed: 2 secs
Command Line: git pull --quiet http://git-wip-us.apache.org/repos/asf//commons-lang.git master

[Working Directory: /srv/gump/public/workspace/cvs/commons-lang-trunk]
---------------------------------------------
error: Your local changes to the following files would be overwritten by merge:
	NOTICE.txt
Please, commit your changes or stash them before you can merge.
Aborting
---------------------------------------------

To subscribe to this information via syndicated feeds:
- RSS: http://vmgump.apache.org/gump/public/commons-lang-trunk/rss.xml
- Atom: http://vmgump.apache.org/gump/public/commons-lang-trunk/atom.xml

============================== Gump Tracking Only ===
Produced by Apache Gump(TM) version 2.3.
Gump Run 20160207000008, vmgump.apache.org:vmgump:20160207000008
Gump E-mail Identifier (unique within run) #4.

*********************************************************** G U M P
[GUMP@vmgump]: Project commons-lang3 (in module commons-lang-trunk) failed
To whom it may engage...
        
This is an automated request, but not an unsolicited one. For 
more information please visit http://gump.apache.org/nagged.html, 
and/or contact the folk at general@gump.apache.org.

Project commons-lang3 has an issue affecting its community integration,
 and has been outstanding for 12 runs.
The current state of this project is 'Failed', with reason 'Update Failed'.

Full details are available at:
    http://vmgump.apache.org/gump/public/commons-lang-trunk/commons-lang3/index.html

That said, some information snippets are provided here.

The following annotations (debug/informational/warning/error messages) were provided:
 -DEBUG- Sole jar output [commons-lang3-*[0-9T].jar] identifier set to project name
 -DEBUG- Sole pom output [pom.xml] identifier set to project name
 -INFO- Failed with reason update failed
 -INFO- Failed to extract fallback artifacts from Gump Repository

To subscribe to this information via syndicated feeds:
- RSS: http://vmgump.apache.org/gump/public/commons-lang-trunk/commons-lang3/rss.xml
- Atom: http://vmgump.apache.org/gump/public/commons-lang-trunk/commons-lang3/atom.xml

============================== Gump Tracking Only ===
Produced by Apache Gump(TM) version 2.3.
Gump Run 20160207000008, vmgump.apache.org:vmgump:20160207000008
Gump E-mail Identifier (unique within run) #5.


--
Apache Gump
http://gump.apache.org/ [Instance: vmgump]

---------------------------------------------------------------------
To unsubscribe, e-mail: general-unsubscribe@gump.apache.org
For additional commands, e-mail: general-help@gump.apache.org


Mime
View raw message