gump-general mailing list archives

Site index · List index
Message view « Date » · « Thread »
Top « Date » · « Thread »
From g...@vmgump.apache.org
Subject BATCH: All dressed up, with nowhere to go...
Date Sun, 07 Feb 2016 15:16:53 GMT
Dear Gumpmeisters,
            
The following 2 notifys should have been sent

*********************************************************** G U M P
[GUMP@vmgump]: Project openssl-make-test (in module openssl-master) failed
[GUMP@vmgump]: Project apache-httpd-make (in module apache-httpd) failed
*********************************************************** G U M P
[GUMP@vmgump]: Project openssl-make-test (in module openssl-master) failed
To whom it may engage...
        
This is an automated request, but not an unsolicited one. For 
more information please visit http://gump.apache.org/nagged.html, 
and/or contact the folk at general@gump.apache.org.

Project openssl-make-test has an issue affecting its community integration.
This issue affects 5 projects.
The current state of this project is 'Failed', with reason 'Build Timed Out'.
For reference only, the following projects are affected by this:
    - openssl-make-install :  OpenSSL Encryption Library
    - openssl-make-test :  OpenSSL Encryption Library
    - tomcat-native-configure :  Tomcat native library using Apache Portable Runtime
    - tomcat-native-make :  Tomcat native library using Apache Portable Runtime
    - tomcat-native-make-install :  Tomcat native library using Apache Portable Runtime


Full details are available at:
    http://vmgump.apache.org/gump/public/openssl-master/openssl-make-test/index.html

That said, some information snippets are provided here.

The following annotations (debug/informational/warning/error messages) were provided:
 -INFO- Failed with reason build timed out



The following work was performed:
http://vmgump.apache.org/gump/public/openssl-master/openssl-make-test/gump_work/build_openssl-master_openssl-make-test.html
Work Name: build_openssl-master_openssl-make-test (Type: Build)
Work ended in a state of : Failed
Elapsed: 1 hour 3 secs
Command Line: make test 
[Working Directory: /srv/gump/public/workspace/openssl-master]
---------------------------------------------
    #   Failed test 'Handshake'
    #   at ../test/recipes/70-test_sslsessiontick.t line 245.
    
    #   Failed test 'ClientHello extension Session Ticket check'
    #   at ../test/recipes/70-test_sslsessiontick.t line 246.
    
    #   Failed test 'ServerHello extension Session Ticket check'
    #   at ../test/recipes/70-test_sslsessiontick.t line 248.
    
    #   Failed test 'Session Ticket message presence check'
    #   at ../test/recipes/70-test_sslsessiontick.t line 250.
    
    #   Failed test 'Session Ticket full handshake check'
    #   at ../test/recipes/70-test_sslsessiontick.t line 252.
    # Looks like you failed 5 tests of 5.

#   Failed test 'Empty ticket test'
#   at ../test/recipes/70-test_sslsessiontick.t line 255.
    
    #   Failed test 'Handshake'
    #   at ../test/recipes/70-test_sslsessiontick.t line 245.
    
    #   Failed test 'ClientHello extension Session Ticket check'
    #   at ../test/recipes/70-test_sslsessiontick.t line 246.
    
    #   Failed test 'ServerHello extension Session Ticket check'
    #   at ../test/recipes/70-test_sslsessiontick.t line 248.
    
    #   Failed test 'Session Ticket message presence check'
    #   at ../test/recipes/70-test_sslsessiontick.t line 250.
    # Looks like you failed 4 tests of 5.

#   Failed test 'Empty ticket resumption test'
#   at ../test/recipes/70-test_sslsessiontick.t line 255.
    
    #   Failed test 'Handshake'
    #   at ../test/recipes/70-test_sslsessiontick.t line 245.
    
    #   Failed test 'ClientHello extension Session Ticket check'
    #   at ../test/recipes/70-test_sslsessiontick.t line 246.
    # Looks like you failed 2 tests of 5.

#   Failed test 'Empty ticket resumption test'
#   at ../test/recipes/70-test_sslsessiontick.t line 255.
# Looks like you failed 3 tests of 8.
../test/recipes/70-test_sslsessiontick.t .. 
Dubious, test returned 3 (wstat 768, 0x300)
Failed 3/8 subtests 
../test/recipes/70-test_sslskewith0p.t .... ok
../test/recipes/70-test_sslvertol.t ....... ok
---------------------------------------------

To subscribe to this information via syndicated feeds:
- RSS: http://vmgump.apache.org/gump/public/openssl-master/openssl-make-test/rss.xml
- Atom: http://vmgump.apache.org/gump/public/openssl-master/openssl-make-test/atom.xml

============================== Gump Tracking Only ===
Produced by Apache Gump(TM) version 2.3.
Gump Run 20160207120008, vmgump.apache.org:vmgump:20160207120008
Gump E-mail Identifier (unique within run) #1.

*********************************************************** G U M P
[GUMP@vmgump]: Project apache-httpd-make (in module apache-httpd) failed
To whom it may engage...
        
This is an automated request, but not an unsolicited one. For 
more information please visit http://gump.apache.org/nagged.html, 
and/or contact the folk at general@gump.apache.org.

Project apache-httpd-make has an issue affecting its community integration.
This issue affects 5 projects.
The current state of this project is 'Failed', with reason 'Build Failed'.
For reference only, the following projects are affected by this:
    - apache-httpd-make :  Apache HTTP Server
    - apache-httpd-make-install :  Apache HTTP Server
    - tomcat-jk-native :  Connectors to various web servers
    - tomcat-jk-native-buildconf :  Connectors to various web servers
    - tomcat-jk-native-configure :  Connectors to various web servers


Full details are available at:
    http://vmgump.apache.org/gump/public/apache-httpd/apache-httpd-make/index.html

That said, some information snippets are provided here.

The following annotations (debug/informational/warning/error messages) were provided:
 -INFO- Failed with reason build failed



The following work was performed:
http://vmgump.apache.org/gump/public/apache-httpd/apache-httpd-make/gump_work/build_apache-httpd_apache-httpd-make.html
Work Name: build_apache-httpd_apache-httpd-make (Type: Build)
Work ended in a state of : Failed
Elapsed: 4 mins 59 secs
Command Line: make 
[Working Directory: /srv/gump/public/workspace/apache-httpd]
---------------------------------------------
                    ^
ssl_engine_vars.c:1338:1: error: expected declaration or statement at end of input
 }
 ^
ssl_engine_vars.c:1338:1: error: expected declaration or statement at end of input
ssl_engine_vars.c:1338:1: error: expected declaration or statement at end of input
ssl_engine_vars.c:1338:1: error: expected declaration or statement at end of input
ssl_engine_vars.c: At top level:
ssl_engine_vars.c:45:14: warning: 'ssl_var_lookup_ssl_cert_san' used but never defined [enabled
by default]
 static char *ssl_var_lookup_ssl_cert_san(apr_pool_t *p, X509 *xs, char *var);
              ^
ssl_engine_vars.c:46:14: warning: 'ssl_var_lookup_ssl_cert_valid' used but never defined [enabled
by default]
 static char *ssl_var_lookup_ssl_cert_valid(apr_pool_t *p, ASN1_TIME *tm);
              ^
ssl_engine_vars.c:47:14: warning: 'ssl_var_lookup_ssl_cert_remain' used but never defined
[enabled by default]
 static char *ssl_var_lookup_ssl_cert_remain(apr_pool_t *p, ASN1_TIME *tm);
              ^
ssl_engine_vars.c:48:14: warning: 'ssl_var_lookup_ssl_cert_serial' used but never defined
[enabled by default]
 static char *ssl_var_lookup_ssl_cert_serial(apr_pool_t *p, X509 *xs);
              ^
ssl_engine_vars.c:49:14: warning: 'ssl_var_lookup_ssl_cert_chain' used but never defined [enabled
by default]
 static char *ssl_var_lookup_ssl_cert_chain(apr_pool_t *p, STACK_OF(X509) *sk, char *var);
              ^
ssl_engine_vars.c:50:14: warning: 'ssl_var_lookup_ssl_cert_rfc4523_cea' used but never defined
[enabled by default]
 static char *ssl_var_lookup_ssl_cert_rfc4523_cea(apr_pool_t *p, SSL *ssl);
              ^
ssl_engine_vars.c:51:14: warning: 'ssl_var_lookup_ssl_cert_PEM' used but never defined [enabled
by default]
 static char *ssl_var_lookup_ssl_cert_PEM(apr_pool_t *p, X509 *xs);
              ^
ssl_engine_vars.c:52:14: warning: 'ssl_var_lookup_ssl_cert_verify' used but never defined
[enabled by default]
 static char *ssl_var_lookup_ssl_cert_verify(apr_pool_t *p, SSLConnRec *sslconn);
              ^
ssl_engine_vars.c:53:14: warning: 'ssl_var_lookup_ssl_cipher' used but never defined [enabled
by default]
 static char *ssl_var_lookup_ssl_cipher(apr_pool_t *p, SSLConnRec *sslconn, char *var);
              ^
ssl_engine_vars.c:55:14: warning: 'ssl_var_lookup_ssl_version' used but never defined [enabled
by default]
 static char *ssl_var_lookup_ssl_version(apr_pool_t *p, char *var);
              ^
ssl_engine_vars.c:56:14: warning: 'ssl_var_lookup_ssl_compress_meth' used but never defined
[enabled by default]
 static char *ssl_var_lookup_ssl_compress_meth(SSL *ssl);
              ^
make[4]: *** [ssl_engine_vars.slo] Error 1
make[4]: Leaving directory `/srv/gump/public/workspace/apache-httpd/modules/ssl'
make[3]: *** [shared-build-recursive] Error 1
make[3]: Leaving directory `/srv/gump/public/workspace/apache-httpd/modules/ssl'
make[2]: *** [shared-build-recursive] Error 1
make[2]: Leaving directory `/srv/gump/public/workspace/apache-httpd/modules'
make[1]: *** [shared-build-recursive] Error 1
make[1]: Leaving directory `/srv/gump/public/workspace/apache-httpd'
make: *** [all-recursive] Error 1
---------------------------------------------

To subscribe to this information via syndicated feeds:
- RSS: http://vmgump.apache.org/gump/public/apache-httpd/apache-httpd-make/rss.xml
- Atom: http://vmgump.apache.org/gump/public/apache-httpd/apache-httpd-make/atom.xml

============================== Gump Tracking Only ===
Produced by Apache Gump(TM) version 2.3.
Gump Run 20160207120008, vmgump.apache.org:vmgump:20160207120008
Gump E-mail Identifier (unique within run) #2.


--
Apache Gump
http://gump.apache.org/ [Instance: vmgump]

---------------------------------------------------------------------
To unsubscribe, e-mail: general-unsubscribe@gump.apache.org
For additional commands, e-mail: general-help@gump.apache.org


Mime
View raw message