gump-general mailing list archives

Site index · List index
Message view « Date » · « Thread »
Top « Date » · « Thread »
From g...@vmgump.apache.org
Subject BATCH: All dressed up, with nowhere to go...
Date Thu, 12 May 2016 08:57:20 GMT
Dear Gumpmeisters,
            
The following 3 notifys should have been sent

*********************************************************** G U M P
[GUMP@vmgump]: Project openssl-make-test (in module openssl-master) failed
[GUMP@vmgump]: Project compress-antlib-test (in module antlibs-compress) failed
[GUMP@vmgump]: Project test-ant (in module ant) failed
*********************************************************** G U M P
[GUMP@vmgump]: Project openssl-make-test (in module openssl-master) failed
To whom it may engage...
        
This is an automated request, but not an unsolicited one. For 
more information please visit http://gump.apache.org/nagged.html, 
and/or contact the folk at general@gump.apache.org.

Project openssl-make-test has an issue affecting its community integration.
This issue affects 14 projects,
 and has been outstanding for 18 runs.
The current state of this project is 'Failed', with reason 'Build Timed Out'.
For reference only, the following projects are affected by this:
    - apache-httpd-configure :  Apache HTTP Server
    - apache-httpd-make :  Apache HTTP Server
    - apache-httpd-make-install :  Apache HTTP Server
    - openssl-make-install :  OpenSSL Encryption Library
    - openssl-make-test :  OpenSSL Encryption Library
    - tomcat-jk-native :  Connectors to various web servers
    - tomcat-jk-native-buildconf :  Connectors to various web servers
    - tomcat-jk-native-configure :  Connectors to various web servers
    - tomcat-native-trunk-configure :  Tomcat native library using Apache Portable Runtime
    - tomcat-native-trunk-make :  Tomcat native library using Apache Portable Runtime
    - tomcat-native-trunk-make-install :  Tomcat native library using Apache Portable Runtime
    - tomcat-trunk-test-apr :  Tomcat 9.x, a web server implementing the Java Servlet 4.0,
...
    - tomcat-trunk-test-nio :  Tomcat 9.x, a web server implementing the Java Servlet 4.0,
...
    - tomcat-trunk-test-nio2 :  Tomcat 9.x, a web server implementing the Java Servlet 4.0,
...


Full details are available at:
    http://vmgump.apache.org/gump/public/openssl-master/openssl-make-test/index.html

That said, some information snippets are provided here.

The following annotations (debug/informational/warning/error messages) were provided:
 -INFO- Failed with reason build timed out



The following work was performed:
http://vmgump.apache.org/gump/public/openssl-master/openssl-make-test/gump_work/build_openssl-master_openssl-make-test.html
Work Name: build_openssl-master_openssl-make-test (Type: Build)
Work ended in a state of : Failed
Elapsed: 1 hour 1 sec
Command Line: make test 
[Working Directory: /srv/gump/public/workspace/openssl-master]
---------------------------------------------
	  BLDTOP=../. \
	  EXE_EXT= \
	  OPENSSL_ENGINES=.././engines \
	    /usr/bin/perl .././test/run_tests.pl  )
../test/recipes/01-test_abort.t ............ ok
../test/recipes/01-test_ordinals.t ......... ok
../test/recipes/01-test_symbol_presence.t .. ok
../test/recipes/05-test_bf.t ............... ok
../test/recipes/05-test_cast.t ............. ok
../test/recipes/05-test_des.t .............. ok
../test/recipes/05-test_hmac.t ............. ok
../test/recipes/05-test_idea.t ............. ok
../test/recipes/05-test_md2.t .............. skipped: md2 is not supported by this OpenSSL
build
../test/recipes/05-test_md4.t .............. ok
../test/recipes/05-test_md5.t .............. ok
../test/recipes/05-test_mdc2.t ............. ok
../test/recipes/05-test_rand.t ............. ok
../test/recipes/05-test_rc2.t .............. ok
../test/recipes/05-test_rc4.t .............. ok
../test/recipes/05-test_rc5.t .............. skipped: rc5 is not supported by this OpenSSL
build
../test/recipes/05-test_rmd.t .............. ok
../test/recipes/05-test_sha1.t ............. ok
../test/recipes/05-test_sha256.t ........... ok
../test/recipes/05-test_sha512.t ........... ok
../test/recipes/05-test_wp.t ............... ok
../test/recipes/10-test_bn.t ............... ok
../test/recipes/10-test_exp.t .............. ok
../test/recipes/15-test_dh.t ............... ok
../test/recipes/15-test_dsa.t .............. ok
../test/recipes/15-test_ec.t ............... ok
../test/recipes/15-test_ecdh.t ............. ok
../test/recipes/15-test_ecdsa.t ............ ok
../test/recipes/15-test_rsa.t .............. ok
../test/recipes/20-test_enc.t .............. ok
../test/recipes/25-test_crl.t .............. ok
../test/recipes/25-test_d2i.t .............. ok
../test/recipes/25-test_gen.t .............. ok
../test/recipes/25-test_pkcs7.t ............ ok
../test/recipes/25-test_req.t .............. ok
../test/recipes/25-test_sid.t .............. ok
../test/recipes/25-test_verify.t ........... ok
../test/recipes/25-test_x509.t ............. ok
../test/recipes/30-test_afalg.t ............ skipped: test_afalg not supported for this build
../test/recipes/30-test_engine.t ........... ok
../test/recipes/30-test_evp.t .............. ok
../test/recipes/30-test_evp_extra.t ........ ok
../test/recipes/30-test_pbelu.t ............ ok
../test/recipes/40-test_rehash.t ........... ok
../test/recipes/70-test_clienthello.t ...... ok
../test/recipes/70-test_packet.t ........... ok
---------------------------------------------

To subscribe to this information via syndicated feeds:
- RSS: http://vmgump.apache.org/gump/public/openssl-master/openssl-make-test/rss.xml
- Atom: http://vmgump.apache.org/gump/public/openssl-master/openssl-make-test/atom.xml

============================== Gump Tracking Only ===
Produced by Apache Gump(TM) version 2.3.
Gump Run 20160512000007, vmgump.apache.org:vmgump:20160512000007
Gump E-mail Identifier (unique within run) #1.

*********************************************************** G U M P
[GUMP@vmgump]: Project compress-antlib-test (in module antlibs-compress) failed
To whom it may engage...
        
This is an automated request, but not an unsolicited one. For 
more information please visit http://gump.apache.org/nagged.html, 
and/or contact the folk at general@gump.apache.org.

Project compress-antlib-test has an issue affecting its community integration.
This issue affects 1 projects,
 and has been outstanding for 40 runs.
The current state of this project is 'Failed', with reason 'Build Failed'.
For reference only, the following projects are affected by this:
    - compress-antlib-test :  The Apache Compress Antlib contains tasks and resources that...


Full details are available at:
    http://vmgump.apache.org/gump/public/antlibs-compress/compress-antlib-test/index.html

That said, some information snippets are provided here.

The following annotations (debug/informational/warning/error messages) were provided:
 -DEBUG- Dependency on ant exists, no need to add for property ant.home.
 -INFO- Failed with reason build failed



The following work was performed:
http://vmgump.apache.org/gump/public/antlibs-compress/compress-antlib-test/gump_work/build_antlibs-compress_compress-antlib-test.html
Work Name: build_antlibs-compress_compress-antlib-test (Type: Build)
Work ended in a state of : Failed
Elapsed: 5 mins 15 secs
Command Line: /usr/lib/jvm/java-8-oracle/bin/java -Djava.awt.headless=true -Dbuild.sysclasspath=only
-Xbootclasspath/p:/srv/gump/public/workspace/xml-xerces2/build/xercesImpl.jar:/srv/gump/public/workspace/xml-commons/java/external/build/xml-apis.jar
org.apache.tools.ant.Main -Dgump.merge=/srv/gump/public/gump/work/merge.xml -Dant.home=/srv/gump/public/workspace/ant/dist
test 
[Working Directory: /srv/gump/public/workspace/antlibs-compress]
CLASSPATH: /usr/lib/jvm/java-8-oracle/lib/tools.jar:/srv/gump/public/workspace/antlibs-compress/ivy/ivy.jar:/srv/gump/public/workspace/antlibs-compress/build/ant-compress-20160512.jar:/srv/gump/public/workspace/ant/dist/lib/ant.jar:/srv/gump/public/workspace/ant/dist/lib/ant-launcher.jar:/srv/gump/public/workspace/ant/dist/lib/ant-jmf.jar:/srv/gump/public/workspace/ant/dist/lib/ant-junit.jar:/srv/gump/public/workspace/ant/dist/lib/ant-junit4.jar:/srv/gump/public/workspace/ant/dist/lib/ant-swing.jar:/srv/gump/public/workspace/ant/dist/lib/ant-apache-resolver.jar:/srv/gump/public/workspace/ant/dist/lib/ant-apache-xalan2.jar:/srv/gump/public/workspace/commons-compress/target/commons-compress-1.12-SNAPSHOT.jar:/srv/gump/public/workspace/xz-java/build/jar-20160512/xz.jar:/srv/gump/public/workspace/antlibs-antunit/build/ant-antunit-20160512.jar:/srv/gump/public/workspace/xml-commons/java/external/build/xml-apis-ext.jar
---------------------------------------------
[au:antunit] Target: testWithDirectories took 0.029 sec
[au:antunit] Target: testFullpath took 0.025 sec
[au:antunit] Target: testPreserve0Permissions took 0.034 sec
[au:antunit] Target: testForceCreateOfUpToDate took 4.035 sec
[au:antunit] Target: testNoDirectoriesByDefault took 0.163 sec
[au:antunit] Target: testPlainFileSet took 0.018 sec
[au:antunit] Target: testReplaceOfUpToDate took 4.017 sec
[au:antunit] Target: testCoreZipFileSet  FAILED
[au:antunit] 	at line 35, column 24
[au:antunit] 	Message: Assertion failed
[au:antunit] 	took 0.018 sec
[au:antunit] Target: testAntlibTarFileSet took 0.014 sec
[au:antunit] Target: testCreateOfOutOfDate took 4.054 sec
[au:antunit] Target: testFileSetPermissionsWin took 0.054 sec
[au:antunit] Target: testAddDuplicates took 0.032 sec
[au:antunit] Target: testRemoveLeadingSlashes took 0.059 sec
[au:antunit] Target: testPrefixWithSlash took 0.043 sec
[au:antunit] Target: testWithImplicitDirectories took 0.034 sec
[au:antunit] Target: testForceReplaceOfUpToDate took 4.031 sec
[au:antunit] Target: test0PermissionsGetReplaced took 0.022 sec
[au:antunit] Target: testFailDuplicates took 0.098 sec
[au:antunit] Build File: /srv/gump/public/workspace/antlibs-compress/src/tests/antunit/zipentry-test.xml
[au:antunit] Tests run: 3, Failures: 1, Errors: 0, Time elapsed: 0.032 sec
[au:antunit] Target: testResourceProperties  FAILED
[au:antunit] 	at line 59, column 20
[au:antunit] 	Message: Assertion failed
[au:antunit] 	took 0.011 sec
[au:antunit] Target: testUncompressSource took 0.006 sec
[au:antunit] Target: testZipSource took 0.005 sec
[au:antunit] Build File: /srv/gump/public/workspace/antlibs-compress/src/tests/antunit/zipfileset-test.xml
[au:antunit] Tests run: 9, Failures: 0, Errors: 0, Time elapsed: 0.092 sec
[au:antunit] Target: testSkipUnreadableEntries took 0.006 sec
[au:antunit] Target: testMissingArchive took 0.003 sec
[au:antunit] Target: testUncompressSource took 0.005 sec
[au:antunit] Target: test-refid-check-encoding took 0.003 sec
[au:antunit] Target: testZipSource took 0.003 sec
[au:antunit] Target: test-refid-modify took 0.037 sec
[au:antunit] Target: test-refid-check-prefix took 0.002 sec
[au:antunit] Target: testMissingArchiveDoesntMatter took 0.006 sec
[au:antunit] Target: testFailsOnUnreadableEntries took 0.008 sec
[au:antunit] Build File: /srv/gump/public/workspace/antlibs-compress/src/tests/antunit/zresource-test.xml
[au:antunit] Tests run: 1, Failures: 0, Errors: 0, Time elapsed: 0.019 sec
[au:antunit] Target: testNativeZ took 0.017 sec

test:

BUILD FAILED
/srv/gump/public/workspace/antlibs-compress/common/build.xml:209: At least one AntUnit test
has failed.

Total time: 5 minutes 15 seconds
---------------------------------------------

To subscribe to this information via syndicated feeds:
- RSS: http://vmgump.apache.org/gump/public/antlibs-compress/compress-antlib-test/rss.xml
- Atom: http://vmgump.apache.org/gump/public/antlibs-compress/compress-antlib-test/atom.xml

============================== Gump Tracking Only ===
Produced by Apache Gump(TM) version 2.3.
Gump Run 20160512000007, vmgump.apache.org:vmgump:20160512000007
Gump E-mail Identifier (unique within run) #2.

*********************************************************** G U M P
[GUMP@vmgump]: Project test-ant (in module ant) failed
To whom it may engage...
        
This is an automated request, but not an unsolicited one. For 
more information please visit http://gump.apache.org/nagged.html, 
and/or contact the folk at general@gump.apache.org.

Project test-ant has an issue affecting its community integration.
This issue affects 1 projects,
 and has been outstanding for 25 runs.
The current state of this project is 'Failed', with reason 'Build Failed'.
For reference only, the following projects are affected by this:
    - test-ant :  Java based build tool


Full details are available at:
    http://vmgump.apache.org/gump/public/ant/test-ant/index.html

That said, some information snippets are provided here.

The following annotations (debug/informational/warning/error messages) were provided:
 -WARNING- Bad *Optional* Dependency. Project: bsh : unknown to *this* workspace
 -INFO- Failed with reason build failed



The following work was performed:
http://vmgump.apache.org/gump/public/ant/test-ant/gump_work/build_ant_test-ant.html
Work Name: build_ant_test-ant (Type: Build)
Work ended in a state of : Failed
Elapsed: 15 mins 26 secs
Command Line: /usr/lib/jvm/java-8-oracle/bin/java -Djava.awt.headless=true -Dbuild.sysclasspath=only
-Xbootclasspath/p:/srv/gump/public/workspace/xml-xerces2/build/xercesImpl.jar:/srv/gump/public/workspace/xml-commons/java/external/build/xml-apis.jar:/srv/gump/public/workspace/xml-xalan/build/xalan-unbundled.jar:/srv/gump/public/workspace/xml-xalan/build/serializer.jar
org.apache.tools.ant.Main -Dgump.merge=/srv/gump/public/gump/work/merge.xml -Dtest.haltonfailure=false
-Dant.home=/srv/gump/public/workspace/ant/dist run-tests 
[Working Directory: /srv/gump/public/workspace/ant]
CLASSPATH: /usr/lib/jvm/java-8-oracle/lib/tools.jar:/srv/gump/public/workspace/ant/build/testcases:/srv/gump/public/workspace/ant/src/tests/junit:/srv/gump/public/workspace/ant/src/etc/testcases:/srv/gump/public/workspace/ant/src/etc/testcases/taskdefs/optional/out:/srv/gump/public/workspace/ant/src/tests/antunit/filters:/srv/gump/public/workspace/ant/src/tests/antunit/taskdefs/importtests:/srv/gump/public/workspace/ant/src/tests/antunit/filters/foo:/srv/gump/public/workspace/ant/src/tests/antunit/taskdefs/foo:/srv/gump/public/workspace/ant/build/antunit/tmp/testinput/build:/srv/gump/public/workspace/ant/build/antunit/tmp/testoutput:/srv/gump/public/workspace/ant/build/antunit/tmp/test.jar:/srv/gump/public/workspace/ant/build/antunit/tmp/test1.jar:/srv/gump/public/workspace/ant/build/antunit/tmp/test2.jar:/srv/gump/public/workspace/ant/build/antunit/tmp/test3.jar:/srv/gump/public/workspace/ant/build/antunit/tmp/test4.jar:/srv/gump/public/workspace/ant/build/antunit/tmp/test5.jar:/srv
 /gump/public/workspace/ant/build/antunit/tmp/resources:/srv/gump/public/workspace/ant/build/lib/ant.jar:/srv/gump/public/workspace/ant/build/lib/ant-launcher.jar:/srv/gump/public/workspace/ant/build/lib/ant-antlr.jar:/srv/gump/public/workspace/ant/build/lib/ant-apache-bcel.jar:/srv/gump/public/workspace/ant/build/lib/ant-apache-bsf.jar:/srv/gump/public/workspace/ant/build/lib/ant-apache-log4j.jar:/srv/gump/public/workspace/ant/build/lib/ant-apache-oro.jar:/srv/gump/public/workspace/ant/build/lib/ant-apache-regexp.jar:/srv/gump/public/workspace/ant/build/lib/ant-apache-resolver.jar:/srv/gump/public/workspace/ant/build/lib/ant-apache-xalan2.jar:/srv/gump/public/workspace/ant/build/lib/ant-commons-logging.jar:/srv/gump/public/workspace/ant/build/lib/ant-commons-net.jar:/srv/gump/public/workspace/ant/build/lib/ant-jai.jar:/srv/gump/public/workspace/ant/build/lib/ant-javamail.jar:/srv/gump/public/workspace/ant/build/lib/ant-jdepend.jar:/srv/gump/public/workspace/ant/build/lib/ant-jmf.jar
 :/srv/gump/public/workspace/ant/build/lib/ant-jsch.jar:/srv/gump/public/workspace/ant/build/lib/ant-junit.jar:/srv/gump/public/workspace/ant/build/lib/ant-junit4.jar:/srv/gump/public/workspace/ant/build/lib/ant-swing.jar:/srv/gump/packages/antlr/antlr-3.1.3.jar:/srv/gump/public/workspace/ant-contrib/lib/bcel/jars/bcel-5.1.jar:/srv/gump/public/workspace/apache-commons/logging/target/commons-logging-20160512.jar:/srv/gump/public/workspace/apache-commons/logging/target/commons-logging-api-20160512.jar:/srv/gump/public/workspace/apache-commons/net/target/commons-net-3.6-SNAPSHOT.jar:/srv/gump/public/workspace/apache-commons/net/target/commons-net-ftp-3.6-SNAPSHOT.jar:/srv/gump/packages/jaf-1.1ea/activation.jar:/srv/gump/public/workspace/jakarta-bsf/build/lib/bsf.jar:/srv/gump/packages/apache-attic/jakarta-regexp-1.5.jar:/srv/gump/public/workspace/jakarta-servletapi-5/jsr154/dist/lib/servlet-api.jar:/srv/gump/packages/javamail-1.4/mail.jar:/srv/gump/packages/javamail-1.4/lib/mailapi.jar:
 /srv/gump/packages/jdepend-2.6/lib/jdepend.jar:/srv/gump/packages/jsch/jsch-0.1.45.jar:/srv/gump/public/workspace/logging-log4j-12/target/log4j-1.2.18-SNAPSHOT.jar:/srv/gump/packages/apache-attic/oro-2.0.8.jar:/srv/gump/public/workspace/antlibs-antunit/build/ant-antunit-20160512.jar:/srv/gump/packages/hamcrest/hamcrest-core-1.3.jar:/srv/gump/public/workspace/junit/target/junit-4.13-SNAPSHOT.jar:/srv/gump/public/workspace/xml-commons/java/external/build/xml-apis-ext.jar:/srv/gump/public/workspace/commons-codec-1.x/dist/commons-codec-20160512.jar
---------------------------------------------
[au:antunit] Build File: /srv/gump/public/workspace/ant/src/tests/antunit/types/selectors/modified-test.xml
[au:antunit] Tests run: 1, Failures: 0, Errors: 0, Time elapsed: 0.043 sec
[au:antunit] Target: testUpdate took 0.031 sec
[au:antunit] Build File: /srv/gump/public/workspace/ant/src/tests/antunit/types/selectors/ownedby-test.xml
[au:antunit] Tests run: 3, Failures: 0, Errors: 0, Time elapsed: 0.173 sec
[au:antunit] Target: testOwnedBy took 0.01 sec
[au:antunit] Target: testAsTrueConditions took 0.14 sec
[au:antunit] Target: testRequiresOwner took 0.002 sec
[au:antunit] Build File: /srv/gump/public/workspace/ant/src/tests/antunit/types/selectors/present-test.xml
[au:antunit] Tests run: 1, Failures: 0, Errors: 0, Time elapsed: 0.014 sec
[au:antunit] Target: testMapperByTypedef took 0.011 sec
[au:antunit] Build File: /srv/gump/public/workspace/ant/src/tests/antunit/types/selectors/readwrite-test.xml
[au:antunit] Tests run: 4, Failures: 0, Errors: 0, Time elapsed: 0.554 sec
[au:antunit] Target: testWritable took 0.006 sec
[au:antunit] Target: testAsConditions took 0.003 sec
[au:antunit] Target: testReadable took 0.002 sec
[au:antunit] Target: testUnwritable took 0.002 sec
[au:antunit] Build File: /srv/gump/public/workspace/ant/src/tests/antunit/types/selectors/select-test.xml
[au:antunit] Tests run: 4, Failures: 0, Errors: 0, Time elapsed: 0.09 sec
[au:antunit] Target: testIfFalse took 0.013 sec
[au:antunit] Target: testIfNotSet took 0.011 sec
[au:antunit] Target: testIfTrue took 0.009 sec
[au:antunit] Target: testIfSet took 0.008 sec
[au:antunit] Build File: /srv/gump/public/workspace/ant/src/tests/antunit/types/selectors/symlink-test.xml
[au:antunit] Tests run: 4, Failures: 0, Errors: 0, Time elapsed: 0.081 sec
[au:antunit] Target: testAsFalseConditions took 0.004 sec
[au:antunit] Target: testAsTrueConditions took 0.019 sec
[au:antunit] Target: testNoSymlink took 0.017 sec
[au:antunit] Target: testSymlink took 0.006 sec
[au:antunit] Build File: /srv/gump/public/workspace/ant/src/tests/antunit/types/tarfileset-test.xml
[au:antunit] Tests run: 3, Failures: 0, Errors: 0, Time elapsed: 0.064 sec
[au:antunit] Target: test-refid-check-encoding took 0.001 sec
[au:antunit] Target: testMissingArchive took 0.001 sec
[au:antunit] Target: testMissingArchiveDoesntMatter took 0.001 sec
[au:antunit] Build File: /srv/gump/public/workspace/ant/src/tests/antunit/types/zipfileset-test.xml
[au:antunit] Tests run: 5, Failures: 0, Errors: 0, Time elapsed: 0.154 sec
[au:antunit] Target: testMissingArchive took 0.078 sec
[au:antunit] Target: test-refid-check-encoding took 0.001 sec
[au:antunit] Target: test-refid-modify took 0.033 sec
[au:antunit] Target: test-refid-check-prefix took 0.002 sec
[au:antunit] Target: testMissingArchiveDoesntMatter took 0.001 sec

check-failed:

run-tests:

BUILD FAILED
/srv/gump/public/workspace/ant/build.xml:1601: Unit tests failed

Total time: 15 minutes 25 seconds
---------------------------------------------

To subscribe to this information via syndicated feeds:
- RSS: http://vmgump.apache.org/gump/public/ant/test-ant/rss.xml
- Atom: http://vmgump.apache.org/gump/public/ant/test-ant/atom.xml

============================== Gump Tracking Only ===
Produced by Apache Gump(TM) version 2.3.
Gump Run 20160512000007, vmgump.apache.org:vmgump:20160512000007
Gump E-mail Identifier (unique within run) #3.


--
Apache Gump
http://gump.apache.org/ [Instance: vmgump]

---------------------------------------------------------------------
To unsubscribe, e-mail: general-unsubscribe@gump.apache.org
For additional commands, e-mail: general-help@gump.apache.org


Mime
View raw message