gump-general mailing list archives

Site index · List index
Message view « Date » · « Thread »
Top « Date » · « Thread »
From g...@vmgump-vm3.apache.org
Subject BATCH: All dressed up, with nowhere to go...
Date Thu, 06 Apr 2017 01:11:37 GMT
Dear Gumpmeisters,
            
The following 4 notifys should have been sent

*********************************************************** G U M P
[GUMP@vmgump-vm3]: Project easymock-parent (in module easymock) failed
[GUMP@vmgump-vm3]: Project compress-antlib-test (in module antlibs-compress) failed
[GUMP@vmgump-vm3]: Project test-ant (in module ant) failed
[GUMP@vmgump-vm3]: Project checkstyle (in module checkstyle) failed
*********************************************************** G U M P
[GUMP@vmgump-vm3]: Project easymock-parent (in module easymock) failed
To whom it may engage...
        
This is an automated request, but not an unsolicited one. For 
more information please visit http://gump.apache.org/nagged.html, 
and/or contact the folk at general@gump.apache.org.

Project easymock-parent has an issue affecting its community integration.
This issue affects 12 projects,
 and has been outstanding for 87 runs.
The current state of this project is 'Failed', with reason 'Build Failed'.
For reference only, the following projects are affected by this:
    - easymock :  EasyMock is a Java library that provides an easy way to use ...
    - easymock-parent :  EasyMock is a Java library that provides an easy way to use ...
    - tomcat-tc7.0.x-test-apr :  Tomcat 7.x, a web server implementing Java Servlet 3.0,
    ...
    - tomcat-tc7.0.x-test-bio :  Tomcat 7.x, a web server implementing Java Servlet 3.0,
    ...
    - tomcat-tc7.0.x-test-nio :  Tomcat 7.x, a web server implementing Java Servlet 3.0,
    ...
    - tomcat-tc8.0.x-test-apr :  Tomcat 8.x, a web server implementing the Java Servlet 3.1,
...
    - tomcat-tc8.0.x-test-bio :  Tomcat 8.x, a web server implementing the Java Servlet 3.1,
...
    - tomcat-tc8.0.x-test-nio :  Tomcat 8.x, a web server implementing the Java Servlet 3.1,
...
    - tomcat-tc8.0.x-test-nio2 :  Tomcat 8.x, a web server implementing the Java Servlet 3.1,
...
    - tomcat-trunk-test-apr :  Tomcat 9.x, a web server implementing the Java Servlet 4.0,
...
    - tomcat-trunk-test-nio :  Tomcat 9.x, a web server implementing the Java Servlet 4.0,
...
    - tomcat-trunk-test-nio2 :  Tomcat 9.x, a web server implementing the Java Servlet 4.0,
...


Full details are available at:
    http://vmgump-vm3.apache.org/easymock/easymock-parent/index.html

That said, some information snippets are provided here.

The following annotations (debug/informational/warning/error messages) were provided:
 -DEBUG- (Apache Gump generated) Apache Maven Settings in: /srv/gump/public/workspace/easymock/gump_mvn_settings.xml
 -INFO- Failed with reason build failed
 -DEBUG- Maven POM in: /srv/gump/public/workspace/easymock/pom.xml
 -INFO- Failed to extract fallback artifacts from Gump Repository



The following work was performed:
http://vmgump-vm3.apache.org/easymock/easymock-parent/gump_work/build_easymock_easymock-parent.html
Work Name: build_easymock_easymock-parent (Type: Build)
Work ended in a state of : Failed
Elapsed: 1 sec
Command Line: /opt/maven3/bin/mvn --batch-mode -Dpackaging=pom -DgroupId=org.easymock -Dfile=pom.xml
-DartifactId=easymock-parent -Dversion=3.5-SNAPSHOT --settings /srv/gump/public/workspace/easymock/gump_mvn_settings.xml
install:install-file 
[Working Directory: /srv/gump/public/workspace/easymock]
M2_HOME: /opt/maven3
---------------------------------------------
[INFO] Scanning for projects...
[INFO] Downloading: http://localhost:8192/maven2/org/apache/maven/wagon/wagon-ssh-external/1.0-beta-6/wagon-ssh-external-1.0-beta-6.pom
[ERROR] [ERROR] Some problems were encountered while processing the POMs:
[ERROR] Unresolveable build extension: Plugin org.apache.maven.wagon:wagon-ssh-external:1.0-beta-6
or one of its dependencies could not be resolved: Failed to read artifact descriptor for org.apache.maven.wagon:wagon-ssh-external:jar:1.0-beta-6
@ 
 @ 
[ERROR] The build could not read 1 project -> [Help 1]
[ERROR]   
[ERROR]   The project org.easymock:easymock-parent:3.5-SNAPSHOT (/srv/gump/public/workspace/easymock/pom.xml)
has 1 error
[ERROR]     Unresolveable build extension: Plugin org.apache.maven.wagon:wagon-ssh-external:1.0-beta-6
or one of its dependencies could not be resolved: Failed to read artifact descriptor for org.apache.maven.wagon:wagon-ssh-external:jar:1.0-beta-6:
Could not transfer artifact org.apache.maven.wagon:wagon-ssh-external:pom:1.0-beta-6 from/to
gump-central (http://localhost:8192/maven2): TransferFailedException: ClientProtocolException:
Status line contains invalid status code: HTTP/1.1 :01 :01 -> [Help 2]
[ERROR] 
[ERROR] To see the full stack trace of the errors, re-run Maven with the -e switch.
[ERROR] Re-run Maven using the -X switch to enable full debug logging.
[ERROR] 
[ERROR] For more information about the errors and possible solutions, please read the following
articles:
[ERROR] [Help 1] http://cwiki.apache.org/confluence/display/MAVEN/ProjectBuildingException
[ERROR] [Help 2] http://cwiki.apache.org/confluence/display/MAVEN/PluginManagerException
---------------------------------------------

To subscribe to this information via syndicated feeds:
- RSS: http://vmgump-vm3.apache.org/easymock/easymock-parent/rss.xml
- Atom: http://vmgump-vm3.apache.org/easymock/easymock-parent/atom.xml

============================== Gump Tracking Only ===
Produced by Apache Gump(TM) version 2.3.
Gump Run 20170406000011, vmgump-vm3.apache.org:vmgump:20170406000011
Gump E-mail Identifier (unique within run) #2.

*********************************************************** G U M P
[GUMP@vmgump-vm3]: Project compress-antlib-test (in module antlibs-compress) failed
To whom it may engage...
        
This is an automated request, but not an unsolicited one. For 
more information please visit http://gump.apache.org/nagged.html, 
and/or contact the folk at general@gump.apache.org.

Project compress-antlib-test has an issue affecting its community integration.
This issue affects 1 projects,
 and has been outstanding for 92 runs.
The current state of this project is 'Failed', with reason 'Build Failed'.
For reference only, the following projects are affected by this:
    - compress-antlib-test :  The Apache Compress Antlib contains tasks and resources that...


Full details are available at:
    http://vmgump-vm3.apache.org/antlibs-compress/compress-antlib-test/index.html

That said, some information snippets are provided here.

The following annotations (debug/informational/warning/error messages) were provided:
 -DEBUG- Dependency on ant exists, no need to add for property ant.home.
 -INFO- Failed with reason build failed



The following work was performed:
http://vmgump-vm3.apache.org/antlibs-compress/compress-antlib-test/gump_work/build_antlibs-compress_compress-antlib-test.html
Work Name: build_antlibs-compress_compress-antlib-test (Type: Build)
Work ended in a state of : Failed
Elapsed: 3 mins 34 secs
Command Line: /usr/lib/jvm/java-8-oracle/bin/java -Djava.awt.headless=true -Dbuild.sysclasspath=only
-Xbootclasspath/p:/srv/gump/public/workspace/xml-xerces2/build/xercesImpl.jar:/srv/gump/public/workspace/xml-commons/java/external/build/xml-apis.jar
org.apache.tools.ant.Main -Dgump.merge=/srv/gump/public/gump/work/merge.xml -Dant.home=/srv/gump/public/workspace/ant/dist
test 
[Working Directory: /srv/gump/public/workspace/antlibs-compress]
CLASSPATH: /usr/lib/jvm/java-8-oracle/lib/tools.jar:/srv/gump/public/workspace/antlibs-compress/ivy/ivy.jar:/srv/gump/public/workspace/antlibs-compress/build/ant-compress-20170406.jar:/srv/gump/public/workspace/ant/dist/lib/ant.jar:/srv/gump/public/workspace/ant/dist/lib/ant-launcher.jar:/srv/gump/public/workspace/ant/dist/lib/ant-jmf.jar:/srv/gump/public/workspace/ant/dist/lib/ant-junit.jar:/srv/gump/public/workspace/ant/dist/lib/ant-junit4.jar:/srv/gump/public/workspace/ant/dist/lib/ant-swing.jar:/srv/gump/public/workspace/ant/dist/lib/ant-apache-resolver.jar:/srv/gump/public/workspace/ant/dist/lib/ant-apache-xalan2.jar:/srv/gump/public/workspace/commons-compress/target/commons-compress-1.14-SNAPSHOT.jar:/srv/gump/public/workspace/xz-java/build/jar-20170406/xz.jar:/srv/gump/public/workspace/antlibs-antunit/build/ant-antunit-20170406.jar:/srv/gump/public/workspace/xml-commons/java/external/build/xml-apis-ext.jar
---------------------------------------------
[au:antunit] Target: testWithDirectories took 0.011 sec
[au:antunit] Target: testFullpath took 0.01 sec
[au:antunit] Target: testPreserve0Permissions took 0.011 sec
[au:antunit] Target: testForceCreateOfUpToDate took 4.017 sec
[au:antunit] Target: testNoDirectoriesByDefault took 0.01 sec
[au:antunit] Target: testPlainFileSet took 0.01 sec
[au:antunit] Target: testReplaceOfUpToDate took 4.008 sec
[au:antunit] Target: testCoreZipFileSet  FAILED
[au:antunit] 	at line 35, column 24
[au:antunit] 	Message: Assertion failed
[au:antunit] 	took 0.015 sec
[au:antunit] Target: testAntlibTarFileSet took 0.019 sec
[au:antunit] Target: testCreateOfOutOfDate took 4.018 sec
[au:antunit] Target: testFileSetPermissionsWin took 0.01 sec
[au:antunit] Target: testAddDuplicates took 0.005 sec
[au:antunit] Target: testRemoveLeadingSlashes took 0.011 sec
[au:antunit] Target: testPrefixWithSlash took 0.011 sec
[au:antunit] Target: testWithImplicitDirectories took 0.012 sec
[au:antunit] Target: testForceReplaceOfUpToDate took 4.018 sec
[au:antunit] Target: test0PermissionsGetReplaced took 0.01 sec
[au:antunit] Target: testFailDuplicates took 0.003 sec
[au:antunit] Build File: /srv/gump/public/workspace/antlibs-compress/src/tests/antunit/zipentry-test.xml
[au:antunit] Tests run: 3, Failures: 1, Errors: 0, Time elapsed: 0.019 sec
[au:antunit] Target: testResourceProperties  FAILED
[au:antunit] 	at line 59, column 20
[au:antunit] 	Message: Assertion failed
[au:antunit] 	took 0.01 sec
[au:antunit] Target: testUncompressSource took 0.004 sec
[au:antunit] Target: testZipSource took 0.002 sec
[au:antunit] Build File: /srv/gump/public/workspace/antlibs-compress/src/tests/antunit/zipfileset-test.xml
[au:antunit] Tests run: 9, Failures: 0, Errors: 0, Time elapsed: 0.081 sec
[au:antunit] Target: testSkipUnreadableEntries took 0.008 sec
[au:antunit] Target: testMissingArchive took 0.003 sec
[au:antunit] Target: testUncompressSource took 0.008 sec
[au:antunit] Target: test-refid-check-encoding took 0.002 sec
[au:antunit] Target: testZipSource took 0.004 sec
[au:antunit] Target: test-refid-modify took 0.033 sec
[au:antunit] Target: test-refid-check-prefix took 0.002 sec
[au:antunit] Target: testMissingArchiveDoesntMatter took 0.003 sec
[au:antunit] Target: testFailsOnUnreadableEntries took 0.008 sec
[au:antunit] Build File: /srv/gump/public/workspace/antlibs-compress/src/tests/antunit/zresource-test.xml
[au:antunit] Tests run: 1, Failures: 0, Errors: 0, Time elapsed: 0.02 sec
[au:antunit] Target: testNativeZ took 0.009 sec

test:

BUILD FAILED
/srv/gump/public/workspace/antlibs-compress/common/build.xml:209: At least one AntUnit test
has failed.

Total time: 3 minutes 34 seconds
---------------------------------------------

To subscribe to this information via syndicated feeds:
- RSS: http://vmgump-vm3.apache.org/antlibs-compress/compress-antlib-test/rss.xml
- Atom: http://vmgump-vm3.apache.org/antlibs-compress/compress-antlib-test/atom.xml

============================== Gump Tracking Only ===
Produced by Apache Gump(TM) version 2.3.
Gump Run 20170406000011, vmgump-vm3.apache.org:vmgump:20170406000011
Gump E-mail Identifier (unique within run) #3.

*********************************************************** G U M P
[GUMP@vmgump-vm3]: Project test-ant (in module ant) failed
To whom it may engage...
        
This is an automated request, but not an unsolicited one. For 
more information please visit http://gump.apache.org/nagged.html, 
and/or contact the folk at general@gump.apache.org.

Project test-ant has an issue affecting its community integration.
This issue affects 1 projects,
 and has been outstanding for 92 runs.
The current state of this project is 'Failed', with reason 'Build Failed'.
For reference only, the following projects are affected by this:
    - test-ant :  Java based build tool


Full details are available at:
    http://vmgump-vm3.apache.org/ant/test-ant/index.html

That said, some information snippets are provided here.

The following annotations (debug/informational/warning/error messages) were provided:
 -WARNING- Bad *Optional* Dependency. Project: bsh : unknown to *this* workspace
 -INFO- Failed with reason build failed



The following work was performed:
http://vmgump-vm3.apache.org/ant/test-ant/gump_work/build_ant_test-ant.html
Work Name: build_ant_test-ant (Type: Build)
Work ended in a state of : Failed
Elapsed: 7 mins 28 secs
Command Line: /usr/lib/jvm/java-8-oracle/bin/java -Djava.awt.headless=true -Dbuild.sysclasspath=only
-Xbootclasspath/p:/srv/gump/public/workspace/xml-xerces2/build/xercesImpl.jar:/srv/gump/public/workspace/xml-commons/java/external/build/xml-apis.jar:/srv/gump/public/workspace/xml-xalan/build/xalan-unbundled.jar:/srv/gump/public/workspace/xml-xalan/build/serializer.jar
org.apache.tools.ant.Main -Dgump.merge=/srv/gump/public/gump/work/merge.xml -Dtest.haltonfailure=false
-Dant.home=/srv/gump/public/workspace/ant/dist run-tests 
[Working Directory: /srv/gump/public/workspace/ant]
CLASSPATH: /usr/lib/jvm/java-8-oracle/lib/tools.jar:/srv/gump/public/workspace/ant/build/testcases:/srv/gump/public/workspace/ant/src/tests/junit:/srv/gump/public/workspace/ant/src/etc/testcases:/srv/gump/public/workspace/ant/src/etc/testcases/taskdefs/optional/out:/srv/gump/public/workspace/ant/src/tests/antunit/filters:/srv/gump/public/workspace/ant/src/tests/antunit/taskdefs/importtests:/srv/gump/public/workspace/ant/src/tests/antunit/filters/foo:/srv/gump/public/workspace/ant/src/tests/antunit/taskdefs/foo:/srv/gump/public/workspace/ant/build/antunit/tmp/testinput/build:/srv/gump/public/workspace/ant/build/antunit/tmp/testoutput:/srv/gump/public/workspace/ant/build/antunit/tmp/test.jar:/srv/gump/public/workspace/ant/build/antunit/tmp/test1.jar:/srv/gump/public/workspace/ant/build/antunit/tmp/test2.jar:/srv/gump/public/workspace/ant/build/antunit/tmp/test3.jar:/srv/gump/public/workspace/ant/build/antunit/tmp/test4.jar:/srv/gump/public/workspace/ant/build/antunit/tmp/test5.jar:/srv
 /gump/public/workspace/ant/build/antunit/tmp/resources:/srv/gump/public/workspace/ant/build/lib/ant.jar:/srv/gump/public/workspace/ant/build/lib/ant-launcher.jar:/srv/gump/public/workspace/ant/build/lib/ant-antlr.jar:/srv/gump/public/workspace/ant/build/lib/ant-apache-bcel.jar:/srv/gump/public/workspace/ant/build/lib/ant-apache-bsf.jar:/srv/gump/public/workspace/ant/build/lib/ant-apache-log4j.jar:/srv/gump/public/workspace/ant/build/lib/ant-apache-oro.jar:/srv/gump/public/workspace/ant/build/lib/ant-apache-regexp.jar:/srv/gump/public/workspace/ant/build/lib/ant-apache-resolver.jar:/srv/gump/public/workspace/ant/build/lib/ant-apache-xalan2.jar:/srv/gump/public/workspace/ant/build/lib/ant-commons-logging.jar:/srv/gump/public/workspace/ant/build/lib/ant-commons-net.jar:/srv/gump/public/workspace/ant/build/lib/ant-jai.jar:/srv/gump/public/workspace/ant/build/lib/ant-javamail.jar:/srv/gump/public/workspace/ant/build/lib/ant-jdepend.jar:/srv/gump/public/workspace/ant/build/lib/ant-jmf.jar
 :/srv/gump/public/workspace/ant/build/lib/ant-jsch.jar:/srv/gump/public/workspace/ant/build/lib/ant-junit.jar:/srv/gump/public/workspace/ant/build/lib/ant-junit4.jar:/srv/gump/public/workspace/ant/build/lib/ant-swing.jar:/srv/gump/public/workspace/ant/build/lib/ant-xz.jar:/srv/gump/packages/antlr/antlr-3.1.3.jar:/srv/gump/public/workspace/ant-contrib/lib/bcel/jars/bcel-5.1.jar:/srv/gump/public/workspace/apache-commons/logging/target/commons-logging-20170406.jar:/srv/gump/public/workspace/apache-commons/logging/target/commons-logging-api-20170406.jar:/srv/gump/public/workspace/apache-commons/net/target/commons-net-3.7-SNAPSHOT.jar:/srv/gump/public/workspace/apache-commons/net/target/commons-net-ftp-3.7-SNAPSHOT.jar:/srv/gump/packages/jaf-1.1ea/activation.jar:/srv/gump/public/workspace/jakarta-bsf/build/lib/bsf.jar:/srv/gump/packages/apache-attic/jakarta-regexp-1.5.jar:/srv/gump/public/workspace/jakarta-servletapi-5/jsr154/dist/lib/servlet-api.jar:/srv/gump/packages/javamail-1.4/mail.
 jar:/srv/gump/packages/javamail-1.4/lib/mailapi.jar:/srv/gump/packages/jdepend-2.6/lib/jdepend.jar:/srv/gump/packages/jsch/jsch-0.1.45.jar:/srv/gump/public/workspace/logging-log4j-12/target/log4j-1.2.18-SNAPSHOT.jar:/srv/gump/packages/apache-attic/oro-2.0.8.jar:/srv/gump/public/workspace/xz-java/build/jar-20170406/xz.jar:/srv/gump/public/workspace/antlibs-antunit/build/ant-antunit-20170406.jar:/srv/gump/packages/hamcrest/hamcrest-core-1.3.jar:/srv/gump/public/workspace/junit/target/junit-4.13-SNAPSHOT.jar:/srv/gump/public/workspace/xml-commons/java/external/build/xml-apis-ext.jar:/srv/gump/public/workspace/commons-codec-1.x/dist/commons-codec-20170406.jar
---------------------------------------------
[au:antunit] Build File: /srv/gump/public/workspace/ant/src/tests/antunit/types/selectors/modified-test.xml
[au:antunit] Tests run: 1, Failures: 0, Errors: 0, Time elapsed: 0.007 sec
[au:antunit] Target: testUpdate took 0.006 sec
[au:antunit] Build File: /srv/gump/public/workspace/ant/src/tests/antunit/types/selectors/ownedby-test.xml
[au:antunit] Tests run: 3, Failures: 0, Errors: 0, Time elapsed: 0.007 sec
[au:antunit] Target: testOwnedBy took 0.003 sec
[au:antunit] Target: testAsTrueConditions took 0 sec
[au:antunit] Target: testRequiresOwner took 0 sec
[au:antunit] Build File: /srv/gump/public/workspace/ant/src/tests/antunit/types/selectors/present-test.xml
[au:antunit] Tests run: 1, Failures: 0, Errors: 0, Time elapsed: 0.002 sec
[au:antunit] Target: testMapperByTypedef took 0.002 sec
[au:antunit] Build File: /srv/gump/public/workspace/ant/src/tests/antunit/types/selectors/readwrite-test.xml
[au:antunit] Tests run: 4, Failures: 0, Errors: 0, Time elapsed: 0.01 sec
[au:antunit] Target: testWritable took 0.001 sec
[au:antunit] Target: testAsConditions took 0.001 sec
[au:antunit] Target: testReadable took 0 sec
[au:antunit] Target: testUnwritable took 0 sec
[au:antunit] Build File: /srv/gump/public/workspace/ant/src/tests/antunit/types/selectors/select-test.xml
[au:antunit] Tests run: 4, Failures: 0, Errors: 0, Time elapsed: 0.016 sec
[au:antunit] Target: testIfFalse took 0.003 sec
[au:antunit] Target: testIfNotSet took 0.002 sec
[au:antunit] Target: testIfTrue took 0.002 sec
[au:antunit] Target: testIfSet took 0.002 sec
[au:antunit] Build File: /srv/gump/public/workspace/ant/src/tests/antunit/types/selectors/symlink-test.xml
[au:antunit] Tests run: 4, Failures: 0, Errors: 0, Time elapsed: 0.1 sec
[au:antunit] Target: testAsFalseConditions took 0.001 sec
[au:antunit] Target: testAsTrueConditions took 0.004 sec
[au:antunit] Target: testNoSymlink took 0 sec
[au:antunit] Target: testSymlink took 0.086 sec
[au:antunit] Build File: /srv/gump/public/workspace/ant/src/tests/antunit/types/tarfileset-test.xml
[au:antunit] Tests run: 3, Failures: 0, Errors: 0, Time elapsed: 0.011 sec
[au:antunit] Target: test-refid-check-encoding took 0.001 sec
[au:antunit] Target: testMissingArchive took 0 sec
[au:antunit] Target: testMissingArchiveDoesntMatter took 0 sec
[au:antunit] Build File: /srv/gump/public/workspace/ant/src/tests/antunit/types/zipfileset-test.xml
[au:antunit] Tests run: 5, Failures: 0, Errors: 0, Time elapsed: 0.016 sec
[au:antunit] Target: testMissingArchive took 0.001 sec
[au:antunit] Target: test-refid-check-encoding took 0.001 sec
[au:antunit] Target: test-refid-modify took 0.007 sec
[au:antunit] Target: test-refid-check-prefix took 0 sec
[au:antunit] Target: testMissingArchiveDoesntMatter took 0.001 sec

check-failed:

run-tests:

BUILD FAILED
/srv/gump/public/workspace/ant/build.xml:1618: Unit tests failed

Total time: 7 minutes 28 seconds
---------------------------------------------

To subscribe to this information via syndicated feeds:
- RSS: http://vmgump-vm3.apache.org/ant/test-ant/rss.xml
- Atom: http://vmgump-vm3.apache.org/ant/test-ant/atom.xml

============================== Gump Tracking Only ===
Produced by Apache Gump(TM) version 2.3.
Gump Run 20170406000011, vmgump-vm3.apache.org:vmgump:20170406000011
Gump E-mail Identifier (unique within run) #4.

*********************************************************** G U M P
[GUMP@vmgump-vm3]: Project checkstyle (in module checkstyle) failed
To whom it may engage...
        
This is an automated request, but not an unsolicited one. For 
more information please visit http://gump.apache.org/nagged.html, 
and/or contact the folk at general@gump.apache.org.

Project checkstyle has an issue affecting its community integration.
This issue affects 5 projects,
 and has been outstanding for 37 runs.
The current state of this project is 'Failed', with reason 'Build Failed'.
For reference only, the following projects are affected by this:
    - checkstyle :  Java style checker
    - tomcat-tc7.0.x-validate :  Tomcat 7.x, a web server implementing Java Servlet 3.0,
    ...
    - tomcat-tc8.0.x-validate :  Tomcat 8.x, a web server implementing the Java Servlet 3.1,
...
    - tomcat-trunk-validate :  Tomcat 9.x, a web server implementing the Java Servlet 4.0,
...
    - xmlgraphics-commons-test :  Apache XML Graphics Commons - Common Components for Batik
an...


Full details are available at:
    http://vmgump-vm3.apache.org/checkstyle/checkstyle/index.html

That said, some information snippets are provided here.

The following annotations (debug/informational/warning/error messages) were provided:
 -DEBUG- (Apache Gump generated) Apache Maven Settings in: /srv/gump/public/workspace/checkstyle/gump_mvn_settings.xml
 -INFO- Failed with reason build failed
 -DEBUG- Maven POM in: /srv/gump/public/workspace/checkstyle/pom.xml
 -INFO- Failed to extract fallback artifacts from Gump Repository



The following work was performed:
http://vmgump-vm3.apache.org/checkstyle/checkstyle/gump_work/build_checkstyle_checkstyle.html
Work Name: build_checkstyle_checkstyle (Type: Build)
Work ended in a state of : Failed
Elapsed: 3 mins 32 secs
Command Line: /opt/maven3/bin/mvn --batch-mode -Dcobertura.skip=true -DskipTests=true -Dfindbugs.skip=true
--settings /srv/gump/public/workspace/checkstyle/gump_mvn_settings.xml install 
[Working Directory: /srv/gump/public/workspace/checkstyle]
M2_HOME: /opt/maven3
---------------------------------------------
[INFO] Downloading: http://localhost:8192/maven2/org/antlr/antlr4-runtime/4.5.3/antlr4-runtime-4.5.3.pom
[INFO] Downloaded: http://localhost:8192/maven2/org/antlr/antlr4-runtime/4.5.3/antlr4-runtime-4.5.3.pom
(3 KB at 188.0 KB/sec)
[INFO] Downloading: https://oss.sonatype.org/content/repositories/codehaus-snapshots/org/antlr/antlr4-master/4.5.3/antlr4-master-4.5.3.pom
[INFO] Downloading: http://sevntu-checkstyle.github.io/sevntu.checkstyle/maven2/org/antlr/antlr4-master/4.5.3/antlr4-master-4.5.3.pom
[INFO] Downloading: http://localhost:8192/maven2/org/antlr/antlr4-master/4.5.3/antlr4-master-4.5.3.pom
[INFO] Downloaded: http://localhost:8192/maven2/org/antlr/antlr4-master/4.5.3/antlr4-master-4.5.3.pom
(4 KB at 299.7 KB/sec)
[INFO] Downloading: https://oss.sonatype.org/content/repositories/codehaus-snapshots/com/puppycrawl/tools/checkstyle/7.6.1/checkstyle-7.6.1.pom
[INFO] Downloading: http://sevntu-checkstyle.github.io/sevntu.checkstyle/maven2/com/puppycrawl/tools/checkstyle/7.6.1/checkstyle-7.6.1.pom
[INFO] Downloading: http://localhost:8192/maven2/com/puppycrawl/tools/checkstyle/7.6.1/checkstyle-7.6.1.pom
[INFO] Downloaded: http://localhost:8192/maven2/com/puppycrawl/tools/checkstyle/7.6.1/checkstyle-7.6.1.pom
(68 KB at 4796.2 KB/sec)
[INFO] Downloading: https://oss.sonatype.org/content/repositories/codehaus-snapshots/org/antlr/antlr4-runtime/4.6/antlr4-runtime-4.6.pom
[INFO] Downloading: http://sevntu-checkstyle.github.io/sevntu.checkstyle/maven2/org/antlr/antlr4-runtime/4.6/antlr4-runtime-4.6.pom
[INFO] Downloading: http://localhost:8192/maven2/org/antlr/antlr4-runtime/4.6/antlr4-runtime-4.6.pom
[INFO] Downloaded: http://localhost:8192/maven2/org/antlr/antlr4-runtime/4.6/antlr4-runtime-4.6.pom
(4 KB at 285.3 KB/sec)
[INFO] Downloading: https://oss.sonatype.org/content/repositories/codehaus-snapshots/org/antlr/antlr4-master/4.6/antlr4-master-4.6.pom
[INFO] Downloading: http://sevntu-checkstyle.github.io/sevntu.checkstyle/maven2/org/antlr/antlr4-master/4.6/antlr4-master-4.6.pom
[INFO] Downloading: http://localhost:8192/maven2/org/antlr/antlr4-master/4.6/antlr4-master-4.6.pom
[INFO] Downloaded: http://localhost:8192/maven2/org/antlr/antlr4-master/4.6/antlr4-master-4.6.pom
(5 KB at 343.8 KB/sec)
[INFO] Downloading: https://oss.sonatype.org/content/repositories/codehaus-snapshots/com/github/sevntu/checkstyle/sevntu-checkstyle-maven-plugin/1.23.1/sevntu-checkstyle-maven-plugin-1.23.1.jar
[INFO] Downloading: https://oss.sonatype.org/content/repositories/codehaus-snapshots/com/github/sevntu/checkstyle/sevntu-checks/1.23.1/sevntu-checks-1.23.1.jar
[INFO] Downloading: https://oss.sonatype.org/content/repositories/codehaus-snapshots/com/puppycrawl/tools/checkstyle/7.6.1/checkstyle-7.6.1.jar
[INFO] Downloading: https://oss.sonatype.org/content/repositories/codehaus-snapshots/org/antlr/antlr4-runtime/4.6/antlr4-runtime-4.6.jar
[INFO] Downloading: http://sevntu-checkstyle.github.io/sevntu.checkstyle/maven2/com/github/sevntu/checkstyle/sevntu-checkstyle-maven-plugin/1.23.1/sevntu-checkstyle-maven-plugin-1.23.1.jar
[INFO] Downloading: http://sevntu-checkstyle.github.io/sevntu.checkstyle/maven2/com/github/sevntu/checkstyle/sevntu-checks/1.23.1/sevntu-checks-1.23.1.jar
[INFO] Downloading: http://sevntu-checkstyle.github.io/sevntu.checkstyle/maven2/com/puppycrawl/tools/checkstyle/7.6.1/checkstyle-7.6.1.jar
[INFO] Downloading: http://sevntu-checkstyle.github.io/sevntu.checkstyle/maven2/org/antlr/antlr4-runtime/4.6/antlr4-runtime-4.6.jar
[INFO] Downloaded: http://sevntu-checkstyle.github.io/sevntu.checkstyle/maven2/com/github/sevntu/checkstyle/sevntu-checkstyle-maven-plugin/1.23.1/sevntu-checkstyle-maven-plugin-1.23.1.jar
(3 KB at 12.6 KB/sec)
[INFO] Downloaded: http://sevntu-checkstyle.github.io/sevntu.checkstyle/maven2/com/github/sevntu/checkstyle/sevntu-checks/1.23.1/sevntu-checks-1.23.1.jar
(161 KB at 591.2 KB/sec)
[INFO] Downloading: http://localhost:8192/maven2/com/puppycrawl/tools/checkstyle/7.6.1/checkstyle-7.6.1.jar
[INFO] Downloading: http://localhost:8192/maven2/org/antlr/antlr4-runtime/4.6/antlr4-runtime-4.6.jar
[INFO] Downloaded: http://localhost:8192/maven2/org/antlr/antlr4-runtime/4.6/antlr4-runtime-4.6.jar
(302 KB at 3072.3 KB/sec)
[INFO] Downloaded: http://localhost:8192/maven2/com/puppycrawl/tools/checkstyle/7.6.1/checkstyle-7.6.1.jar
(1183 KB at 10748.2 KB/sec)
[INFO] 
[INFO] --- maven-checkstyle-plugin:2.17:check (checkstyle-non-main-check) @ checkstyle ---
[INFO] There is 1 error reported by Checkstyle 7.6.1 with /srv/gump/public/workspace/checkstyle/config/checkstyle_non_main_files_checks.xml
ruleset.
[ERROR] gump_mvn_settings.xml:[0] (misc) NewlineAtEndOfFile: File does not end with a newline.
[INFO] ------------------------------------------------------------------------
[INFO] BUILD FAILURE
[INFO] ------------------------------------------------------------------------
[INFO] Total time: 03:30 min
[INFO] Finished at: 2017-04-06T01:09:45+00:00
[INFO] Final Memory: 51M/460M
[INFO] ------------------------------------------------------------------------
[ERROR] Failed to execute goal org.apache.maven.plugins:maven-checkstyle-plugin:2.17:check
(checkstyle-non-main-check) on project checkstyle: You have 1 Checkstyle violation. ->
[Help 1]
[ERROR] 
[ERROR] To see the full stack trace of the errors, re-run Maven with the -e switch.
[ERROR] Re-run Maven using the -X switch to enable full debug logging.
[ERROR] 
[ERROR] For more information about the errors and possible solutions, please read the following
articles:
[ERROR] [Help 1] http://cwiki.apache.org/confluence/display/MAVEN/MojoFailureException
---------------------------------------------

To subscribe to this information via syndicated feeds:
- RSS: http://vmgump-vm3.apache.org/checkstyle/checkstyle/rss.xml
- Atom: http://vmgump-vm3.apache.org/checkstyle/checkstyle/atom.xml

============================== Gump Tracking Only ===
Produced by Apache Gump(TM) version 2.3.
Gump Run 20170406000011, vmgump-vm3.apache.org:vmgump:20170406000011
Gump E-mail Identifier (unique within run) #5.


--
Apache Gump
http://gump.apache.org/ [Instance: vmgump-vm3]

---------------------------------------------------------------------
To unsubscribe, e-mail: general-unsubscribe@gump.apache.org
For additional commands, e-mail: general-help@gump.apache.org


Mime
View raw message