gump-general mailing list archives

Site index · List index
Message view « Date » · « Thread »
Top « Date » · « Thread »
Subject BATCH: All dressed up, with nowhere to go...
Date Thu, 06 Apr 2017 10:25:02 GMT
Dear Gumpmeisters,
The following 1 notifys should have been sent

*********************************************************** G U M P
[GUMP@vmgump-vm3]: Project checkstyle (in module checkstyle) failed
*********************************************************** G U M P
[GUMP@vmgump-vm3]: Project checkstyle (in module checkstyle) failed
To whom it may engage...
This is an automated request, but not an unsolicited one. For 
more information please visit, 
and/or contact the folk at

Project checkstyle has an issue affecting its community integration.
This issue affects 5 projects.
The current state of this project is 'Failed', with reason 'Build Failed'.
For reference only, the following projects are affected by this:
    - checkstyle :  Java style checker
    - tomcat-tc7.0.x-validate :  Tomcat 7.x, a web server implementing Java Servlet 3.0,
    - tomcat-tc8.0.x-validate :  Tomcat 8.x, a web server implementing the Java Servlet 3.1,
    - tomcat-trunk-validate :  Tomcat 9.x, a web server implementing the Java Servlet 4.0,
    - xmlgraphics-commons-test :  Apache XML Graphics Commons - Common Components for Batik

Full details are available at:

That said, some information snippets are provided here.

The following annotations (debug/informational/warning/error messages) were provided:
 -DEBUG- (Apache Gump generated) Apache Maven Settings in: /srv/gump/public/workspace/checkstyle/gump_mvn_settings.xml
 -INFO- Failed with reason build failed
 -DEBUG- Maven POM in: /srv/gump/public/workspace/checkstyle/pom.xml
 -INFO- Failed to extract fallback artifacts from Gump Repository

The following work was performed:
Work Name: build_checkstyle_checkstyle (Type: Build)
Work ended in a state of : Failed
Elapsed: 3 mins 35 secs
Command Line: /opt/maven3/bin/mvn --batch-mode -Dcobertura.skip=true -DskipTests=true -Dfindbugs.skip=true
--settings /srv/gump/public/workspace/checkstyle/gump_mvn_settings.xml install 
[Working Directory: /srv/gump/public/workspace/checkstyle]
M2_HOME: /opt/maven3
[INFO] Downloading: http://localhost:8192/maven2/org/antlr/antlr4-runtime/4.5.3/antlr4-runtime-4.5.3.pom
[INFO] Downloaded: http://localhost:8192/maven2/org/antlr/antlr4-runtime/4.5.3/antlr4-runtime-4.5.3.pom
(3 KB at 150.4 KB/sec)
[INFO] Downloading:
[INFO] Downloading:
[INFO] Downloading: http://localhost:8192/maven2/org/antlr/antlr4-master/4.5.3/antlr4-master-4.5.3.pom
[INFO] Downloaded: http://localhost:8192/maven2/org/antlr/antlr4-master/4.5.3/antlr4-master-4.5.3.pom
(4 KB at 299.7 KB/sec)
[INFO] Downloading:
[INFO] Downloading:
[INFO] Downloading: http://localhost:8192/maven2/com/puppycrawl/tools/checkstyle/7.6.1/checkstyle-7.6.1.pom
[INFO] Downloaded: http://localhost:8192/maven2/com/puppycrawl/tools/checkstyle/7.6.1/checkstyle-7.6.1.pom
(68 KB at 4796.2 KB/sec)
[INFO] Downloading:
[INFO] Downloading:
[INFO] Downloading: http://localhost:8192/maven2/org/antlr/antlr4-runtime/4.6/antlr4-runtime-4.6.pom
[INFO] Downloaded: http://localhost:8192/maven2/org/antlr/antlr4-runtime/4.6/antlr4-runtime-4.6.pom
(4 KB at 285.3 KB/sec)
[INFO] Downloading:
[INFO] Downloading:
[INFO] Downloading: http://localhost:8192/maven2/org/antlr/antlr4-master/4.6/antlr4-master-4.6.pom
[INFO] Downloaded: http://localhost:8192/maven2/org/antlr/antlr4-master/4.6/antlr4-master-4.6.pom
(5 KB at 375.0 KB/sec)
[INFO] Downloading:
[INFO] Downloading:
[INFO] Downloading:
[INFO] Downloading:
[INFO] Downloading:
[INFO] Downloading:
[INFO] Downloading:
[INFO] Downloading:
[INFO] Downloaded:
(3 KB at 13.0 KB/sec)
[INFO] Downloaded:
(161 KB at 869.2 KB/sec)
[INFO] Downloading: http://localhost:8192/maven2/org/antlr/antlr4-runtime/4.6/antlr4-runtime-4.6.jar
[INFO] Downloading: http://localhost:8192/maven2/com/puppycrawl/tools/checkstyle/7.6.1/checkstyle-7.6.1.jar
[INFO] Downloaded: http://localhost:8192/maven2/org/antlr/antlr4-runtime/4.6/antlr4-runtime-4.6.jar
(302 KB at 12545.4 KB/sec)
[INFO] Downloaded: http://localhost:8192/maven2/com/puppycrawl/tools/checkstyle/7.6.1/checkstyle-7.6.1.jar
(1183 KB at 34773.6 KB/sec)
[INFO] --- maven-checkstyle-plugin:2.17:check (checkstyle-non-main-check) @ checkstyle ---
[INFO] There is 1 error reported by Checkstyle 7.6.1 with /srv/gump/public/workspace/checkstyle/config/checkstyle_non_main_files_checks.xml
[ERROR] gump_mvn_settings.xml:[0] (misc) NewlineAtEndOfFile: File does not end with a newline.
[INFO] ------------------------------------------------------------------------
[INFO] ------------------------------------------------------------------------
[INFO] Total time: 03:34 min
[INFO] Finished at: 2017-04-06T07:12:47+00:00
[INFO] Final Memory: 52M/443M
[INFO] ------------------------------------------------------------------------
[ERROR] Failed to execute goal org.apache.maven.plugins:maven-checkstyle-plugin:2.17:check
(checkstyle-non-main-check) on project checkstyle: You have 1 Checkstyle violation. ->
[Help 1]
[ERROR] To see the full stack trace of the errors, re-run Maven with the -e switch.
[ERROR] Re-run Maven using the -X switch to enable full debug logging.
[ERROR] For more information about the errors and possible solutions, please read the following
[ERROR] [Help 1]

To subscribe to this information via syndicated feeds:
- RSS:
- Atom:

============================== Gump Tracking Only ===
Produced by Apache Gump(TM) version 2.3.
Gump Run 20170406060005,
Gump E-mail Identifier (unique within run) #1.

Apache Gump [Instance: vmgump-vm3]

To unsubscribe, e-mail:
For additional commands, e-mail:

View raw message